;Fourier;Fourier;one;one;one
;DFT;daily
;current;Fourier
;Fourier;x_0;X_0
;1;1;1;1;1;0;0;1;k;1;1;DC;1;k;0;0;1;1;1;DC
;4


;x_3



;1;2-i;-1;+2


;.1
;2;0;0;4;1;2;0;1;4;2-i;2;0;2;4;2;0;3;4;+2;2
;2;1;0;4;1;2;1;1;4;2-i;2;1;2;4;2;1;3;4;+2;-2-2i
;2;2;0;4;1;2;2;1;4;2-i;2;2;2;4;2;2;3;4;+2;-2
;2;3;0;4;1;2;3;1;4;2-i;2;3;2;4;2;3;3;4;+2;4;+4









;2

;-2
;4;+4


;Fourier

;0;N-dimensional;DFT;IDFT











;https://jackschaedler.github.io/circles-sines-signals/


;http://ccrma.stanford.edu/~jos/mdft/mdft.html;Julius O. Smith III
;http://www.fftw.org;General;GPL
;http://www.kurims.kyoto-u.ac.jp/~ooura/fft.html;General
;http://web.mit.edu/newsoffice/2009/explained-fourier.html






