{
  "metadata_curator": [],
  "described_entity": {
    "entity_type": "Person",
    "surname": {
        "en": "Labropoulou"
      },
      "given_name": {
        "en": "Penny"
      },
      "personal_identifier": [
        {
          "personal_identifier_scheme": "http://purl.org/spar/datacite/orcid",
          "value": "0000-0001-5123-7890"
        }
      ],
      "email": [
        "penny@athenarc.gr"
      ]
  }
}