<svg width="64" height="64" viewBox="0 0 64 64" fill="none" xmlns="http://www.w3.org/2000/svg">
<path d="M32.5 11.5V38.5" stroke="#EBB447" stroke-width="3" stroke-miterlimit="10" stroke-linecap="round" stroke-linejoin="round"/>
<path d="M56.5 10.5H62.5V58.5H2.5V10.5H8.5" stroke="#EBB447" stroke-width="3" stroke-miterlimit="10" stroke-linecap="round" stroke-linejoin="round"/>
<path d="M32.5 11.5C25.75 6.417 16.833 4.5 8.5 4.5C8.5 9.333 8.5 45.5 8.5 45.5C16.833 45.5 25.75 47.417 32.5 52.5C39.25 47.417 48.167 45.5 56.5 45.5C56.5 45.5 56.5 9.333 56.5 4.5C48.167 4.5 39.25 6.417 32.5 11.5Z" stroke="#EBB447" stroke-width="3" stroke-miterlimit="10" stroke-linecap="round" stroke-linejoin="round"/>
</svg>
