<svg width="64" height="64" viewBox="0 0 64 64" fill="none" xmlns="http://www.w3.org/2000/svg">
<path d="M25.5 50.5V54.5L9.5 50.5V45.5" stroke="#25C58F" stroke-width="3" stroke-miterlimit="10" stroke-linecap="round" stroke-linejoin="round"/>
<path d="M54.5 29.5H62.5" stroke="#25C58F" stroke-width="3" stroke-miterlimit="10" stroke-linecap="round" stroke-linejoin="round"/>
<path d="M51.5 19.5L58.5 15.5" stroke="#25C58F" stroke-width="3" stroke-miterlimit="10" stroke-linecap="round" stroke-linejoin="round"/>
<path d="M51.5 39.5L58.5 43.5" stroke="#25C58F" stroke-width="3" stroke-miterlimit="10" stroke-linecap="round" stroke-linejoin="round"/>
<path d="M44.5 50.5L6.126 39.536C5.08127 39.2374 4.16223 38.6066 3.50798 37.7391C2.85374 36.8716 2.49989 35.8146 2.5 34.728V24.272C2.49989 23.1854 2.85374 22.1284 3.50798 21.2609C4.16223 20.3934 5.08127 19.7626 6.126 19.464L44.5 8.5V50.5Z" stroke="#25C58F" stroke-width="3" stroke-miterlimit="10" stroke-linecap="round" stroke-linejoin="round"/>
</svg>
