<svg width="64" height="64" viewBox="0 0 64 64" fill="none" xmlns="http://www.w3.org/2000/svg">
<path d="M50.5 18.5H57.5C58.8261 18.5 60.0979 19.0268 61.0355 19.9645C61.9732 20.9021 62.5 22.1739 62.5 23.5V43.5C62.5 44.1566 62.3707 44.8068 62.1194 45.4134C61.8681 46.02 61.4998 46.5712 61.0355 47.0355C60.5712 47.4998 60.02 47.8681 59.4134 48.1194C58.8068 48.3707 58.1566 48.5 57.5 48.5H54.5V58.5L40.5 48.5H28.5" stroke="#EBB447" stroke-width="3" stroke-miterlimit="10" stroke-linecap="round" stroke-linejoin="round"/>
<path d="M45.5 5.5H7.5C6.17392 5.5 4.90215 6.02678 3.96447 6.96447C3.02678 7.90215 2.5 9.17392 2.5 10.5V33.5C2.5 34.8261 3.02678 36.0979 3.96447 37.0355C4.90215 37.9732 6.17392 38.5 7.5 38.5H12.5V52.5L28.5 38.5H45.5C46.8261 38.5 48.0979 37.9732 49.0355 37.0355C49.9732 36.0979 50.5 34.8261 50.5 33.5V10.5C50.5 9.17392 49.9732 7.90215 49.0355 6.96447C48.0979 6.02678 46.8261 5.5 45.5 5.5Z" stroke="#EBB447" stroke-width="3" stroke-miterlimit="10" stroke-linecap="round" stroke-linejoin="round"/>
</svg>
