<?xml version="1.0" encoding="UTF-8" standalone="no"?>
<svg
   xmlns:dc="http://purl.org/dc/elements/1.1/"
   xmlns:cc="http://creativecommons.org/ns#"
   xmlns:rdf="http://www.w3.org/1999/02/22-rdf-syntax-ns#"
   xmlns:svg="http://www.w3.org/2000/svg"
   xmlns="http://www.w3.org/2000/svg"
   viewBox="0 0 413.25333 140.60001"
   height="140.60001"
   width="413.25333"
   xml:space="preserve"
   id="svg2"
   version="1.1"><metadata
     id="metadata8"><rdf:RDF><cc:Work
         rdf:about=""><dc:format>image/svg+xml</dc:format><dc:type
           rdf:resource="http://purl.org/dc/dcmitype/StillImage" /></cc:Work></rdf:RDF></metadata><defs
     id="defs6"><clipPath
       id="clipPath54"
       clipPathUnits="userSpaceOnUse"><path
         id="path52"
         d="m 2240.72,374.301 c -43.2,-60.645 -111.35,-102.27 -189.53,-109.699 8.31,-0.782 16.73,-1.192 25.25,-1.192 88.64,0 167,43.801 214.8,110.891 z m -189.53,415.152 c 8.31,0.793 16.73,1.199 25.25,1.199 88.64,0 166.99,-43.8 214.78,-110.89 h -50.5 c -43.2,60.644 -111.36,102.265 -189.53,109.691 z m 313.63,-524.851 c 8.31,-0.782 16.73,-1.192 25.24,-1.192 145.6,0 263.63,118.028 263.63,263.621 0,145.594 -118.03,263.621 -263.63,263.621 -8.51,0 -16.93,-0.406 -25.24,-1.199 133.74,-12.707 238.37,-125.344 238.37,-262.422 0,-137.078 -104.63,-249.715 -238.37,-262.429 z m 104.3,340.757 v -196.05 c 17.72,35.437 27.75,75.402 27.75,117.722 0,27.274 -4.14,53.582 -11.83,78.328 z M 2397.57,374.301 C 2354.38,313.645 2286.19,272.031 2208,264.602 c 8.31,-0.782 16.73,-1.192 25.26,-1.192 88.64,0 167,43.801 214.79,110.891 z M 2208,789.453 c 8.31,0.793 16.73,1.199 25.26,1.199 88.64,0 167,-43.8 214.79,-110.89 h -50.48 C 2354.38,740.41 2286.19,782.027 2208,789.453 Z" /></clipPath></defs><g
     transform="matrix(1.3333333,0,0,-1.3333333,0,140.6)"
     id="g10"><g
       transform="scale(0.1)"
       id="g12"><path
         id="path14"
         style="fill:#777475;fill-opacity:1;fill-rule:nonzero;stroke:none"
         d="m 469.785,276.105 c 3.848,0 7.262,0.704 10.238,2.122 2.981,1.406 5.481,3.328 7.5,5.761 2.02,2.442 3.555,5.262 4.618,8.465 1.05,3.203 1.586,6.633 1.586,10.285 0,2.5 -0.274,4.754 -0.821,6.778 -0.543,2.019 -1.426,3.765 -2.64,5.242 -1.223,1.476 -2.778,2.609 -4.664,3.406 -1.891,0.805 -4.184,1.203 -6.875,1.203 h -11.344 l -9.231,-43.262 z m 9.903,55.958 c 9.675,0 16.953,-2.325 21.82,-6.973 4.875,-4.649 7.308,-11.231 7.308,-19.754 0,-5.957 -0.832,-11.508 -2.5,-16.633 -1.668,-5.129 -4.148,-9.57 -7.449,-13.32 -3.301,-3.75 -7.437,-6.68 -12.402,-8.789 -4.965,-2.117 -10.75,-3.172 -17.356,-3.172 h -28.644 l 14.418,68.641 h 24.805" /><path
         id="path16"
         style="fill:#777475;fill-opacity:1;fill-rule:nonzero;stroke:none"
         d="m 550.258,297.406 c -0.223,1.25 -0.656,2.379 -1.297,3.407 -0.641,1.027 -1.574,1.843 -2.789,2.453 -1.215,0.613 -2.82,0.918 -4.805,0.918 -1.926,0 -3.625,-0.293 -5.097,-0.871 -1.473,-0.575 -2.754,-1.348 -3.844,-2.305 -1.094,-0.969 -2.004,-2.078 -2.738,-3.367 -0.743,-1.282 -1.364,-2.629 -1.875,-4.036 h 22.785 c 0,1.282 -0.114,2.551 -0.34,3.801 z m -23.985,-13.32 c 0,-0.258 0,-0.512 0,-0.762 v -1.25 c 0,-2.89 0.895,-5.226 2.692,-7.023 1.793,-1.797 4.551,-2.696 8.265,-2.696 1.348,0 2.551,0.215 3.606,0.625 1.059,0.422 1.984,0.95 2.785,1.594 0.805,0.633 1.512,1.375 2.121,2.207 0.606,0.828 1.168,1.629 1.68,2.403 h 13.652 c -1.09,-2.825 -2.375,-5.286 -3.847,-7.403 -1.473,-2.109 -3.239,-3.886 -5.286,-5.332 -2.054,-1.445 -4.441,-2.519 -7.16,-3.222 -2.726,-0.704 -5.886,-1.055 -9.472,-1.055 -3.332,0 -6.364,0.445 -9.082,1.348 -2.727,0.886 -5.051,2.253 -6.973,4.082 -1.918,1.824 -3.414,4.082 -4.469,6.777 -1.058,2.695 -1.586,5.828 -1.586,9.422 0,3.976 0.641,7.804 1.922,11.484 1.281,3.692 3.094,6.953 5.43,9.805 2.34,2.851 5.207,5.129 8.605,6.824 3.399,1.703 7.211,2.551 11.442,2.551 3.461,0 6.613,-0.449 9.468,-1.348 2.848,-0.898 5.286,-2.254 7.305,-4.082 2.02,-1.824 3.59,-4.101 4.715,-6.824 1.117,-2.727 1.68,-5.883 1.68,-9.473 0,-2.433 -0.254,-5.031 -0.77,-7.785 h -36.629 c -0.062,-0.32 -0.094,-0.613 -0.094,-0.867" /><path
         id="path18"
         style="fill:#777475;fill-opacity:1;fill-rule:nonzero;stroke:none"
         d="m 602.473,313.117 -2.118,-9.129 h -9.71 l -5.094,-24.707 c -0.129,-0.519 -0.231,-0.976 -0.293,-1.398 -0.063,-0.41 -0.09,-0.711 -0.09,-0.906 0,-0.903 0.141,-1.594 0.43,-2.071 0.285,-0.48 0.656,-0.851 1.105,-1.105 0.445,-0.254 0.942,-0.399 1.488,-0.43 0.543,-0.039 1.079,-0.047 1.59,-0.047 1.664,0 3.301,0.098 4.903,0.281 l -2.313,-10.476 c -1.402,-0.129 -2.816,-0.234 -4.226,-0.332 -1.411,-0.098 -2.852,-0.149 -4.329,-0.149 -1.597,0 -3.187,0.149 -4.753,0.43 -1.575,0.293 -2.985,0.801 -4.235,1.543 -1.25,0.734 -2.238,1.746 -2.976,3.027 -0.739,1.282 -1.075,2.95 -1.012,5 0,0.633 0.062,1.36 0.195,2.161 0.125,0.8 0.289,1.648 0.481,2.546 l 5.574,26.633 h -8.942 l 2.118,9.129 h 8.75 l 3.074,15.098 h 13.652 l -3.074,-15.098 h 9.805" /><path
         id="path20"
         style="fill:#777475;fill-opacity:1;fill-rule:nonzero;stroke:none"
         d="m 638.246,297.406 c -0.223,1.25 -0.656,2.379 -1.297,3.407 -0.64,1.027 -1.574,1.843 -2.789,2.453 -1.215,0.613 -2.82,0.918 -4.805,0.918 -1.921,0 -3.625,-0.293 -5.097,-0.871 -1.477,-0.575 -2.754,-1.348 -3.844,-2.305 -1.094,-0.969 -2.008,-2.078 -2.738,-3.367 -0.742,-1.282 -1.363,-2.629 -1.875,-4.036 h 22.785 c 0,1.282 -0.113,2.551 -0.34,3.801 z m -23.984,-13.32 c 0,-0.258 0,-0.512 0,-0.762 v -1.25 c 0,-2.89 0.894,-5.226 2.691,-7.023 1.793,-1.797 4.551,-2.696 8.266,-2.696 1.347,0 2.551,0.215 3.605,0.625 1.059,0.422 1.989,0.95 2.785,1.594 0.801,0.633 1.512,1.375 2.121,2.207 0.606,0.828 1.168,1.629 1.68,2.403 h 13.653 c -1.09,-2.825 -2.375,-5.286 -3.848,-7.403 -1.477,-2.109 -3.238,-3.886 -5.281,-5.332 -2.059,-1.445 -4.446,-2.519 -7.164,-3.222 -2.727,-0.704 -5.883,-1.055 -9.473,-1.055 -3.332,0 -6.363,0.445 -9.082,1.348 -2.727,0.886 -5.051,2.253 -6.973,4.082 -1.922,1.824 -3.414,4.082 -4.469,6.777 -1.058,2.695 -1.585,5.828 -1.585,9.422 0,3.976 0.636,7.804 1.921,11.484 1.282,3.692 3.09,6.953 5.43,9.805 2.34,2.851 5.207,5.129 8.606,6.824 3.398,1.703 7.21,2.551 11.441,2.551 3.461,0 6.613,-0.449 9.473,-1.348 2.839,-0.898 5.281,-2.254 7.3,-4.082 2.02,-1.824 3.59,-4.101 4.715,-6.824 1.117,-2.727 1.68,-5.883 1.68,-9.473 0,-2.433 -0.254,-5.031 -0.77,-7.785 h -36.629 c -0.062,-0.32 -0.093,-0.613 -0.093,-0.867" /><path
         id="path22"
         style="fill:#777475;fill-opacity:1;fill-rule:nonzero;stroke:none"
         d="m 691.078,302.258 c -1.504,1.277 -3.793,1.926 -6.867,1.926 -2.57,0 -4.746,-0.696 -6.539,-2.071 -1.797,-1.379 -3.238,-3.125 -4.328,-5.234 -1.094,-2.121 -1.875,-4.414 -2.36,-6.875 -0.476,-2.473 -0.714,-4.766 -0.714,-6.875 0,-1.477 0.156,-2.871 0.476,-4.18 0.324,-1.32 0.863,-2.453 1.637,-3.418 0.765,-0.957 1.742,-1.73 2.93,-2.304 1.187,-0.579 2.648,-0.872 4.375,-0.872 1.539,0 2.902,0.254 4.085,0.774 1.188,0.508 2.243,1.18 3.176,2.019 0.926,0.832 1.696,1.805 2.305,2.93 0.609,1.121 1.105,2.293 1.488,3.508 h 13.653 c -2.051,-6.215 -5.207,-11.008 -9.469,-14.367 -4.262,-3.367 -9.66,-5.047 -16.199,-5.047 -6.985,0 -12.418,1.707 -16.293,5.137 -3.879,3.425 -5.817,8.796 -5.817,16.101 0,4.238 0.625,8.223 1.875,11.973 1.25,3.75 3.074,7.051 5.477,9.902 2.402,2.852 5.34,5.098 8.801,6.731 3.457,1.629 7.429,2.449 11.918,2.449 3.011,0 5.863,-0.352 8.554,-1.055 2.696,-0.703 5.051,-1.797 7.071,-3.269 2.015,-1.477 3.617,-3.399 4.804,-5.774 1.188,-2.363 1.813,-5.183 1.875,-8.457 H 693.34 c 0,2.949 -0.75,5.07 -2.262,6.348" /><path
         id="path24"
         style="fill:#777475;fill-opacity:1;fill-rule:nonzero;stroke:none"
         d="m 745.313,313.117 -2.114,-9.129 h -9.715 l -5.089,-24.707 c -0.133,-0.519 -0.231,-0.976 -0.293,-1.398 -0.067,-0.41 -0.094,-0.711 -0.094,-0.906 0,-0.903 0.14,-1.594 0.43,-2.071 0.289,-0.48 0.66,-0.851 1.109,-1.105 0.441,-0.254 0.941,-0.399 1.488,-0.43 0.543,-0.039 1.074,-0.047 1.586,-0.047 1.664,0 3.301,0.098 4.902,0.281 l -2.308,-10.476 c -1.406,-0.129 -2.817,-0.234 -4.231,-0.332 -1.41,-0.098 -2.847,-0.149 -4.324,-0.149 -1.601,0 -3.187,0.149 -4.758,0.43 -1.57,0.293 -2.98,0.801 -4.23,1.543 -1.25,0.734 -2.242,1.746 -2.981,3.027 -0.738,1.282 -1.074,2.95 -1.007,5 0,0.633 0.062,1.36 0.195,2.161 0.125,0.8 0.285,1.648 0.476,2.546 l 5.579,26.633 h -8.942 l 2.113,9.129 h 8.75 l 3.079,15.098 h 13.652 l -3.078,-15.098 h 9.805" /><path
         id="path26"
         style="fill:#777475;fill-opacity:1;fill-rule:nonzero;stroke:none"
         d="m 796.973,285.383 c -1.989,-0.227 -3.977,-0.399 -5.961,-0.528 -1.282,-0.125 -2.532,-0.332 -3.75,-0.625 -1.215,-0.281 -2.289,-0.722 -3.219,-1.296 -0.934,-0.579 -1.684,-1.36 -2.262,-2.356 -0.574,-0.996 -0.863,-2.254 -0.863,-3.797 0,-1.855 0.754,-3.254 2.262,-4.179 1.504,-0.93 3.25,-1.399 5.238,-1.399 2.113,0 3.891,0.344 5.332,1.016 1.445,0.664 2.66,1.535 3.656,2.59 0.992,1.062 1.778,2.265 2.356,3.601 0.574,1.348 1.058,2.695 1.437,4.043 l 1.352,4.805 c -1.731,-1.024 -3.59,-1.649 -5.578,-1.875 z m -20.379,20.48 c 1.472,2.078 3.265,3.77 5.383,5.047 2.117,1.281 4.484,2.199 7.117,2.735 2.625,0.546 5.344,0.82 8.168,0.82 2.242,0 4.578,-0.156 7.015,-0.477 2.438,-0.324 4.676,-0.949 6.735,-1.875 2.051,-0.929 3.73,-2.246 5.043,-3.949 1.312,-1.695 1.937,-3.953 1.875,-6.773 0,-2.375 -0.352,-5.157 -1.055,-8.36 l -4.426,-20 c -0.258,-0.898 -0.433,-2.004 -0.523,-3.312 -0.102,-1.317 -0.149,-2.449 -0.149,-3.418 0,-0.828 0.161,-1.797 0.485,-2.879 h -13.653 v 4.902 c -1.863,-2.121 -4.136,-3.672 -6.828,-4.668 -2.687,-0.988 -5.476,-1.484 -8.363,-1.484 -2.691,0 -5.051,0.351 -7.066,1.055 -2.02,0.703 -3.7,1.648 -5.047,2.832 -1.348,1.187 -2.34,2.566 -2.981,4.14 -0.636,1.571 -0.961,3.223 -0.961,4.949 0,4.805 1.653,8.653 4.95,11.536 3.3,2.879 7.964,4.675 13.992,5.379 3.203,0.39 5.992,0.675 8.363,0.871 2.367,0.195 4.34,0.496 5.906,0.918 1.574,0.41 2.746,1.015 3.512,1.824 0.773,0.801 1.152,2.004 1.152,3.605 0,1.278 -0.289,2.305 -0.863,3.074 -0.574,0.774 -1.301,1.379 -2.164,1.829 -0.863,0.449 -1.797,0.75 -2.785,0.906 -0.996,0.168 -1.942,0.246 -2.84,0.246 -2.438,0 -4.613,-0.598 -6.535,-1.777 -1.922,-1.192 -3.11,-3.028 -3.559,-5.528 h -12.785 c 0.449,3.133 1.41,5.75 2.887,7.832" /><path
         id="path28"
         style="fill:#777475;fill-opacity:1;fill-rule:nonzero;stroke:none"
         d="m 844.809,313.117 -1.539,-6.914 h 0.191 c 4.426,5.508 10.227,8.262 17.402,8.262 9.68,0 14.52,-4.453 14.52,-13.36 0,-0.515 -0.067,-1.171 -0.192,-1.972 -0.132,-0.801 -0.273,-1.621 -0.433,-2.449 -0.164,-0.832 -0.324,-1.621 -0.485,-2.356 -0.156,-0.742 -0.269,-1.336 -0.332,-1.777 l -6.16,-29.129 h -13.644 l 6.054,29.129 c 0.125,0.762 0.301,1.789 0.528,3.078 0.222,1.277 0.336,2.273 0.336,2.976 0,1.473 -0.688,2.684 -2.067,3.653 -1.375,0.957 -2.871,1.445 -4.472,1.445 -2.051,0 -3.864,-0.398 -5.43,-1.199 -1.57,-0.813 -2.914,-1.848 -4.035,-3.125 -1.125,-1.289 -2.055,-2.766 -2.789,-4.426 -0.739,-1.672 -1.301,-3.367 -1.68,-5.098 l -5.578,-26.433 h -13.559 l 10.289,49.695 h 13.075" /><path
         id="path30"
         style="fill:#777475;fill-opacity:1;fill-rule:nonzero;stroke:none"
         d="m 903.082,302.16 c -1.891,-1.347 -3.449,-3.047 -4.664,-5.097 -1.215,-2.051 -2.113,-4.286 -2.691,-6.727 -0.575,-2.434 -0.868,-4.746 -0.868,-6.926 0,-1.472 0.207,-2.879 0.625,-4.226 0.414,-1.348 1.032,-2.512 1.829,-3.508 0.8,-0.996 1.808,-1.797 3.031,-2.403 1.215,-0.617 2.625,-0.918 4.222,-0.918 2.567,0 4.782,0.696 6.641,2.071 1.856,1.379 3.41,3.125 4.66,5.234 1.25,2.121 2.18,4.414 2.789,6.875 0.606,2.473 0.91,4.766 0.91,6.875 0,3.274 -0.8,5.879 -2.398,7.844 -1.605,1.949 -4.07,2.93 -7.402,2.93 -2.571,0 -4.793,-0.676 -6.684,-2.024 z m 11.969,-32.402 c -1.539,-2.684 -3.641,-4.629 -6.297,-5.809 -2.66,-1.183 -5.527,-1.777 -8.602,-1.777 -6.027,0 -10.687,1.746 -13.992,5.234 -3.301,3.496 -4.949,8.25 -4.949,14.278 0,4.097 0.543,8.101 1.637,12.019 1.09,3.906 2.754,7.402 4.996,10.481 2.246,3.074 5.062,5.554 8.461,7.449 3.398,1.887 7.402,2.832 12.011,2.832 2.891,0 5.661,-0.645 8.321,-1.926 2.66,-1.277 4.535,-3.297 5.625,-6.051 h 0.187 l 5.485,25.575 h 13.652 l -14.52,-68.641 h -13.171 l 1.347,6.152 -0.191,0.184" /><path
         id="path32"
         style="fill:#777475;fill-opacity:1;fill-rule:nonzero;stroke:none"
         d="m 1000.36,299.758 c 3.84,0 6.87,0.976 9.08,2.93 2.21,1.953 3.32,4.98 3.32,9.093 0,1.727 -0.31,3.153 -0.91,4.278 -0.61,1.113 -1.43,1.98 -2.46,2.586 -1.03,0.617 -2.16,1.046 -3.41,1.3 -1.25,0.254 -2.55,0.391 -3.9,0.391 h -12.877 l -4.226,-20.578 z m 3.65,32.305 c 3.46,0 6.65,-0.34 9.56,-1.016 2.92,-0.676 5.43,-1.777 7.55,-3.309 2.12,-1.543 3.77,-3.593 4.95,-6.152 1.19,-2.57 1.78,-5.742 1.78,-9.523 0,-3.782 -0.72,-7.157 -2.16,-10.149 -1.45,-2.976 -3.4,-5.484 -5.87,-7.535 -2.47,-2.055 -5.3,-3.625 -8.51,-4.719 -3.2,-1.086 -6.6,-1.629 -10.19,-1.629 h -18.643 l -5.196,-24.609 h -14.996 l 14.231,68.641 h 27.494" /><path
         id="path34"
         style="fill:#777475;fill-opacity:1;fill-rule:nonzero;stroke:none"
         d="m 1048.29,313.117 -2.02,-8.933 0.19,-0.196 c 1.54,3.465 3.86,6.075 6.97,7.832 3.11,1.766 6.49,2.645 10.14,2.645 1.41,0 2.82,-0.098 4.23,-0.281 l -2.79,-13.274 c -0.96,0.195 -1.92,0.379 -2.88,0.578 -0.96,0.196 -1.92,0.293 -2.88,0.293 -2.63,0 -4.86,-0.453 -6.69,-1.347 -1.82,-0.903 -3.36,-2.121 -4.61,-3.653 -1.25,-1.543 -2.24,-3.293 -2.98,-5.246 -0.74,-1.953 -1.33,-3.984 -1.78,-6.101 l -4.61,-22.012 h -13.56 l 10.29,49.695 h 12.98" /><path
         id="path36"
         style="fill:#777475;fill-opacity:1;fill-rule:nonzero;stroke:none"
         d="m 1079.83,279.281 c 0.41,-1.347 1.04,-2.531 1.87,-3.554 0.83,-1.028 1.86,-1.848 3.08,-2.454 1.22,-0.617 2.63,-0.918 4.23,-0.918 2.56,0 4.76,0.696 6.59,2.071 1.82,1.379 3.33,3.105 4.51,5.195 1.19,2.078 2.07,4.336 2.65,6.777 0.57,2.43 0.86,4.707 0.86,6.829 0,3.328 -0.75,5.984 -2.26,7.976 -1.51,1.985 -4.08,2.981 -7.74,2.981 -2.5,0 -4.66,-0.696 -6.49,-2.071 -1.82,-1.379 -3.31,-3.097 -4.46,-5.148 -1.16,-2.051 -2.03,-4.277 -2.6,-6.68 -0.58,-2.402 -0.87,-4.656 -0.87,-6.777 0,-1.477 0.21,-2.879 0.63,-4.227 z m -12.31,16.199 c 1.31,3.75 3.21,7.032 5.67,9.856 2.47,2.82 5.47,5.047 8.99,6.68 3.53,1.629 7.5,2.449 11.93,2.449 3.39,0 6.52,-0.43 9.37,-1.301 2.85,-0.855 5.3,-2.156 7.35,-3.883 2.05,-1.742 3.64,-3.918 4.76,-6.543 1.12,-2.629 1.69,-5.734 1.69,-9.328 0,-4.355 -0.66,-8.445 -1.98,-12.254 -1.31,-3.808 -3.22,-7.129 -5.72,-9.953 -2.5,-2.82 -5.53,-5.027 -9.08,-6.629 -3.56,-1.601 -7.61,-2.402 -12.17,-2.402 -6.91,0 -12.45,1.777 -16.58,5.332 -4.13,3.555 -6.2,8.894 -6.2,16.004 0,4.23 0.66,8.222 1.97,11.972" /><path
         id="path38"
         style="fill:#777475;fill-opacity:1;fill-rule:nonzero;stroke:none"
         d="m 1156.46,313.117 -2.11,-9.129 h -9.72 l -5.09,-24.707 c -0.13,-0.519 -0.23,-0.976 -0.29,-1.398 -0.07,-0.41 -0.09,-0.711 -0.09,-0.906 0,-0.903 0.14,-1.594 0.42,-2.071 0.29,-0.48 0.66,-0.851 1.11,-1.105 0.45,-0.254 0.95,-0.399 1.49,-0.43 0.54,-0.039 1.08,-0.047 1.59,-0.047 1.66,0 3.3,0.098 4.9,0.281 l -2.31,-10.476 c -1.4,-0.129 -2.82,-0.234 -4.23,-0.332 -1.41,-0.098 -2.85,-0.149 -4.32,-0.149 -1.6,0 -3.19,0.149 -4.76,0.43 -1.57,0.293 -2.98,0.801 -4.23,1.543 -1.25,0.734 -2.24,1.746 -2.98,3.027 -0.74,1.282 -1.07,2.95 -1.01,5 0,0.633 0.06,1.36 0.19,2.161 0.13,0.8 0.29,1.648 0.48,2.546 l 5.58,26.633 h -8.94 l 2.11,9.129 h 8.75 l 3.08,15.098 h 13.65 l -3.07,-15.098 h 9.8" /><path
         id="path40"
         style="fill:#777475;fill-opacity:1;fill-rule:nonzero;stroke:none"
         d="m 1192.23,297.406 c -0.22,1.25 -0.66,2.379 -1.3,3.407 -0.64,1.027 -1.57,1.843 -2.79,2.453 -1.21,0.613 -2.82,0.918 -4.8,0.918 -1.92,0 -3.62,-0.293 -5.1,-0.871 -1.47,-0.575 -2.76,-1.348 -3.84,-2.305 -1.09,-0.969 -2.01,-2.078 -2.74,-3.367 -0.74,-1.282 -1.36,-2.629 -1.87,-4.036 h 22.78 c 0,1.282 -0.11,2.551 -0.34,3.801 z m -23.98,-13.32 c 0,-0.258 0,-0.512 0,-0.762 v -1.25 c 0,-2.89 0.89,-5.226 2.69,-7.023 1.79,-1.797 4.54,-2.696 8.26,-2.696 1.35,0 2.55,0.215 3.61,0.625 1.06,0.422 1.98,0.95 2.79,1.594 0.8,0.633 1.5,1.375 2.11,2.207 0.61,0.828 1.17,1.629 1.68,2.403 h 13.66 c -1.09,-2.825 -2.38,-5.286 -3.85,-7.403 -1.48,-2.109 -3.24,-3.886 -5.28,-5.332 -2.06,-1.445 -4.45,-2.519 -7.17,-3.222 -2.72,-0.704 -5.88,-1.055 -9.47,-1.055 -3.33,0 -6.36,0.445 -9.08,1.348 -2.73,0.886 -5.05,2.253 -6.97,4.082 -1.92,1.824 -3.42,4.082 -4.47,6.777 -1.06,2.695 -1.59,5.828 -1.59,9.422 0,3.976 0.64,7.804 1.92,11.484 1.28,3.692 3.1,6.953 5.43,9.805 2.34,2.851 5.21,5.129 8.61,6.824 3.4,1.703 7.21,2.551 11.44,2.551 3.46,0 6.61,-0.449 9.47,-1.348 2.85,-0.898 5.28,-2.254 7.31,-4.082 2.01,-1.824 3.58,-4.101 4.71,-6.824 1.12,-2.727 1.68,-5.883 1.68,-9.473 0,-2.433 -0.26,-5.031 -0.77,-7.785 h -36.63 c -0.06,-0.32 -0.09,-0.613 -0.09,-0.867" /><path
         id="path42"
         style="fill:#777475;fill-opacity:1;fill-rule:nonzero;stroke:none"
         d="m 1245.07,302.258 c -1.51,1.277 -3.8,1.926 -6.87,1.926 -2.57,0 -4.75,-0.696 -6.54,-2.071 -1.8,-1.379 -3.24,-3.125 -4.33,-5.234 -1.09,-2.121 -1.87,-4.414 -2.35,-6.875 -0.48,-2.473 -0.72,-4.766 -0.72,-6.875 0,-1.477 0.15,-2.871 0.48,-4.18 0.32,-1.32 0.86,-2.453 1.63,-3.418 0.77,-0.957 1.75,-1.73 2.93,-2.304 1.19,-0.579 2.65,-0.872 4.38,-0.872 1.53,0 2.9,0.254 4.08,0.774 1.19,0.508 2.24,1.18 3.18,2.019 0.93,0.832 1.69,1.805 2.3,2.93 0.61,1.121 1.11,2.293 1.49,3.508 h 13.65 c -2.05,-6.215 -5.2,-11.008 -9.46,-14.367 -4.27,-3.367 -9.67,-5.047 -16.21,-5.047 -6.98,0 -12.41,1.707 -16.29,5.137 -3.88,3.425 -5.81,8.796 -5.81,16.101 0,4.238 0.62,8.223 1.87,11.973 1.25,3.75 3.08,7.051 5.48,9.902 2.4,2.852 5.34,5.098 8.8,6.731 3.45,1.629 7.43,2.449 11.92,2.449 3.01,0 5.86,-0.352 8.55,-1.055 2.7,-0.703 5.05,-1.797 7.07,-3.269 2.02,-1.477 3.62,-3.399 4.81,-5.774 1.18,-2.363 1.81,-5.183 1.87,-8.457 h -13.65 c 0,2.949 -0.75,5.07 -2.26,6.348" /><path
         id="path44"
         style="fill:#777475;fill-opacity:1;fill-rule:nonzero;stroke:none"
         d="m 1299.3,313.117 -2.11,-9.129 h -9.71 l -5.1,-24.707 c -0.13,-0.519 -0.23,-0.976 -0.29,-1.398 -0.06,-0.41 -0.09,-0.711 -0.09,-0.906 0,-0.903 0.14,-1.594 0.43,-2.071 0.28,-0.48 0.66,-0.851 1.11,-1.105 0.44,-0.254 0.94,-0.399 1.48,-0.43 0.55,-0.039 1.08,-0.047 1.59,-0.047 1.67,0 3.3,0.098 4.9,0.281 l -2.31,-10.476 c -1.4,-0.129 -2.81,-0.234 -4.22,-0.332 -1.42,-0.098 -2.86,-0.149 -4.33,-0.149 -1.6,0 -3.19,0.149 -4.76,0.43 -1.57,0.293 -2.98,0.801 -4.23,1.543 -1.25,0.734 -2.24,1.746 -2.98,3.027 -0.74,1.282 -1.07,2.95 -1.01,5 0,0.633 0.06,1.36 0.2,2.161 0.12,0.8 0.28,1.648 0.47,2.546 l 5.58,26.633 h -8.94 l 2.11,9.129 h 8.75 l 3.08,15.098 h 13.65 l -3.07,-15.098 h 9.8" /><path
         id="path46"
         style="fill:#17ad49;fill-opacity:1;fill-rule:nonzero;stroke:none"
         d="m 1332.46,291.711 -6.07,-28.289 h -28.84 l 5.88,28.289 h 29.03" /><g
         id="g48"><g
           clip-path="url(#clipPath54)"
           id="g50"><path
             id="path56"
             style="fill:#17ad49;fill-opacity:1;fill-rule:nonzero;stroke:none"
             d="m 2051.19,264.602 c 8.31,-0.782 16.73,-1.192 25.25,-1.192 145.59,0 263.61,118.028 263.61,263.621 0,145.594 -118.02,263.621 -263.61,263.621 -8.52,0 -16.94,-0.406 -25.25,-1.199 133.75,-12.707 238.37,-125.344 238.37,-262.422 0,-137.078 -104.62,-249.715 -238.37,-262.429" /><path
             id="path58"
             style="fill:#4fc065;fill-opacity:1;fill-rule:nonzero;stroke:none"
             d="m 2208,264.602 c 8.31,-0.782 16.73,-1.192 25.26,-1.192 145.58,0 263.61,118.028 263.61,263.621 0,145.594 -118.03,263.621 -263.61,263.621 -8.53,0 -16.95,-0.406 -25.26,-1.199 133.75,-12.707 238.37,-125.344 238.37,-262.422 0,-137.078 -104.62,-249.715 -238.37,-262.429" /><path
             id="path60"
             style="fill:#84d289;fill-opacity:1;fill-rule:nonzero;stroke:none"
             d="m 2364.82,264.602 c 8.31,-0.782 16.73,-1.192 25.24,-1.192 145.6,0 263.63,118.028 263.63,263.621 0,145.594 -118.03,263.621 -263.63,263.621 -8.51,0 -16.93,-0.406 -25.24,-1.199 133.74,-12.707 238.37,-125.344 238.37,-262.422 0,-137.078 -104.63,-249.715 -238.37,-262.429" /></g></g><path
         id="path62"
         style="fill:#777475;fill-opacity:1;fill-rule:nonzero;stroke:none"
         d="M 508.02,668.766 V 559.984 h 114.734 v 108.782 h 62.328 V 385.297 H 622.754 V 507.578 H 508.02 V 385.297 h -62.336 v 283.469 h 62.336" /><path
         id="path64"
         style="fill:#777475;fill-opacity:1;fill-rule:nonzero;stroke:none"
         d="M 943.938,668.766 V 616.355 H 794.262 V 555.613 H 931.625 V 507.18 H 794.262 v -69.473 h 152.847 v -52.41 H 731.93 v 283.469 h 212.008" /><path
         id="path66"
         style="fill:#777475;fill-opacity:1;fill-rule:nonzero;stroke:none"
         d="m 1045.57,668.766 118.31,-190.168 h 0.79 v 190.168 h 58.36 V 385.297 H 1160.7 L 1042.79,575.066 H 1042 V 385.297 h -58.367 v 283.469 h 61.937" /><path
         id="path68"
         style="fill:#777475;fill-opacity:1;fill-rule:nonzero;stroke:none"
         d="m 1319.9,455.168 c 3.44,-6.609 8.01,-11.973 13.7,-16.074 5.69,-4.11 12.37,-7.149 20.05,-9.129 7.67,-1.985 15.61,-2.981 23.82,-2.981 5.56,0 11.51,0.461 17.87,1.387 6.35,0.93 12.3,2.715 17.86,5.363 5.56,2.645 10.19,6.289 13.89,10.918 3.71,4.629 5.57,10.516 5.57,17.664 0,7.676 -2.45,13.899 -7.35,18.664 -4.9,4.762 -11.32,8.731 -19.26,11.915 -7.93,3.171 -16.93,5.945 -26.99,8.328 -10.07,2.382 -20.25,5.031 -30.57,7.937 -10.59,2.649 -20.91,5.891 -30.97,9.735 -10.06,3.832 -19.05,8.793 -27,14.882 -7.94,6.09 -14.36,13.7 -19.25,22.828 -4.9,9.133 -7.34,20.18 -7.34,33.153 0,14.555 3.1,27.191 9.33,37.914 6.21,10.723 14.35,19.648 24.41,26.805 10.05,7.136 21.44,12.429 34.14,15.878 12.71,3.43 25.41,5.157 38.12,5.157 14.82,0 29.04,-1.657 42.68,-4.961 13.63,-3.317 25.73,-8.672 36.32,-16.074 10.59,-7.414 18.99,-16.875 25.21,-28.395 6.22,-11.516 9.33,-25.473 9.33,-41.887 h -60.34 c -0.54,8.473 -2.32,15.489 -5.36,21.047 -3.05,5.555 -7.09,9.922 -12.11,13.102 -5.03,3.176 -10.79,5.422 -17.27,6.746 -6.49,1.324 -13.57,1.988 -21.24,1.988 -5.03,0 -10.07,-0.539 -15.09,-1.594 -5.03,-1.058 -9.59,-2.914 -13.7,-5.55 -4.1,-2.653 -7.48,-5.957 -10.12,-9.93 -2.65,-3.973 -3.97,-9 -3.97,-15.086 0,-5.559 1.06,-10.063 3.18,-13.5 2.11,-3.438 6.28,-6.609 12.5,-9.52 6.22,-2.918 14.82,-5.832 25.81,-8.742 10.98,-2.914 25.34,-6.621 43.07,-11.117 5.3,-1.059 12.64,-2.973 22.04,-5.758 9.39,-2.777 18.72,-7.211 27.99,-13.297 9.26,-6.086 17.27,-14.23 24.02,-24.418 6.74,-10.183 10.12,-23.222 10.12,-39.101 0,-12.969 -2.52,-25.012 -7.54,-36.133 -5.04,-11.113 -12.51,-20.715 -22.43,-28.777 -9.93,-8.078 -22.23,-14.367 -36.93,-18.86 -14.68,-4.5 -31.7,-6.746 -51.01,-6.746 -15.62,0 -30.77,1.922 -45.46,5.75 -14.69,3.836 -27.66,9.864 -38.91,18.067 -11.25,8.203 -20.18,18.664 -26.79,31.367 -6.63,12.707 -9.8,27.781 -9.54,45.254 h 60.35 c 0,-9.52 1.72,-17.598 5.16,-24.219" /><path
         id="path70"
         style="fill:#777475;fill-opacity:1;fill-rule:nonzero;stroke:none"
         d="m 1578.55,491.105 c 2.77,-11.257 7.21,-21.375 13.3,-30.371 6.08,-9.004 14.02,-16.218 23.82,-21.64 9.78,-5.43 21.7,-8.145 35.73,-8.145 14.02,0 25.94,2.715 35.73,8.145 9.79,5.422 17.73,12.636 23.82,21.64 6.09,8.996 10.52,19.114 13.3,30.371 2.78,11.243 4.17,22.825 4.17,34.731 0,12.437 -1.39,24.48 -4.17,36.129 -2.78,11.644 -7.21,22.035 -13.3,31.168 -6.09,9.137 -14.03,16.406 -23.82,21.84 -9.79,5.422 -21.71,8.136 -35.73,8.136 -14.03,0 -25.95,-2.714 -35.73,-8.136 -9.8,-5.434 -17.74,-12.703 -23.82,-21.84 -6.09,-9.133 -10.53,-19.524 -13.3,-31.168 -2.78,-11.649 -4.17,-23.692 -4.17,-36.129 0,-11.906 1.39,-23.488 4.17,-34.731 z m -56.97,93.688 c 6.35,18.129 15.48,33.945 27.39,47.445 11.91,13.496 26.53,24.082 43.87,31.758 17.33,7.676 36.85,11.516 58.56,11.516 21.96,0 41.54,-3.84 58.75,-11.516 17.21,-7.676 31.77,-18.262 43.67,-31.758 11.92,-13.5 21.05,-29.316 27.41,-47.445 6.34,-18.133 9.52,-37.777 9.52,-58.957 0,-20.637 -3.18,-39.895 -9.52,-57.758 -6.36,-17.871 -15.49,-33.418 -27.41,-46.648 -11.9,-13.242 -26.46,-23.625 -43.67,-31.172 -17.21,-7.539 -36.79,-11.309 -58.75,-11.309 -21.71,0 -41.23,3.77 -58.56,11.309 -17.34,7.547 -31.96,17.93 -43.87,31.172 -11.91,13.23 -21.04,28.777 -27.39,46.648 -6.36,17.863 -9.53,37.121 -9.53,57.758 0,21.18 3.17,40.824 9.53,58.957" /><path
         id="path72"
         style="fill:#777475;fill-opacity:1;fill-rule:nonzero;stroke:none"
         d="M 1888.02,668.766 V 437.707 h 138.16 v -52.41 h -200.49 v 283.469 h 62.33" /><path
         id="path74"
         style="fill:#777475;fill-opacity:1;fill-rule:nonzero;stroke:none"
         d="m 2168.31,437.707 c 8.99,0 17.72,1.445 26.2,4.367 8.47,2.91 16.01,7.742 22.63,14.492 6.61,6.747 11.9,15.547 15.88,26.395 3.97,10.852 5.96,24.082 5.96,39.703 0,14.289 -1.39,27.191 -4.18,38.703 -2.77,11.516 -7.34,21.375 -13.69,29.582 -6.35,8.199 -14.77,14.489 -25.22,18.864 -10.45,4.359 -23.36,6.542 -38.71,6.542 h -44.46 V 437.707 Z m 4.36,231.059 c 18.26,0 35.27,-2.914 51.02,-8.739 15.74,-5.828 29.37,-14.55 40.89,-26.203 11.51,-11.648 20.51,-26.199 27,-43.672 6.48,-17.464 9.72,-37.98 9.72,-61.535 0,-20.644 -2.65,-39.699 -7.95,-57.168 -5.29,-17.472 -13.28,-32.551 -24,-45.254 -10.72,-12.707 -24.1,-22.707 -40.1,-29.98 -16.01,-7.285 -34.88,-10.918 -56.58,-10.918 h -122.28 v 283.469 h 122.28" /><path
         id="path76"
         style="fill:#777475;fill-opacity:1;fill-rule:nonzero;stroke:none"
         d="m 2310.83,616.355 v 52.411 h 232.25 v -52.411 h -84.96 V 385.297 h -62.33 v 231.058 h -84.96" /></g></g></svg>