<svg width="64" height="64" viewBox="0 0 64 64" fill="none" xmlns="http://www.w3.org/2000/svg">
<path d="M60.5 32.5H51.5V30.5C51.5 29.1739 50.9732 27.9021 50.0355 26.9645C49.0979 26.0268 47.8261 25.5 46.5 25.5C45.1739 25.5 43.9021 26.0268 42.9645 26.9645C42.0268 27.9021 41.5 29.1739 41.5 30.5V32.5H23.5V34.5C23.5 35.8261 22.9732 37.0979 22.0355 38.0355C21.0979 38.9732 19.8261 39.5 18.5 39.5C17.1739 39.5 15.9021 38.9732 14.9645 38.0355C14.0268 37.0979 13.5 35.8261 13.5 34.5V32.5H4.5" stroke="#7C5CD6" stroke-width="3" stroke-miterlimit="10" stroke-linecap="round" stroke-linejoin="round"/>
<path d="M32.5 4.5V13.5H30.5C29.1739 13.5 27.9021 14.0268 26.9645 14.9645C26.0268 15.9021 25.5 17.1739 25.5 18.5C25.5 19.8261 26.0268 21.0979 26.9645 22.0355C27.9021 22.9732 29.1739 23.5 30.5 23.5H32.5V41.5H34.5C35.8261 41.5 37.0979 42.0268 38.0355 42.9645C38.9732 43.9021 39.5 45.1739 39.5 46.5C39.5 47.8261 38.9732 49.0979 38.0355 50.0355C37.0979 50.9732 35.8261 51.5 34.5 51.5H32.5V60.5" stroke="#7C5CD6" stroke-width="3" stroke-miterlimit="10" stroke-linecap="round" stroke-linejoin="round"/>
<path d="M60.5 4.5H4.5V60.5H60.5V4.5Z" stroke="#7C5CD6" stroke-width="3" stroke-miterlimit="10" stroke-linecap="round" stroke-linejoin="round"/>
</svg>
