{
  "$schema": "./node_modules/ng-packagr/ng-package.schema.json",
  "dest": "ionic-creator",
  "lib": {
    "entryFile": "module-export",
    "comments" : "none",
    "styleIncludePaths": ["./www/build"]
  }
}