org\example\domain\User.class
org\example\service\TrainerServiceImpl.class
org\example\DAO\DAO_generic_impl.class
org\example\domain\TrainingType.class
org\example\storage\Storage.class
org\example\domain\Training.class
org\example\service\TrainingServiceImpl.class
org\example\domain\Trainee.class
org\example\Main.class
org\example\DAO\interfaces\DAO_generic.class
org\example\domain\Trainer.class
org\example\service\TraineeServiceImpl.class
org\example\configuration\AppConfiguration.class
org\example\service\interfaces\PeopleService.class
org\example\service\UserService.class
