C:\Users\Kpocc\IdeaProjects\Spring_Core_Task2\src\main\java\org\example\Main.java
C:\Users\Kpocc\IdeaProjects\Spring_Core_Task2\src\main\java\org\example\DAO\DAO_generic_impl.java
C:\Users\Kpocc\IdeaProjects\Spring_Core_Task2\src\main\java\org\example\domain\TrainingType.java
C:\Users\Kpocc\IdeaProjects\Spring_Core_Task2\src\main\java\org\example\service\TrainerServiceImpl.java
C:\Users\Kpocc\IdeaProjects\Spring_Core_Task2\src\main\java\org\example\service\TrainingServiceImpl.java
C:\Users\Kpocc\IdeaProjects\Spring_Core_Task2\src\main\java\org\example\DAO\interfaces\DAO_generic.java
C:\Users\Kpocc\IdeaProjects\Spring_Core_Task2\src\main\java\org\example\service\UserService.java
C:\Users\Kpocc\IdeaProjects\Spring_Core_Task2\src\main\java\org\example\service\interfaces\PeopleService.java
C:\Users\Kpocc\IdeaProjects\Spring_Core_Task2\src\main\java\org\example\domain\User.java
C:\Users\Kpocc\IdeaProjects\Spring_Core_Task2\src\main\java\org\example\service\TraineeServiceImpl.java
C:\Users\Kpocc\IdeaProjects\Spring_Core_Task2\src\main\java\org\example\domain\Trainer.java
C:\Users\Kpocc\IdeaProjects\Spring_Core_Task2\src\main\java\org\example\configuration\AppConfiguration.java
C:\Users\Kpocc\IdeaProjects\Spring_Core_Task2\src\main\java\org\example\domain\Training.java
C:\Users\Kpocc\IdeaProjects\Spring_Core_Task2\src\main\java\org\example\storage\Storage.java
C:\Users\Kpocc\IdeaProjects\Spring_Core_Task2\src\main\java\org\example\domain\Trainee.java
