1,231.358
2,229.177
3,230.881
4,231.615
5,231.752
6,230.188
7,242.794
8,244.542
9,234.685
10,236.500
11,229.358
12,231.772
13,230.679
14,233.222
15,230.652
16,230.240
17,168.541
18,229.915
19,229.098
20,231.190
21,232.147
22,232.808
23,232.083
24,229.225
25,232.485
26,230.372
27,233.568
28,229.157
29,234.987
30,229.717
31,210.204
32,227.746
33,227.895
34,228.276
35,235.923
36,229.778
37,236.284
38,232.469
39,232.207
40,231.171
41,232.485
42,233.274
43,231.279
44,234.343
45,234.956
46,227.090
47,232.752
48,228.499
49,226.293
50,233.954
51,232.015
52,172.792
53,234.343
54,230.879
55,229.032
56,235.542
57,235.215
58,232.031
59,230.285
60,231.507
61,233.864
62,232.828
63,226.525
64,230.719
65,231.688
66,234.320
67,229.893
68,229.646
69,232.683
70,230.093
71,228.750
72,230.491
73,230.814
74,234.145
75,233.004
76,233.727
77,232.095
78,230.686
79,231.226
80,226.608
81,231.549
82,234.471
83,230.405
84,228.099
85,220.470
86,229.049
87,230.377
88,229.274
89,233.051
90,234.017
91,197.292
92,234.014
93,229.735
94,232.003
95,203.144
96,196.105
97,195.659
98,198.023
99,203.318
100,200.990
101,198.615
102,203.903
103,203.949
104,204.931
105,199.889
106,200.538
107,198.005
108,199.443
109,217.059
110,230.082
111,230.551
112,227.877
113,235.737
114,232.839
115,227.962
116,229.776
117,228.748
118,229.408
119,235.988
120,231.182
121,226.286
122,232.444
123,224.903
124,231.217
125,235.749
126,230.498
127,235.657
128,233.882
129,231.674
130,232.503
131,233.236
132,219.757
133,231.471
134,238.574
135,233.312
136,229.033
137,233.475
138,231.861
139,232.842
140,231.668
141,233.555
142,231.780
143,231.243
144,232.163
145,232.191
146,233.344
147,230.218
148,230.107
149,233.912
150,232.981
151,231.988
152,229.446
153,231.761
154,233.203
155,237.161
156,234.094
157,233.413
158,230.674
159,231.793
160,231.906
161,234.126
162,233.537
163,233.138
164,229.812
165,232.201
166,232.801
167,232.419
168,232.565
169,230.072
170,232.536
171,233.615
172,234.409
173,232.061
174,236.660
175,233.843
176,230.797
177,230.038
178,231.677
179,230.972
180,231.128
181,228.039
182,237.338
183,235.740
184,228.682
185,229.474
186,231.618
187,230.517
188,233.921
189,231.178
190,233.398
191,233.106
192,233.647
193,231.894
194,233.090
195,232.076
196,231.449
197,232.673
198,233.656
199,225.786
200,234.109
201,233.025
202,230.132
203,231.656
204,233.792
205,230.619
206,234.183
207,229.570
208,232.201
209,231.224
210,235.874
211,229.694
212,229.791
213,229.811
214,234.656
215,236.179
216,228.266
217,233.746
218,224.836
219,227.505
220,93.339
221,229.623
222,230.052
223,237.073
224,236.061
225,229.403
226,230.592
227,230.152
228,232.079
229,231.858
230,231.135
231,231.148
232,232.853
233,234.278
234,231.986
235,231.497
236,231.413
237,233.696
238,234.321
239,234.113
240,232.239
241,233.094
242,233.560
243,234.143
244,231.002
245,232.109
246,235.320
247,233.453
248,234.690
249,231.366
250,233.206
251,230.087
252,238.750
253,231.693
254,236.160
255,234.690
256,80.484
257,236.038
258,236.114
259,236.827
260,231.156
261,234.668
262,236.108
263,239.427
264,233.083
265,235.194
266,232.898
267,234.384
268,234.916
269,236.821
270,238.350
271,239.082
272,235.216
273,234.704
274,238.506
275,235.437
276,235.672
277,234.349
278,238.406
279,238.816
280,238.626
281,237.715
282,236.552
283,237.026
284,236.831
285,238.253
286,237.094
287,240.211
288,240.090
289,238.240
290,237.003
291,238.255
292,237.761
293,240.195
294,236.149
295,239.823
296,239.632
297,240.714
298,239.922
299,239.663
300,236.864
301,236.026
302,237.939
303,241.621
304,241.167
305,239.273
306,237.841
307,238.132
308,236.661
309,237.899
310,243.273
311,242.970
312,240.373
313,239.191
314,240.791
315,239.681
316,239.772
317,240.622
318,241.009
319,242.366
320,246.291
321,239.913
322,240.572
323,292.561
324,243.418
325,241.493
326,240.683
327,242.558
328,240.450
329,242.382
330,240.140
331,242.016
332,242.836
333,241.770
334,241.691
335,243.404
336,244.753
337,241.314
338,244.388
339,243.262
340,251.269
341,243.553
342,242.817
343,245.475
344,246.136
345,243.498
346,245.425
347,242.873
348,244.229
349,244.698
350,249.486
351,250.912
352,244.937
353,246.010
354,244.725
355,243.885
356,244.849
357,245.976
358,245.120
359,245.549
360,246.276
361,246.791
362,246.173
363,246.986
364,246.497
365,247.683
366,247.747
367,247.418
368,248.228
369,246.115
370,247.552
371,256.366
372,249.853
373,248.557
374,248.033
375,250.121
376,250.177
377,250.031
378,250.140
379,250.210
380,254.262
381,249.798
382,252.474
383,252.905
384,250.605
385,250.071
386,252.464
387,250.928
388,252.125
389,251.795
390,252.971
391,252.918
392,251.676
393,252.423
394,251.672
395,251.978
396,252.297
397,253.975
398,255.373
399,254.989
400,255.098
401,257.135
402,252.973
403,254.822
404,252.220
405,256.237
406,256.747
407,253.962
408,255.637
409,257.159
410,243.008
411,254.928
412,252.518
413,254.961
414,253.083
415,256.232
416,257.346
417,253.641
418,255.435
419,256.474
420,263.492
421,254.221
422,254.382
423,254.474
424,254.236
425,258.476
426,259.381
427,254.104
428,254.605
429,254.026
430,257.631
431,255.444
432,255.083
433,255.869
434,254.394
435,255.685
436,256.204
437,254.507
438,256.118
439,258.422
440,258.338
441,259.202
442,258.318
443,257.663
444,260.616
445,259.192
446,258.093
447,257.697
448,257.620
449,257.021
450,265.286
451,259.015
452,261.035
453,259.188
454,258.718
455,259.210
456,258.731
457,259.430
458,259.446
459,261.075
460,267.732
461,261.956
462,263.177
463,261.954
464,261.467
465,259.927
466,259.520
467,264.808
468,261.406
469,262.934
470,266.504
471,265.113
472,260.958
473,264.439
474,263.101
475,262.950
476,262.460
477,265.904
478,265.542
479,262.055
480,263.498
481,263.481
482,265.816
483,267.176
484,262.857
485,262.990
486,264.511
487,264.629
488,267.354
489,265.587
490,265.419
491,265.161
492,265.187
493,264.814
494,267.499
495,266.150
496,265.149
497,266.173
498,263.114
499,271.819
500,265.228
501,266.023
502,265.963
503,269.971
504,269.869
505,267.079
506,273.033
507,269.005
508,268.333
509,154.792
510,273.305
511,271.967
512,271.791
513,270.434
514,267.266
515,270.942
516,268.482
517,269.259
518,274.470
519,271.491
520,271.857
521,269.974
522,270.428
523,272.708
524,271.538
525,271.179
526,271.277
527,272.586
528,272.717
529,271.484
530,272.148
531,273.172
532,272.655
533,272.488
534,272.697
535,274.690
536,273.399
537,269.464
538,271.692
539,274.131
540,272.095
541,272.652
542,272.156
543,272.229
544,275.688
545,272.987
546,269.017
547,272.750
548,274.688
549,273.976
550,274.791
551,267.192
552,274.456
553,273.848
554,275.733
555,276.756
556,275.769
557,278.782
558,273.122
559,281.941
560,272.604
561,272.514
562,272.277
563,272.645
564,273.402
565,273.265
566,276.628
567,279.774
568,278.115
569,274.163
570,276.228
571,273.908
572,282.887
573,276.487
574,280.186
575,274.516
576,286.430
577,276.438
578,274.440
579,279.725
580,276.332
581,275.808
582,276.960
583,277.105
584,274.995
585,275.196
586,280.456
587,276.995
588,277.844
589,277.577
590,278.696
591,277.704
592,277.069
593,278.538
594,277.869
595,278.064
596,280.072
597,280.026
598,278.420
599,279.782
600,278.677
601,278.385
602,281.326
603,281.659
604,278.383
605,283.541
606,280.548
607,286.006
608,281.622
609,282.259
610,282.150
611,281.480
612,281.366
613,281.693
614,287.540
615,284.734
616,283.430
617,281.776
618,281.485
619,283.748
620,288.259
621,341.088
622,319.233
623,274.116
624,295.598
625,294.648
626,285.909
627,307.968
628,515.498
629,525.795
630,490.579
631,284.357
632,282.020
633,283.438
634,285.068
635,283.934
636,283.722
637,276.896
638,283.252
639,286.837
640,276.212
641,273.353
642,285.727
643,286.925
644,281.518
645,283.495
646,283.935
647,284.231
648,282.324
649,284.148
650,282.117
651,284.767
652,285.786
653,286.969
654,282.809
655,288.003
656,283.389
657,285.490
658,295.651
659,285.237
660,283.190
661,288.737
662,287.191
663,283.951
664,280.370
665,278.951
666,283.003
667,285.280
668,285.829
669,285.543
670,286.310
671,286.628
672,284.895
673,288.615
674,287.648
675,132.564
676,285.966
677,289.195
678,287.823
679,290.690
680,285.318
681,286.064
682,286.239
683,288.712
684,287.346
685,291.087
686,288.161
687,291.037
688,283.189
689,287.266
690,286.722
691,288.856
692,288.892
693,288.276
694,283.504
695,291.086
696,287.944
697,289.077
698,277.619
699,292.223
700,290.643
701,291.273
702,285.954
703,289.168
704,288.243
705,287.308
706,283.488
707,288.775
708,284.091
709,290.654
710,287.616
711,290.553
712,291.595
713,288.632
714,281.080
715,290.489
716,286.594
717,290.952
718,290.954
719,291.219
720,291.093
721,286.665
722,288.252
723,294.457
724,290.127
725,291.701
726,288.557
727,290.418
728,288.986
729,289.590
730,288.247
731,290.289
732,291.372
733,291.097
734,291.073
735,289.200
736,292.986
737,292.238
738,293.329
739,291.469
740,291.996
741,292.083
742,301.059
743,290.131
744,292.616
745,294.550
746,293.851
747,294.238
748,294.635
749,294.041
750,289.923
751,296.200
752,294.307
753,292.045
754,290.660
755,290.652
756,292.723
757,290.741
758,291.302
759,294.044
760,295.469
761,296.220
762,291.752
763,297.595
764,292.923
765,295.758
766,292.100
767,291.294
768,288.966
769,295.795
770,294.051
771,286.868
772,297.439
773,293.900
774,293.651
775,298.338
776,290.028
777,292.973
778,295.952
779,293.552
780,292.494
781,292.429
782,295.015
783,271.310
784,296.157
785,293.528
786,295.685
787,294.702
788,296.029
789,297.254
790,305.516
791,297.038
792,295.703
793,294.587
794,293.562
795,298.217
796,297.430
797,301.425
798,302.789
799,297.755
800,295.487
801,295.781
802,298.048
803,296.030
804,298.244
805,296.356
806,296.199
807,295.812
808,296.184
809,295.855
810,296.975
811,303.644
812,304.214
813,298.084
814,298.086
815,298.743
816,303.334
817,295.435
818,297.388
819,297.070
820,302.313
821,298.346
822,301.107
823,300.978
824,294.798
825,301.817
826,301.998
827,300.696
828,299.112
829,300.449
830,310.634
831,300.957
832,302.098
833,305.684
834,301.736
835,302.284
836,303.082
837,301.155
838,302.799
839,305.755
840,432.698
841,298.881
842,300.623
843,298.880
844,300.152
845,302.072
846,295.294
847,318.725
