<?xml version="1.0" encoding="UTF-8" standalone="no"?>
<!DOCTYPE svg PUBLIC "-//W3C//DTD SVG 1.1//EN" "http://www.w3.org/Graphics/SVG/1.1/DTD/svg11.dtd">
<svg version="1.1" id="Layer_1" xmlns="http://www.w3.org/2000/svg" xmlns:xlink="http://www.w3.org/1999/xlink" x="0px" y="0px" width="19px" height="19px" viewBox="0 0 19 19" enable-background="new 0 0 19 19" xml:space="preserve">  <image id="image0" width="19" height="19" x="0" y="0"
    xlink:href="data:image/png;base64,iVBORw0KGgoAAAANSUhEUgAAABMAAAATCAQAAADYWf5HAAAABGdBTUEAALGPC/xhBQAAACBjSFJN
AAB6JgAAgIQAAPoAAACA6AAAdTAAAOpgAAA6mAAAF3CculE8AAAAAmJLR0QA/4ePzL8AAAAHdElN
RQfkAg0UGhPmF8ggAAAA00lEQVQoz5XSsUoDARgD4O+kdBCF2/QxeqMgxaW0TyA6OUmfSXDQSeha
ty4dRCfhwMnBVygOpYMIcTmsy+E140/In5AUZOrKvjZs3Bc3Ms3/mBZ5duLcolVtZOZF6iRlK0nK
JPWeTuiB06xbGQdb2ryb2oMvHBv78AQmjsyt0HfJnwg5S3LXGF8mGewcYaekj/lGiUmWYIDbrH8Z
qTuU1XgbqlSuMVepVF5xoVIZbp++FZ+kxKqoIWu8F3Vz7R5hg1EWTS39ZgY9HKbEGJuue+u23h+6
GL0rUd8AAgAAACV0RVh0ZGF0ZTpjcmVhdGUAMjAyMC0wMi0xM1QyMDoyNjoxOSswMzowMCnd+DoA
AAAldEVYdGRhdGU6bW9kaWZ5ADIwMjAtMDItMTNUMjA6MjY6MTkrMDM6MDBYgECGAAAAAElFTkSu
QmCC" />
</svg>
