<svg width="32" height="32" viewBox="0 0 32 32" fill="none" xmlns="http://www.w3.org/2000/svg">
<rect x="0.5" y="0.5" width="31" height="30.6502" rx="7.5" stroke="#CCBEBE"/>
<path d="M23.5 16.3198C23.5 20.6778 19.9238 24.2207 15.5 24.2207C11.0762 24.2207 7.5 20.6778 7.5 16.3198C7.5 11.9618 11.0762 8.41895 15.5 8.41895C19.9238 8.41895 23.5 11.9618 23.5 16.3198Z" stroke="#CCBEBE"/>
<path d="M27.5 6.93059C27.5 8.28647 26.3863 9.39561 25 9.39561C23.6137 9.39561 22.5 8.28647 22.5 6.93059C22.5 5.57471 23.6137 4.46558 25 4.46558C26.3863 4.46558 27.5 5.57471 27.5 6.93059Z" stroke="#CCBEBE"/>
</svg>
