[
  {
    "idPai": null,
    "codigo": "1",
    "descricao": "Receitas",
    "id": 1,
    "auditoria": {
      "usuarioCadastro": null,
      "dataCadastro": "2019-05-24T14:23:31Z",
      "usuarioAtualizacao": null,
      "dataAtualizacao": null
    },
    "filhos": [
      {
        "idPai": 1,
        "codigo": "1.1",
        "descricao": "Receitas Ordinarias",
        "id": 2,
        "auditoria": {
          "usuarioCadastro": null,
          "dataCadastro": "2019-05-24T14:25:11Z",
          "usuarioAtualizacao": null,
          "dataAtualizacao": "2019-06-12T11:36:23Z"
        },
        "filhos": [
          {
            "idPai": 2,
            "codigo": "1.1.1",
            "descricao": "Cotas Condominiais",
            "id": 3,
            "auditoria": {
              "usuarioCadastro": null,
              "dataCadastro": "2019-05-24T14:27:59Z",
              "usuarioAtualizacao": null,
              "dataAtualizacao": "2019-06-12T13:29:28Z"
            },
            "filhos": []
          },
          {
            "idPai": 2,
            "codigo": "1.1.2",
            "descricao": "Juros",
            "id": 4,
            "auditoria": {
              "usuarioCadastro": null,
              "dataCadastro": "2019-05-24T14:28:13Z",
              "usuarioAtualizacao": null,
              "dataAtualizacao": null
            },
            "filhos": []
          },
          {
            "idPai": 2,
            "codigo": "1.1.3",
            "descricao": "Multas",
            "id": 5,
            "auditoria": {
              "usuarioCadastro": null,
              "dataCadastro": "2019-05-24T14:28:26Z",
              "usuarioAtualizacao": null,
              "dataAtualizacao": null
            },
            "filhos": []
          },
          {
            "idPai": 2,
            "codigo": "1.1.4",
            "descricao": "Descontos",
            "id": 10,
            "auditoria": {
              "usuarioCadastro": null,
              "dataCadastro": "2019-05-28T12:07:46Z",
              "usuarioAtualizacao": null,
              "dataAtualizacao": null
            },
            "filhos": []
          },
          {
            "idPai": 2,
            "codigo": "1.1.5",
            "descricao": "Acordos",
            "id": 11,
            "auditoria": {
              "usuarioCadastro": null,
              "dataCadastro": "2019-05-28T12:07:52Z",
              "usuarioAtualizacao": null,
              "dataAtualizacao": null
            },
            "filhos": []
          },
          {
            "idPai": 2,
            "codigo": "1.1.6",
            "descricao": "Fundo de Reserva",
            "id": 12,
            "auditoria": {
              "usuarioCadastro": null,
              "dataCadastro": "2019-05-28T12:08:06Z",
              "usuarioAtualizacao": null,
              "dataAtualizacao": null
            },
            "filhos": []
          },
          {
            "idPai": 2,
            "codigo": "1.1.7",
            "descricao": "Fundo de Obras",
            "id": 13,
            "auditoria": {
              "usuarioCadastro": null,
              "dataCadastro": "2019-05-28T12:08:19Z",
              "usuarioAtualizacao": null,
              "dataAtualizacao": null
            },
            "filhos": []
          },
          {
            "idPai": 2,
            "codigo": "1.1.8",
            "descricao": "Rateio Extra",
            "id": 14,
            "auditoria": {
              "usuarioCadastro": null,
              "dataCadastro": "2019-05-28T12:08:35Z",
              "usuarioAtualizacao": null,
              "dataAtualizacao": null
            },
            "filhos": []
          },
          {
            "idPai": 2,
            "codigo": "1.1.9",
            "descricao": "Aluguel de areas comuns",
            "id": 15,
            "auditoria": {
              "usuarioCadastro": null,
              "dataCadastro": "2019-05-28T12:09:07Z",
              "usuarioAtualizacao": null,
              "dataAtualizacao": null
            },
            "filhos": []
          },
          {
            "idPai": 2,
            "codigo": "1.1.10",
            "descricao": "Infrações",
            "id": 16,
            "auditoria": {
              "usuarioCadastro": null,
              "dataCadastro": "2019-05-28T12:09:33Z",
              "usuarioAtualizacao": null,
              "dataAtualizacao": null
            },
            "filhos": []
          },
          {
            "idPai": 2,
            "codigo": "1.1.11",
            "descricao": "Rateio de Consumo",
            "id": 17,
            "auditoria": {
              "usuarioCadastro": null,
              "dataCadastro": "2019-05-28T12:09:51Z",
              "usuarioAtualizacao": null,
              "dataAtualizacao": null
            },
            "filhos": [
              {
                "idPai": 17,
                "codigo": "1.1.11.1",
                "descricao": "Rateio de água",
                "id": 18,
                "auditoria": {
                  "usuarioCadastro": null,
                  "dataCadastro": "2019-05-28T12:10:10Z",
                  "usuarioAtualizacao": null,
                  "dataAtualizacao": null
                },
                "filhos": []
              },
              {
                "idPai": 17,
                "codigo": "1.1.11.2",
                "descricao": "Rateio de Energia",
                "id": 19,
                "auditoria": {
                  "usuarioCadastro": null,
                  "dataCadastro": "2019-05-28T12:10:19Z",
                  "usuarioAtualizacao": null,
                  "dataAtualizacao": null
                },
                "filhos": []
              },
              {
                "idPai": 17,
                "codigo": "1.1.11.3",
                "descricao": "Rateio de Gás",
                "id": 20,
                "auditoria": {
                  "usuarioCadastro": null,
                  "dataCadastro": "2019-05-28T12:10:30Z",
                  "usuarioAtualizacao": null,
                  "dataAtualizacao": null
                },
                "filhos": []
              },
              {
                "idPai": 17,
                "codigo": "1.1.11.4",
                "descricao": "Outros Rateios",
                "id": 21,
                "auditoria": {
                  "usuarioCadastro": null,
                  "dataCadastro": "2019-05-28T12:11:02Z",
                  "usuarioAtualizacao": null,
                  "dataAtualizacao": null
                },
                "filhos": []
              },
              {
                "idPai": 17,
                "codigo": "1.1.11.4",
                "descricao": "Outros Rateios",
                "id": 96,
                "auditoria": {
                  "usuarioCadastro": null,
                  "dataCadastro": "2019-06-12T12:04:59Z",
                  "usuarioAtualizacao": null,
                  "dataAtualizacao": null
                },
                "filhos": []
              },
              {
                "idPai": 17,
                "codigo": "1.1.11.5",
                "descricao": "Rateio de Consumacao",
                "id": 97,
                "auditoria": {
                  "usuarioCadastro": null,
                  "dataCadastro": "2019-06-12T12:37:38Z",
                  "usuarioAtualizacao": null,
                  "dataAtualizacao": "2019-06-12T16:31:23Z"
                },
                "filhos": []
              }
            ]
          },
          {
            "idPai": 2,
            "codigo": "1.1.12",
            "descricao": "Provisões",
            "id": 22,
            "auditoria": {
              "usuarioCadastro": null,
              "dataCadastro": "2019-05-28T12:11:31Z",
              "usuarioAtualizacao": null,
              "dataAtualizacao": null
            },
            "filhos": []
          },
          {
            "idPai": 2,
            "codigo": "1.1.60",
            "descricao": "Outras Receitas Operacionais",
            "id": 23,
            "auditoria": {
              "usuarioCadastro": null,
              "dataCadastro": "2019-05-28T12:12:21Z",
              "usuarioAtualizacao": null,
              "dataAtualizacao": null
            },
            "filhos": []
          }
        ]
      },
      {
        "idPai": 1,
        "codigo": "1.2",
        "descricao": "Receitas Financeiras",
        "id": 24,
        "auditoria": {
          "usuarioCadastro": null,
          "dataCadastro": "2019-05-28T13:16:17Z",
          "usuarioAtualizacao": null,
          "dataAtualizacao": null
        },
        "filhos": [
          {
            "idPai": 24,
            "codigo": "1.2.1",
            "descricao": "Rendimento de Poupança",
            "id": 25,
            "auditoria": {
              "usuarioCadastro": null,
              "dataCadastro": "2019-05-28T13:16:45Z",
              "usuarioAtualizacao": null,
              "dataAtualizacao": null
            },
            "filhos": []
          },
          {
            "idPai": 24,
            "codigo": "1.2.2",
            "descricao": "Rendimento de Investimentos",
            "id": 26,
            "auditoria": {
              "usuarioCadastro": null,
              "dataCadastro": "2019-05-28T13:16:54Z",
              "usuarioAtualizacao": null,
              "dataAtualizacao": null
            },
            "filhos": []
          },
          {
            "idPai": 24,
            "codigo": "1.2.3",
            "descricao": "Empréstimos",
            "id": 27,
            "auditoria": {
              "usuarioCadastro": null,
              "dataCadastro": "2019-05-28T13:17:15Z",
              "usuarioAtualizacao": null,
              "dataAtualizacao": null
            },
            "filhos": []
          },
          {
            "idPai": 24,
            "codigo": "1.2.4",
            "descricao": "Variações de Caixa",
            "id": 28,
            "auditoria": {
              "usuarioCadastro": null,
              "dataCadastro": "2019-05-28T13:18:02Z",
              "usuarioAtualizacao": null,
              "dataAtualizacao": null
            },
            "filhos": [
              {
                "idPai": 28,
                "codigo": "1.2.4.1",
                "descricao": "Pagamento a Menor",
                "id": 29,
                "auditoria": {
                  "usuarioCadastro": null,
                  "dataCadastro": "2019-05-28T13:20:48Z",
                  "usuarioAtualizacao": null,
                  "dataAtualizacao": null
                },
                "filhos": []
              },
              {
                "idPai": 28,
                "codigo": "1.2.4.2",
                "descricao": "Pagamento a Maior",
                "id": 30,
                "auditoria": {
                  "usuarioCadastro": null,
                  "dataCadastro": "2019-05-28T13:20:58Z",
                  "usuarioAtualizacao": null,
                  "dataAtualizacao": null
                },
                "filhos": []
              },
              {
                "idPai": 28,
                "codigo": "1.2.4.6",
                "descricao": "Outros",
                "id": 31,
                "auditoria": {
                  "usuarioCadastro": null,
                  "dataCadastro": "2019-05-28T13:21:40Z",
                  "usuarioAtualizacao": null,
                  "dataAtualizacao": null
                },
                "filhos": []
              },
              {
                "idPai": 28,
                "codigo": "1.2.4.3",
                "descricao": "Pagamentos Superior",
                "id": 98,
                "auditoria": {
                  "usuarioCadastro": null,
                  "dataCadastro": "2019-06-12T12:38:40Z",
                  "usuarioAtualizacao": null,
                  "dataAtualizacao": null
                },
                "filhos": []
              }
            ]
          },
          {
            "idPai": 24,
            "codigo": "1.2.60",
            "descricao": "Outras Receitas Financeiras",
            "id": 32,
            "auditoria": {
              "usuarioCadastro": null,
              "dataCadastro": "2019-05-28T13:23:03Z",
              "usuarioAtualizacao": null,
              "dataAtualizacao": null
            },
            "filhos": []
          }
        ]
      },
      {
        "idPai": 1,
        "codigo": "1.60",
        "descricao": "Outras Receitas",
        "id": 33,
        "auditoria": {
          "usuarioCadastro": null,
          "dataCadastro": "2019-05-28T13:24:08Z",
          "usuarioAtualizacao": null,
          "dataAtualizacao": null
        },
        "filhos": []
      }
    ]
  },
  {
    "idPai": null,
    "codigo": "2",
    "descricao": "Despesas",
    "id": 6,
    "auditoria": {
      "usuarioCadastro": null,
      "dataCadastro": "2019-05-24T14:28:39Z",
      "usuarioAtualizacao": null,
      "dataAtualizacao": null
    },
    "filhos": [
      {
        "idPai": 6,
        "codigo": "2.1",
        "descricao": "Despesas de Pessoal",
        "id": 8,
        "auditoria": {
          "usuarioCadastro": null,
          "dataCadastro": "2019-05-24T14:29:23Z",
          "usuarioAtualizacao": null,
          "dataAtualizacao": "2019-05-28T13:56:13Z"
        },
        "filhos": [
          {
            "idPai": 8,
            "codigo": "2.1.1",
            "descricao": "Pagamento de Fornecedores",
            "id": 9,
            "auditoria": {
              "usuarioCadastro": null,
              "dataCadastro": "2019-05-24T14:29:44Z",
              "usuarioAtualizacao": null,
              "dataAtualizacao": null
            },
            "filhos": []
          },
          {
            "idPai": 8,
            "codigo": "2.1.1",
            "descricao": "Salário",
            "id": 38,
            "auditoria": {
              "usuarioCadastro": null,
              "dataCadastro": "2019-05-28T14:06:33Z",
              "usuarioAtualizacao": null,
              "dataAtualizacao": null
            },
            "filhos": []
          },
          {
            "idPai": 8,
            "codigo": "2.1.2",
            "descricao": "Adiantamento Salarial",
            "id": 39,
            "auditoria": {
              "usuarioCadastro": null,
              "dataCadastro": "2019-05-28T14:07:02Z",
              "usuarioAtualizacao": null,
              "dataAtualizacao": null
            },
            "filhos": []
          },
          {
            "idPai": 8,
            "codigo": "2.1.3",
            "descricao": "Hora Extra",
            "id": 40,
            "auditoria": {
              "usuarioCadastro": null,
              "dataCadastro": "2019-05-28T14:07:20Z",
              "usuarioAtualizacao": null,
              "dataAtualizacao": null
            },
            "filhos": []
          },
          {
            "idPai": 8,
            "codigo": "2.1.5",
            "descricao": "Décimo Terceiro Salário",
            "id": 41,
            "auditoria": {
              "usuarioCadastro": null,
              "dataCadastro": "2019-05-28T14:07:43Z",
              "usuarioAtualizacao": null,
              "dataAtualizacao": null
            },
            "filhos": []
          },
          {
            "idPai": 8,
            "codigo": "2.1.6",
            "descricao": "Adiantamento Décimo Terceiro",
            "id": 42,
            "auditoria": {
              "usuarioCadastro": null,
              "dataCadastro": "2019-05-28T14:07:59Z",
              "usuarioAtualizacao": null,
              "dataAtualizacao": null
            },
            "filhos": []
          },
          {
            "idPai": 8,
            "codigo": "2.1.7",
            "descricao": "Salário família",
            "id": 43,
            "auditoria": {
              "usuarioCadastro": null,
              "dataCadastro": "2019-05-28T14:08:47Z",
              "usuarioAtualizacao": null,
              "dataAtualizacao": null
            },
            "filhos": []
          },
          {
            "idPai": 8,
            "codigo": "2.1.8",
            "descricao": "Adicional de função",
            "id": 44,
            "auditoria": {
              "usuarioCadastro": null,
              "dataCadastro": "2019-05-28T14:16:07Z",
              "usuarioAtualizacao": null,
              "dataAtualizacao": null
            },
            "filhos": []
          },
          {
            "idPai": 8,
            "codigo": "2.1.9",
            "descricao": "Aviso prévio",
            "id": 45,
            "auditoria": {
              "usuarioCadastro": null,
              "dataCadastro": "2019-05-28T14:16:19Z",
              "usuarioAtualizacao": null,
              "dataAtualizacao": null
            },
            "filhos": []
          },
          {
            "idPai": 8,
            "codigo": "2.1.10",
            "descricao": "INSS",
            "id": 46,
            "auditoria": {
              "usuarioCadastro": null,
              "dataCadastro": "2019-05-28T14:16:36Z",
              "usuarioAtualizacao": null,
              "dataAtualizacao": null
            },
            "filhos": []
          },
          {
            "idPai": 8,
            "codigo": "2.1.11",
            "descricao": "FGTS",
            "id": 47,
            "auditoria": {
              "usuarioCadastro": null,
              "dataCadastro": "2019-05-28T14:16:48Z",
              "usuarioAtualizacao": null,
              "dataAtualizacao": null
            },
            "filhos": []
          },
          {
            "idPai": 8,
            "codigo": "2.1.12",
            "descricao": "PIS",
            "id": 48,
            "auditoria": {
              "usuarioCadastro": null,
              "dataCadastro": "2019-05-28T14:17:00Z",
              "usuarioAtualizacao": null,
              "dataAtualizacao": null
            },
            "filhos": []
          },
          {
            "idPai": 8,
            "codigo": "2.1.13",
            "descricao": "Vale Refeição",
            "id": 49,
            "auditoria": {
              "usuarioCadastro": null,
              "dataCadastro": "2019-05-28T14:17:28Z",
              "usuarioAtualizacao": null,
              "dataAtualizacao": null
            },
            "filhos": []
          },
          {
            "idPai": 8,
            "codigo": "2.1.14",
            "descricao": "Vale Transporte",
            "id": 50,
            "auditoria": {
              "usuarioCadastro": null,
              "dataCadastro": "2019-05-28T14:18:09Z",
              "usuarioAtualizacao": null,
              "dataAtualizacao": null
            },
            "filhos": []
          },
          {
            "idPai": 8,
            "codigo": "2.1.15",
            "descricao": "Cesta Básica",
            "id": 51,
            "auditoria": {
              "usuarioCadastro": null,
              "dataCadastro": "2019-05-28T14:18:24Z",
              "usuarioAtualizacao": null,
              "dataAtualizacao": null
            },
            "filhos": []
          },
          {
            "idPai": 8,
            "codigo": "2.1.16",
            "descricao": "Uniformes",
            "id": 52,
            "auditoria": {
              "usuarioCadastro": null,
              "dataCadastro": "2019-05-28T14:18:35Z",
              "usuarioAtualizacao": null,
              "dataAtualizacao": null
            },
            "filhos": []
          },
          {
            "idPai": 8,
            "codigo": "2.1.17",
            "descricao": "Bonificações",
            "id": 53,
            "auditoria": {
              "usuarioCadastro": null,
              "dataCadastro": "2019-05-28T14:18:50Z",
              "usuarioAtualizacao": null,
              "dataAtualizacao": null
            },
            "filhos": []
          },
          {
            "idPai": 8,
            "codigo": "2.1.18",
            "descricao": "Processos Trabalhistas",
            "id": 54,
            "auditoria": {
              "usuarioCadastro": null,
              "dataCadastro": "2019-05-28T14:19:04Z",
              "usuarioAtualizacao": null,
              "dataAtualizacao": null
            },
            "filhos": []
          },
          {
            "idPai": 8,
            "codigo": "2.1.19",
            "descricao": "Contribuição Sindical",
            "id": 55,
            "auditoria": {
              "usuarioCadastro": null,
              "dataCadastro": "2019-05-28T14:19:21Z",
              "usuarioAtualizacao": null,
              "dataAtualizacao": null
            },
            "filhos": []
          },
          {
            "idPai": 8,
            "codigo": "2.1.20",
            "descricao": "Seguro Saúde",
            "id": 56,
            "auditoria": {
              "usuarioCadastro": null,
              "dataCadastro": "2019-05-28T14:19:39Z",
              "usuarioAtualizacao": null,
              "dataAtualizacao": null
            },
            "filhos": []
          },
          {
            "idPai": 8,
            "codigo": "2.1.21",
            "descricao": "Encargos de IRRF",
            "id": 57,
            "auditoria": {
              "usuarioCadastro": null,
              "dataCadastro": "2019-05-28T14:19:58Z",
              "usuarioAtualizacao": null,
              "dataAtualizacao": null
            },
            "filhos": []
          },
          {
            "idPai": 8,
            "codigo": "2.1.22",
            "descricao": "Vale Alimentação",
            "id": 58,
            "auditoria": {
              "usuarioCadastro": null,
              "dataCadastro": "2019-05-28T14:20:14Z",
              "usuarioAtualizacao": null,
              "dataAtualizacao": null
            },
            "filhos": []
          },
          {
            "idPai": 8,
            "codigo": "2.1.60",
            "descricao": "Outras de Pessoal",
            "id": 59,
            "auditoria": {
              "usuarioCadastro": null,
              "dataCadastro": "2019-05-28T14:20:31Z",
              "usuarioAtualizacao": null,
              "dataAtualizacao": null
            },
            "filhos": []
          },
          {
            "idPai": 8,
            "codigo": "1",
            "descricao": "Estoque",
            "id": 94,
            "auditoria": {
              "usuarioCadastro": null,
              "dataCadastro": "2019-06-04T01:32:17Z",
              "usuarioAtualizacao": null,
              "dataAtualizacao": null
            },
            "filhos": []
          },
          {
            "idPai": 8,
            "codigo": "1",
            "descricao": "Estoque",
            "id": 95,
            "auditoria": {
              "usuarioCadastro": null,
              "dataCadastro": "2019-06-04T01:32:17Z",
              "usuarioAtualizacao": null,
              "dataAtualizacao": null
            },
            "filhos": []
          }
        ]
      },
      {
        "idPai": 6,
        "codigo": "2.2",
        "descricao": "Operacionais",
        "id": 34,
        "auditoria": {
          "usuarioCadastro": null,
          "dataCadastro": "2019-05-28T13:40:34Z",
          "usuarioAtualizacao": null,
          "dataAtualizacao": "2019-05-28T13:58:59Z"
        },
        "filhos": [
          {
            "idPai": 34,
            "codigo": "2.2.1",
            "descricao": "Limpeza e Conservação",
            "id": 7,
            "auditoria": {
              "usuarioCadastro": null,
              "dataCadastro": "2019-05-24T14:29:06Z",
              "usuarioAtualizacao": null,
              "dataAtualizacao": "2019-05-28T14:13:22Z"
            },
            "filhos": []
          },
          {
            "idPai": 34,
            "codigo": "2.2.2",
            "descricao": "Jardinagem",
            "id": 60,
            "auditoria": {
              "usuarioCadastro": null,
              "dataCadastro": "2019-05-28T14:28:17Z",
              "usuarioAtualizacao": null,
              "dataAtualizacao": null
            },
            "filhos": []
          },
          {
            "idPai": 34,
            "codigo": "2.2.3",
            "descricao": "Energia Elétrica",
            "id": 61,
            "auditoria": {
              "usuarioCadastro": null,
              "dataCadastro": "2019-05-28T14:28:26Z",
              "usuarioAtualizacao": null,
              "dataAtualizacao": null
            },
            "filhos": []
          },
          {
            "idPai": 34,
            "codigo": "2.2.4",
            "descricao": "Agua e Esgoto",
            "id": 62,
            "auditoria": {
              "usuarioCadastro": null,
              "dataCadastro": "2019-05-28T14:28:39Z",
              "usuarioAtualizacao": null,
              "dataAtualizacao": null
            },
            "filhos": []
          },
          {
            "idPai": 34,
            "codigo": "2.2.5",
            "descricao": "Gás",
            "id": 63,
            "auditoria": {
              "usuarioCadastro": null,
              "dataCadastro": "2019-05-28T14:28:50Z",
              "usuarioAtualizacao": null,
              "dataAtualizacao": null
            },
            "filhos": []
          },
          {
            "idPai": 34,
            "codigo": "2.2.6",
            "descricao": "Telefone e Internet",
            "id": 64,
            "auditoria": {
              "usuarioCadastro": null,
              "dataCadastro": "2019-05-28T14:29:01Z",
              "usuarioAtualizacao": null,
              "dataAtualizacao": null
            },
            "filhos": []
          },
          {
            "idPai": 34,
            "codigo": "2.2.7",
            "descricao": "Prevenção de Incêndio",
            "id": 65,
            "auditoria": {
              "usuarioCadastro": null,
              "dataCadastro": "2019-05-28T14:29:14Z",
              "usuarioAtualizacao": null,
              "dataAtualizacao": null
            },
            "filhos": []
          },
          {
            "idPai": 34,
            "codigo": "2.2.8",
            "descricao": "Elevadores",
            "id": 66,
            "auditoria": {
              "usuarioCadastro": null,
              "dataCadastro": "2019-05-28T14:29:28Z",
              "usuarioAtualizacao": null,
              "dataAtualizacao": null
            },
            "filhos": []
          },
          {
            "idPai": 34,
            "codigo": "2.2.9",
            "descricao": "Lazer e Piscina",
            "id": 67,
            "auditoria": {
              "usuarioCadastro": null,
              "dataCadastro": "2019-05-28T14:29:54Z",
              "usuarioAtualizacao": null,
              "dataAtualizacao": null
            },
            "filhos": []
          },
          {
            "idPai": 34,
            "codigo": "2.2.10",
            "descricao": "Manutenção e Reformas",
            "id": 68,
            "auditoria": {
              "usuarioCadastro": null,
              "dataCadastro": "2019-05-28T14:34:11Z",
              "usuarioAtualizacao": null,
              "dataAtualizacao": null
            },
            "filhos": [
              {
                "idPai": 68,
                "codigo": "2.2.10.1",
                "descricao": "Hidráulica e Encanamentos",
                "id": 69,
                "auditoria": {
                  "usuarioCadastro": null,
                  "dataCadastro": "2019-05-28T14:34:36Z",
                  "usuarioAtualizacao": null,
                  "dataAtualizacao": null
                },
                "filhos": []
              },
              {
                "idPai": 68,
                "codigo": "2.2.10.2",
                "descricao": "Elétrica e Iluminação",
                "id": 70,
                "auditoria": {
                  "usuarioCadastro": null,
                  "dataCadastro": "2019-05-28T14:34:55Z",
                  "usuarioAtualizacao": null,
                  "dataAtualizacao": null
                },
                "filhos": []
              },
              {
                "idPai": 68,
                "codigo": "2.2.10.3",
                "descricao": "Estrutura e Cosmética",
                "id": 71,
                "auditoria": {
                  "usuarioCadastro": null,
                  "dataCadastro": "2019-05-28T14:35:27Z",
                  "usuarioAtualizacao": null,
                  "dataAtualizacao": null
                },
                "filhos": []
              },
              {
                "idPai": 68,
                "codigo": "2.2.10.60",
                "descricao": "Outras Manutenções",
                "id": 72,
                "auditoria": {
                  "usuarioCadastro": null,
                  "dataCadastro": "2019-05-28T14:35:44Z",
                  "usuarioAtualizacao": null,
                  "dataAtualizacao": null
                },
                "filhos": []
              }
            ]
          },
          {
            "idPai": 34,
            "codigo": "2.2.11",
            "descricao": "Segurança e Acesso",
            "id": 73,
            "auditoria": {
              "usuarioCadastro": null,
              "dataCadastro": "2019-05-28T14:39:39Z",
              "usuarioAtualizacao": null,
              "dataAtualizacao": null
            },
            "filhos": [
              {
                "idPai": 73,
                "codigo": "2.2.11.1",
                "descricao": "Sistemas de Segurança",
                "id": 74,
                "auditoria": {
                  "usuarioCadastro": null,
                  "dataCadastro": "2019-05-28T14:42:06Z",
                  "usuarioAtualizacao": null,
                  "dataAtualizacao": null
                },
                "filhos": []
              },
              {
                "idPai": 73,
                "codigo": "2.2.11.2",
                "descricao": "Câmeras e Alarmes",
                "id": 75,
                "auditoria": {
                  "usuarioCadastro": null,
                  "dataCadastro": "2019-05-28T14:42:14Z",
                  "usuarioAtualizacao": null,
                  "dataAtualizacao": null
                },
                "filhos": []
              },
              {
                "idPai": 73,
                "codigo": "2.2.11.3",
                "descricao": "Controle de Acesso",
                "id": 76,
                "auditoria": {
                  "usuarioCadastro": null,
                  "dataCadastro": "2019-05-28T14:43:07Z",
                  "usuarioAtualizacao": null,
                  "dataAtualizacao": null
                },
                "filhos": []
              },
              {
                "idPai": 73,
                "codigo": "2.2.11.4",
                "descricao": "Equipe de Segurança",
                "id": 77,
                "auditoria": {
                  "usuarioCadastro": null,
                  "dataCadastro": "2019-05-28T14:43:17Z",
                  "usuarioAtualizacao": null,
                  "dataAtualizacao": null
                },
                "filhos": []
              },
              {
                "idPai": 73,
                "codigo": "2.2.11.5",
                "descricao": "Portaria Remota",
                "id": 78,
                "auditoria": {
                  "usuarioCadastro": null,
                  "dataCadastro": "2019-05-28T14:44:08Z",
                  "usuarioAtualizacao": null,
                  "dataAtualizacao": null
                },
                "filhos": []
              },
              {
                "idPai": 73,
                "codigo": "2.2.11.60",
                "descricao": "Outras de Segurança",
                "id": 79,
                "auditoria": {
                  "usuarioCadastro": null,
                  "dataCadastro": "2019-05-28T14:49:46Z",
                  "usuarioAtualizacao": null,
                  "dataAtualizacao": null
                },
                "filhos": []
              }
            ]
          },
          {
            "idPai": 34,
            "codigo": "2.2.60",
            "descricao": "Outras Operacionais",
            "id": 80,
            "auditoria": {
              "usuarioCadastro": null,
              "dataCadastro": "2019-05-28T14:53:04Z",
              "usuarioAtualizacao": null,
              "dataAtualizacao": null
            },
            "filhos": []
          }
        ]
      },
      {
        "idPai": 6,
        "codigo": "2.3",
        "descricao": "Administrativas",
        "id": 35,
        "auditoria": {
          "usuarioCadastro": null,
          "dataCadastro": "2019-05-28T14:00:06Z",
          "usuarioAtualizacao": null,
          "dataAtualizacao": null
        },
        "filhos": [
          {
            "idPai": 35,
            "codigo": "2.3.1",
            "descricao": "Administração",
            "id": 81,
            "auditoria": {
              "usuarioCadastro": null,
              "dataCadastro": "2019-05-28T14:55:03Z",
              "usuarioAtualizacao": null,
              "dataAtualizacao": null
            },
            "filhos": []
          },
          {
            "idPai": 35,
            "codigo": "2.3.2",
            "descricao": "Jurídico e Advocatício",
            "id": 82,
            "auditoria": {
              "usuarioCadastro": null,
              "dataCadastro": "2019-05-28T14:55:15Z",
              "usuarioAtualizacao": null,
              "dataAtualizacao": null
            },
            "filhos": []
          },
          {
            "idPai": 35,
            "codigo": "2.3.3",
            "descricao": "Cartorário e Correios",
            "id": 83,
            "auditoria": {
              "usuarioCadastro": null,
              "dataCadastro": "2019-05-28T14:55:29Z",
              "usuarioAtualizacao": null,
              "dataAtualizacao": null
            },
            "filhos": []
          },
          {
            "idPai": 35,
            "codigo": "2.3.4",
            "descricao": "Consultoria",
            "id": 84,
            "auditoria": {
              "usuarioCadastro": null,
              "dataCadastro": "2019-05-28T14:55:42Z",
              "usuarioAtualizacao": null,
              "dataAtualizacao": null
            },
            "filhos": []
          },
          {
            "idPai": 35,
            "codigo": "2.3.5",
            "descricao": "Suprimentos",
            "id": 85,
            "auditoria": {
              "usuarioCadastro": null,
              "dataCadastro": "2019-05-28T14:55:52Z",
              "usuarioAtualizacao": null,
              "dataAtualizacao": null
            },
            "filhos": []
          },
          {
            "idPai": 35,
            "codigo": "2.3.6",
            "descricao": "Informática",
            "id": 86,
            "auditoria": {
              "usuarioCadastro": null,
              "dataCadastro": "2019-05-28T14:56:01Z",
              "usuarioAtualizacao": null,
              "dataAtualizacao": null
            },
            "filhos": []
          },
          {
            "idPai": 35,
            "codigo": "2.3.7",
            "descricao": "Gráfica e Impressões",
            "id": 87,
            "auditoria": {
              "usuarioCadastro": null,
              "dataCadastro": "2019-05-28T14:56:16Z",
              "usuarioAtualizacao": null,
              "dataAtualizacao": null
            },
            "filhos": []
          },
          {
            "idPai": 35,
            "codigo": "2.3.8",
            "descricao": "Despesas Bancárias",
            "id": 88,
            "auditoria": {
              "usuarioCadastro": null,
              "dataCadastro": "2019-05-28T14:56:27Z",
              "usuarioAtualizacao": null,
              "dataAtualizacao": null
            },
            "filhos": []
          },
          {
            "idPai": 35,
            "codigo": "2.3.9",
            "descricao": "Despesas Financeiras",
            "id": 89,
            "auditoria": {
              "usuarioCadastro": null,
              "dataCadastro": "2019-05-28T14:56:42Z",
              "usuarioAtualizacao": null,
              "dataAtualizacao": null
            },
            "filhos": []
          },
          {
            "idPai": 35,
            "codigo": "2.3.10",
            "descricao": "Retenção de Serviços Tomados",
            "id": 90,
            "auditoria": {
              "usuarioCadastro": null,
              "dataCadastro": "2019-05-28T14:56:55Z",
              "usuarioAtualizacao": null,
              "dataAtualizacao": null
            },
            "filhos": []
          },
          {
            "idPai": 35,
            "codigo": "2.3.11",
            "descricao": "Seguros",
            "id": 91,
            "auditoria": {
              "usuarioCadastro": null,
              "dataCadastro": "2019-05-28T14:57:06Z",
              "usuarioAtualizacao": null,
              "dataAtualizacao": null
            },
            "filhos": []
          },
          {
            "idPai": 35,
            "codigo": "2.3.11",
            "descricao": "Abatimentos",
            "id": 92,
            "auditoria": {
              "usuarioCadastro": null,
              "dataCadastro": "2019-05-28T14:57:19Z",
              "usuarioAtualizacao": null,
              "dataAtualizacao": null
            },
            "filhos": []
          },
          {
            "idPai": 35,
            "codigo": "2.3.60",
            "descricao": "Outras Administrativas",
            "id": 93,
            "auditoria": {
              "usuarioCadastro": null,
              "dataCadastro": "2019-05-28T14:57:47Z",
              "usuarioAtualizacao": null,
              "dataAtualizacao": null
            },
            "filhos": []
          }
        ]
      },
      {
        "idPai": 6,
        "codigo": "2.60",
        "descricao": "Outras Despesas Gerais",
        "id": 36,
        "auditoria": {
          "usuarioCadastro": null,
          "dataCadastro": "2019-05-28T14:00:21Z",
          "usuarioAtualizacao": null,
          "dataAtualizacao": null
        },
        "filhos": []
      },
      {
        "idPai": 6,
        "codigo": "2.999999",
        "descricao": "Não categorizado",
        "id": 37,
        "auditoria": {
          "usuarioCadastro": null,
          "dataCadastro": "2019-05-28T14:00:56Z",
          "usuarioAtualizacao": null,
          "dataAtualizacao": null
        },
        "filhos": []
      }
    ]
  },
  {
    "idPai": null,
    "codigo": "3",
    "descricao": "NOVO PLANO SUPERIOR",
    "id": 99,
    "auditoria": {
      "usuarioCadastro": null,
      "dataCadastro": "2019-06-12T12:42:00Z",
      "usuarioAtualizacao": null,
      "dataAtualizacao": null
    },
    "filhos": [
      {
        "idPai": 99,
        "codigo": "3.1",
        "descricao": "Outro qualquer",
        "id": 100,
        "auditoria": {
          "usuarioCadastro": null,
          "dataCadastro": "2019-06-12T14:05:37Z",
          "usuarioAtualizacao": null,
          "dataAtualizacao": "2019-06-12T14:13:47Z"
        },
        "filhos": []
      },
      {
        "idPai": 99,
        "codigo": "3.2",
        "descricao": "Teste",
        "id": 101,
        "auditoria": {
          "usuarioCadastro": null,
          "dataCadastro": "2019-06-12T14:14:38Z",
          "usuarioAtualizacao": null,
          "dataAtualizacao": null
        },
        "filhos": []
      },
      {
        "idPai": 99,
        "codigo": "3.3",
        "descricao": "novo",
        "id": 102,
        "auditoria": {
          "usuarioCadastro": null,
          "dataCadastro": "2019-06-12T14:14:52Z",
          "usuarioAtualizacao": null,
          "dataAtualizacao": null
        },
        "filhos": []
      }
    ]
  },
  {
    "idPai": null,
    "codigo": "4",
    "descricao": "TESTE",
    "id": 103,
    "auditoria": {
      "usuarioCadastro": null,
      "dataCadastro": "2019-06-12T14:24:48Z",
      "usuarioAtualizacao": null,
      "dataAtualizacao": null
    },
    "filhos": []
  },
  {
    "idPai": null,
    "codigo": "4",
    "descricao": "TESTE",
    "id": 104,
    "auditoria": {
      "usuarioCadastro": null,
      "dataCadastro": "2019-06-12T14:25:39Z",
      "usuarioAtualizacao": null,
      "dataAtualizacao": null
    },
    "filhos": []
  },
  {
    "idPai": null,
    "codigo": "4",
    "descricao": "teste",
    "id": 105,
    "auditoria": {
      "usuarioCadastro": null,
      "dataCadastro": "2019-06-12T14:26:25Z",
      "usuarioAtualizacao": null,
      "dataAtualizacao": null
    },
    "filhos": []
  },
  {
    "idPai": null,
    "codigo": "4",
    "descricao": "teste",
    "id": 106,
    "auditoria": {
      "usuarioCadastro": null,
      "dataCadastro": "2019-06-12T14:27:23Z",
      "usuarioAtualizacao": null,
      "dataAtualizacao": null
    },
    "filhos": [
      {
        "idPai": 106,
        "codigo": "4.1",
        "descricao": "novo",
        "id": 107,
        "auditoria": {
          "usuarioCadastro": null,
          "dataCadastro": "2019-06-12T14:27:34Z",
          "usuarioAtualizacao": null,
          "dataAtualizacao": null
        },
        "filhos": []
      },
      {
        "idPai": 106,
        "codigo": "4.2",
        "descricao": "novo item",
        "id": 108,
        "auditoria": {
          "usuarioCadastro": null,
          "dataCadastro": "2019-06-12T16:31:34Z",
          "usuarioAtualizacao": null,
          "dataAtualizacao": null
        },
        "filhos": []
      }
    ]
  }
]