{
  "development": {
    "username": "postgres",
    "password": "ryushikimura",
    "database": "chapter_6",
    "host": "localhost",
    "dialect": "postgres",
    "port" : 8080
  },
  "test": {
    "username": "root",
    "password": null,
    "database": "database_test",
    "host": "127.0.0.1",
    "dialect": "mysql"
  },
  "production": {
    "username": "root",
    "password": null,
    "database": "database_production",
    "host": "127.0.0.1",
    "dialect": "mysql"
  }
}
