{
  "version": "14.0.4",
  "vulnerabilities": [
    {
      "id": "eaa3d2c118ef66d058ca966ee31064b5a1cb5417f5de63fbc4c437e2fc8722e6",
      "category": "secret_detection",
      "name": "RSA private key",
      "message": "RSA private key detected; please remove and revoke it if this is a leak.",
      "description": "RSA private key",
      "cve": "id_rsa:8bcac7908eb950419537b91e19adc83ce2c9cbfdacf4f81157fdadfec11f7017:RSA private key",
      "severity": "Critical",
      "confidence": "Unknown",
      "raw_source_code_extract": "-----BEGIN RSA PRIVATE KEY-----",
      "scanner": {
        "id": "gitleaks",
        "name": "Gitleaks"
      },
      "location": {
        "file": "id_rsa",
        "commit": {
          "sha": "0000000"
        },
        "start_line": 1
      },
      "identifiers": [
        {
          "type": "gitleaks_rule_id",
          "name": "Gitleaks rule ID RSA private key",
          "value": "RSA private key"
        }
      ]
    },
    {
      "id": "84208f42e50f315314324ffb58cc2cab234e1be6bc42f8270e35ba13cc5b0141",
      "category": "secret_detection",
      "name": "AWS Access Token",
      "message": "AWS Access Token detected; please remove and revoke it if this is a leak.",
      "description": "AWS Access Token",
      "cve": "keys/aws:4dc0376c1c8fd35a454f62ea011e80b28b512fdea09cfb476169ed4ca26c1460:AWS",
      "severity": "Critical",
      "confidence": "Unknown",
      "raw_source_code_extract": "AKIAXYZDQCENR3HDDQGL",
      "scanner": {
        "id": "gitleaks",
        "name": "Gitleaks"
      },
      "location": {
        "file": "keys/aws",
        "commit": {
          "sha": "0000000"
        },
        "start_line": 2
      },
      "identifiers": [
        {
          "type": "gitleaks_rule_id",
          "name": "Gitleaks rule ID AWS",
          "value": "AWS"
        }
      ]
    },
    {
      "id": "bdc48d59f96f069c12c36ce72f9aa623ead8dc005f47e8b944da318a00ece6d4",
      "category": "secret_detection",
      "name": "SSH private key",
      "message": "SSH private key detected; please remove and revoke it if this is a leak.",
      "description": "SSH private key",
      "cve": "keys/dsa_key:03d104c669e3c7b6be7f989db8b12c8b910d3be8c1e2a73c9369d3cc0ba803b5:SSH private key",
      "severity": "Critical",
      "confidence": "Unknown",
      "raw_source_code_extract": "-----BEGIN OPENSSH PRIVATE KEY-----",
      "scanner": {
        "id": "gitleaks",
        "name": "Gitleaks"
      },
      "location": {
        "file": "keys/dsa_key",
        "commit": {
          "sha": "0000000"
        },
        "start_line": 1
      },
      "identifiers": [
        {
          "type": "gitleaks_rule_id",
          "name": "Gitleaks rule ID SSH private key",
          "value": "SSH private key"
        }
      ]
    },
    {
      "id": "9cdc957abe3c5920f95981644e26a8c3c0fe8f9cb2cf89d05c4ee7cd7fec0164",
      "category": "secret_detection",
      "name": "SSH private key",
      "message": "SSH private key detected; please remove and revoke it if this is a leak.",
      "description": "SSH private key",
      "cve": "keys/ecdsa_key:03d104c669e3c7b6be7f989db8b12c8b910d3be8c1e2a73c9369d3cc0ba803b5:SSH private key",
      "severity": "Critical",
      "confidence": "Unknown",
      "raw_source_code_extract": "-----BEGIN OPENSSH PRIVATE KEY-----",
      "scanner": {
        "id": "gitleaks",
        "name": "Gitleaks"
      },
      "location": {
        "file": "keys/ecdsa_key",
        "commit": {
          "sha": "0000000"
        },
        "start_line": 1
      },
      "identifiers": [
        {
          "type": "gitleaks_rule_id",
          "name": "Gitleaks rule ID SSH private key",
          "value": "SSH private key"
        }
      ]
    },
    {
      "id": "5bed13886c748fd319e80564733b423ef7477f635dcde68541b2657b300b3bb4",
      "category": "secret_detection",
      "name": "SSH private key",
      "message": "SSH private key detected; please remove and revoke it if this is a leak.",
      "description": "SSH private key",
      "cve": "keys/ed25519_key:03d104c669e3c7b6be7f989db8b12c8b910d3be8c1e2a73c9369d3cc0ba803b5:SSH private key",
      "severity": "Critical",
      "confidence": "Unknown",
      "raw_source_code_extract": "-----BEGIN OPENSSH PRIVATE KEY-----",
      "scanner": {
        "id": "gitleaks",
        "name": "Gitleaks"
      },
      "location": {
        "file": "keys/ed25519_key",
        "commit": {
          "sha": "0000000"
        },
        "start_line": 1
      },
      "identifiers": [
        {
          "type": "gitleaks_rule_id",
          "name": "Gitleaks rule ID SSH private key",
          "value": "SSH private key"
        }
      ]
    },
    {
      "id": "a5255c29a780c49819e0685e2362b0a23fdda379ba9462b71d321933e50cf432",
      "category": "secret_detection",
      "name": "PGP private key",
      "message": "PGP private key detected; please remove and revoke it if this is a leak.",
      "description": "PGP private key",
      "cve": "keys/pgp_ecc_key:8a1ddaa7dab83b9a5ffe092bc3aad1df30c2e0be6246aee0a0da616d628d1da7:PGP private key",
      "severity": "Critical",
      "confidence": "Unknown",
      "raw_source_code_extract": "-----BEGIN PGP PRIVATE KEY BLOCK-----",
      "scanner": {
        "id": "gitleaks",
        "name": "Gitleaks"
      },
      "location": {
        "file": "keys/pgp_ecc_key",
        "commit": {
          "sha": "0000000"
        },
        "start_line": 1
      },
      "identifiers": [
        {
          "type": "gitleaks_rule_id",
          "name": "Gitleaks rule ID PGP private key",
          "value": "PGP private key"
        }
      ]
    },
    {
      "id": "295dc1691a7a7aafc7ebd742fdf760b892087448ef6f725d02afc0daedb19990",
      "category": "secret_detection",
      "name": "PGP private key",
      "message": "PGP private key detected; please remove and revoke it if this is a leak.",
      "description": "PGP private key",
      "cve": "keys/pgp_rsa_key:8a1ddaa7dab83b9a5ffe092bc3aad1df30c2e0be6246aee0a0da616d628d1da7:PGP private key",
      "severity": "Critical",
      "confidence": "Unknown",
      "raw_source_code_extract": "-----BEGIN PGP PRIVATE KEY BLOCK-----",
      "scanner": {
        "id": "gitleaks",
        "name": "Gitleaks"
      },
      "location": {
        "file": "keys/pgp_rsa_key",
        "commit": {
          "sha": "0000000"
        },
        "start_line": 1
      },
      "identifiers": [
        {
          "type": "gitleaks_rule_id",
          "name": "Gitleaks rule ID PGP private key",
          "value": "PGP private key"
        }
      ]
    },
    {
      "id": "08095105fd8d19cc26a9b9564b15633de1d92d55a82aa129233a6fb71e31a092",
      "category": "secret_detection",
      "name": "SSH private key",
      "message": "SSH private key detected; please remove and revoke it if this is a leak.",
      "description": "SSH private key",
      "cve": "keys/rsa_key:03d104c669e3c7b6be7f989db8b12c8b910d3be8c1e2a73c9369d3cc0ba803b5:SSH private key",
      "severity": "Critical",
      "confidence": "Unknown",
      "raw_source_code_extract": "-----BEGIN OPENSSH PRIVATE KEY-----",
      "scanner": {
        "id": "gitleaks",
        "name": "Gitleaks"
      },
      "location": {
        "file": "keys/rsa_key",
        "commit": {
          "sha": "0000000"
        },
        "start_line": 1
      },
      "identifiers": [
        {
          "type": "gitleaks_rule_id",
          "name": "Gitleaks rule ID SSH private key",
          "value": "SSH private key"
        }
      ]
    },
    {
      "id": "5a59ed87923380379a6be8dbeb6bdb280a3824aaf232b0d7fe54a13bde4fd164",
      "category": "secret_detection",
      "name": "Slack token",
      "message": "Slack token detected; please remove and revoke it if this is a leak.",
      "description": "Slack token",
      "cve": "keys/slack_key:a3d4d73ddd6fdcb519e9be3e834a091ff75a8a4a193f7378e9ed3a4cfdb6839c:Slack token",
      "severity": "Critical",
      "confidence": "Unknown",
      "raw_source_code_extract": "xoxp-905439787527",
      "scanner": {
        "id": "gitleaks",
        "name": "Gitleaks"
      },
      "location": {
        "file": "keys/slack_key",
        "commit": {
          "sha": "0000000"
        },
        "start_line": 2
      },
      "identifiers": [
        {
          "type": "gitleaks_rule_id",
          "name": "Gitleaks rule ID Slack token",
          "value": "Slack token"
        }
      ]
    },
    {
      "id": "dc6e1b302ab5c2480de5262420c162e76a963009e52d89549da412e2e71e05c1",
      "category": "secret_detection",
      "name": "Stripe",
      "message": "Stripe detected; please remove and revoke it if this is a leak.",
      "description": "Stripe",
      "cve": "keys/stripe_key:2cafc0970149a84f3b9e62eaf169f36f59907a3b3e31f7b82e68c69cd27f7326:Stripe",
      "severity": "Critical",
      "confidence": "Unknown",
      "raw_source_code_extract": "sk_test_4eC39HqLyjWDarjtT1zdp7dc",
      "scanner": {
        "id": "gitleaks",
        "name": "Gitleaks"
      },
      "location": {
        "file": "keys/stripe_key",
        "commit": {
          "sha": "0000000"
        },
        "start_line": 1
      },
      "identifiers": [
        {
          "type": "gitleaks_rule_id",
          "name": "Gitleaks rule ID Stripe",
          "value": "Stripe"
        }
      ]
    },
    {
      "id": "fa76b5d38e2c67b113ba8ac0fe31f639c13dbc4e14c42abbe1437d423a7f84d3",
      "category": "secret_detection",
      "name": "Stripe",
      "message": "Stripe detected; please remove and revoke it if this is a leak.",
      "description": "Stripe",
      "cve": "keys/stripe_key:78a08441f4314f0a2833cfe58c62e555a162264206982cda39f6804f5048f570:Stripe",
      "severity": "Critical",
      "confidence": "Unknown",
      "raw_source_code_extract": "sk_live_4eC39HqLyjWDarjtT1zdp7dc",
      "scanner": {
        "id": "gitleaks",
        "name": "Gitleaks"
      },
      "location": {
        "file": "keys/stripe_key",
        "commit": {
          "sha": "0000000"
        },
        "start_line": 2
      },
      "identifiers": [
        {
          "type": "gitleaks_rule_id",
          "name": "Gitleaks rule ID Stripe",
          "value": "Stripe"
        }
      ]
    },
    {
      "id": "33aa67a26dc751cad650a5f7478be95f136f50cfb55e4afc64b33c799b97a6e8",
      "category": "secret_detection",
      "name": "PKCS8 private key",
      "message": "PKCS8 private key detected; please remove and revoke it if this is a leak.",
      "description": "PKCS8 private key",
      "cve": "keys/testkeys-110044-23ecb974342473e425f395ddd5f8f787ac6be90d.json:3021d90eb9437b2d8f30e8363695c4418b5e5f1870801b5c317e9398ee0f572d:PKCS8 private key",
      "severity": "Critical",
      "confidence": "Unknown",
      "raw_source_code_extract": "-----BEGIN PRIVATE KEY-----",
      "scanner": {
        "id": "gitleaks",
        "name": "Gitleaks"
      },
      "location": {
        "file": "keys/testkeys-110044-23ecb974342473e425f395ddd5f8f787ac6be90d.json",
        "commit": {
          "sha": "0000000"
        },
        "start_line": 5
      },
      "identifiers": [
        {
          "type": "gitleaks_rule_id",
          "name": "Gitleaks rule ID PKCS8 private key",
          "value": "PKCS8 private key"
        }
      ]
    },
    {
      "id": "c1124e6f1064f6481bc05824c8eeb3afce7d7a9a935b4c018085a7e799684c03",
      "category": "secret_detection",
      "name": "Google (GCP) Service-account",
      "message": "Google (GCP) Service-account detected; please remove and revoke it if this is a leak.",
      "description": "Google (GCP) Service-account",
      "cve": "keys/testkeys-110044-23ecb974342473e425f395ddd5f8f787ac6be90d.json:f8c792f8e908ff42f50978a418f4e9bb365deb4022ad2d51302cd304378b6fbb:Google (GCP) Service-account",
      "severity": "Critical",
      "confidence": "Unknown",
      "raw_source_code_extract": "\"type\": \"service_account\"",
      "scanner": {
        "id": "gitleaks",
        "name": "Gitleaks"
      },
      "location": {
        "file": "keys/testkeys-110044-23ecb974342473e425f395ddd5f8f787ac6be90d.json",
        "commit": {
          "sha": "0000000"
        },
        "start_line": 2
      },
      "identifiers": [
        {
          "type": "gitleaks_rule_id",
          "name": "Gitleaks rule ID Google (GCP) Service-account",
          "value": "Google (GCP) Service-account"
        }
      ]
    },
    {
      "id": "f48656bc1f3e888a1d7fa9df08a379fd6a2e89d64e9cdaef04569d08c3c127d7",
      "category": "secret_detection",
      "name": "Twilio API Key",
      "message": "Twilio API Key detected; please remove and revoke it if this is a leak.",
      "description": "Twilio API Key",
      "cve": "keys/twilio_key:f1661a9fc9996bb2f96465be1b4597de36ddad2a632ac785b8454e47f68ff225:Twilio API Key",
      "severity": "Critical",
      "confidence": "Unknown",
      "raw_source_code_extract": "SK0d066e24e71f21242e4ea5ba4781bb02",
      "scanner": {
        "id": "gitleaks",
        "name": "Gitleaks"
      },
      "location": {
        "file": "keys/twilio_key",
        "commit": {
          "sha": "0000000"
        },
        "start_line": 1
      },
      "identifiers": [
        {
          "type": "gitleaks_rule_id",
          "name": "Gitleaks rule ID Twilio API Key",
          "value": "Twilio API Key"
        }
      ]
    },
    {
      "id": "114bbaa5bb6da893e91d39175225572b15fed6d8bf95ce1ed67209973d136c72",
      "category": "secret_detection",
      "name": "AWS Access Token",
      "message": "AWS Access Token detected; please remove and revoke it if this is a leak.",
      "description": "AWS Access Token",
      "cve": "main.php:1a5d44a2dca19669d72edf4c4f1c27c4c1ca4b4408fbb17f6ce4ad452d78ddb3:AWS",
      "severity": "Critical",
      "confidence": "Unknown",
      "raw_source_code_extract": "AKIAIOSFODNN7EXAMPLE",
      "scanner": {
        "id": "gitleaks",
        "name": "Gitleaks"
      },
      "location": {
        "file": "main.php",
        "commit": {
          "sha": "0000000"
        },
        "start_line": 10
      },
      "identifiers": [
        {
          "type": "gitleaks_rule_id",
          "name": "Gitleaks rule ID AWS",
          "value": "AWS"
        }
      ]
    },
    {
      "id": "0af6e62070201eabe027457a5c0db6463038c6693e7d3210a5eab955b9a10fc6",
      "category": "secret_detection",
      "name": "Heroku API Key",
      "message": "Heroku API Key detected; please remove and revoke it if this is a leak.",
      "description": "Heroku API Key",
      "cve": "main.php:4458687e490be9d9922a46c2a6510bce919e3de987e01635250911a4077c6aa4:Heroku API Key",
      "severity": "Critical",
      "confidence": "Unknown",
      "raw_source_code_extract": "12345678-ABCD-ABCD-ABCD-1234567890AB",
      "scanner": {
        "id": "gitleaks",
        "name": "Gitleaks"
      },
      "location": {
        "file": "main.php",
        "commit": {
          "sha": "0000000"
        },
        "start_line": 13
      },
      "identifiers": [
        {
          "type": "gitleaks_rule_id",
          "name": "Gitleaks rule ID Heroku API Key",
          "value": "Heroku API Key"
        }
      ]
    },
    {
      "id": "6fdafea8bb90423346032c7aa744b157ecb53a341b0fada71ade65e0aeaa30d2",
      "category": "secret_detection",
      "name": "RSA private key",
      "message": "RSA private key detected; please remove and revoke it if this is a leak.",
      "description": "RSA private key",
      "cve": "main.php:8bcac7908eb950419537b91e19adc83ce2c9cbfdacf4f81157fdadfec11f7017:RSA private key",
      "severity": "Critical",
      "confidence": "Unknown",
      "raw_source_code_extract": "-----BEGIN RSA PRIVATE KEY-----",
      "scanner": {
        "id": "gitleaks",
        "name": "Gitleaks"
      },
      "location": {
        "file": "main.php",
        "commit": {
          "sha": "0000000"
        },
        "start_line": 14
      },
      "identifiers": [
        {
          "type": "gitleaks_rule_id",
          "name": "Gitleaks rule ID RSA private key",
          "value": "RSA private key"
        }
      ]
    },
    {
      "id": "0cfe3c0b1e190552aac0ed23c981674b79fbdc061d620f74724a55130666dc84",
      "category": "secret_detection",
      "name": "GitLab Personal Access Token",
      "message": "GitLab Personal Access Token detected; please remove and revoke it if this is a leak.",
      "description": "GitLab Personal Access Token",
      "cve": "main.php:fb91714620c4d175f8c42063953096ac4df413fd8e16608cf96d1a03f080434a:gitlab_personal_access_token",
      "severity": "Critical",
      "confidence": "Unknown",
      "raw_source_code_extract": "glpat--8GMtG8Mf4EnMJzmAWDU",
      "scanner": {
        "id": "gitleaks",
        "name": "Gitleaks"
      },
      "location": {
        "file": "main.php",
        "commit": {
          "sha": "0000000"
        },
        "start_line": 53
      },
      "identifiers": [
        {
          "type": "gitleaks_rule_id",
          "name": "Gitleaks rule ID gitlab_personal_access_token",
          "value": "gitlab_personal_access_token"
        }
      ]
    },
    {
      "id": "5d6cd42c449d1133fdf9d1461618f12af33b778fc8106828747ef1318e9c3fb2",
      "category": "secret_detection",
      "name": "Mailgun private API token",
      "message": "Mailgun private API token detected; please remove and revoke it if this is a leak.",
      "description": "Mailgun private API token",
      "cve": "secrets.go:03850589ea1b6abaada4bc2471ef04dff5f13cc16237c36c60eac0ed0e5ba75c:Mailgun private API token",
      "severity": "Critical",
      "confidence": "Unknown",
      "raw_source_code_extract": "key-dcc68f3f32ecee4dbe156cbd869db54f",
      "scanner": {
        "id": "gitleaks",
        "name": "Gitleaks"
      },
      "location": {
        "file": "secrets.go",
        "commit": {
          "sha": "0000000"
        },
        "start_line": 72
      },
      "identifiers": [
        {
          "type": "gitleaks_rule_id",
          "name": "Gitleaks rule ID Mailgun private API token",
          "value": "Mailgun private API token"
        }
      ]
    },
    {
      "id": "4dd0f0b6022d7fc0c79cd7da3ba033f8f2021afe14fc562eda27348617542c39",
      "category": "secret_detection",
      "name": "Flutterwave public key",
      "message": "Flutterwave public key detected; please remove and revoke it if this is a leak.",
      "description": "Flutterwave public key",
      "cve": "secrets.go:042bd779e01b472ad5d83c45665adcf10abb2b0e6af0e685eee20009c36ba59e:Flutterwave public key",
      "severity": "Critical",
      "confidence": "Unknown",
      "raw_source_code_extract": "FLWPUBK_TEST-3ffc862cbaff344d1ad33d81109e0db6-X",
      "scanner": {
        "id": "gitleaks",
        "name": "Gitleaks"
      },
      "location": {
        "file": "secrets.go",
        "commit": {
          "sha": "0000000"
        },
        "start_line": 40
      },
      "identifiers": [
        {
          "type": "gitleaks_rule_id",
          "name": "Gitleaks rule ID Flutterwave public key",
          "value": "Flutterwave public key"
        }
      ]
    },
    {
      "id": "145816b752a69c201865a257f6ac1e41da1c06f451cd5cc6ebf2840d3a9f9176",
      "category": "secret_detection",
      "name": "New Relic user API ID",
      "message": "New Relic user API ID detected; please remove and revoke it if this is a leak.",
      "description": "New Relic user API ID",
      "cve": "secrets.go:0585e3f03b5c4269a44db033622910d45f0c4ccf23f5946f4bf7ec32645d8c24:New Relic user API ID",
      "severity": "Critical",
      "confidence": "Unknown",
      "raw_source_code_extract": "8ECC3D9A863BDE368D12EBC661C697212DEF4549B1EE56B5BDAAFA1CD7F2D979",
      "scanner": {
        "id": "gitleaks",
        "name": "Gitleaks"
      },
      "location": {
        "file": "secrets.go",
        "commit": {
          "sha": "0000000"
        },
        "start_line": 86
      },
      "identifiers": [
        {
          "type": "gitleaks_rule_id",
          "name": "Gitleaks rule ID New Relic user API ID",
          "value": "New Relic user API ID"
        }
      ]
    },
    {
      "id": "51f2fe85a5443f6f474739c8685edf702837bb8b2876cc462bc57006cc04eeeb",
      "category": "secret_detection",
      "name": "Dropbox short lived API token",
      "message": "Dropbox short lived API token detected; please remove and revoke it if this is a leak.",
      "description": "Dropbox short lived API token",
      "cve": "secrets.go:05a9efcb6dc349539cd777f56af5996e822a647618b024fc3dbaf61a9c32514c:Dropbox short lived API token",
      "severity": "Critical",
      "confidence": "Unknown",
      "raw_source_code_extract": "DropboxShortLivedAccessToken = \"sl.A7pTsyLKWoDvMKXhdKEz9R6ZO7Tf6HJqr0jdogqnCrYrYROA75rSFomkqvEbAdTb3gQVbP18yVkfPhChqVtNMt6398ipek5_StUTrHolTfBizojfwP",
      "scanner": {
        "id": "gitleaks",
        "name": "Gitleaks"
      },
      "location": {
        "file": "secrets.go",
        "commit": {
          "sha": "0000000"
        },
        "start_line": 27
      },
      "identifiers": [
        {
          "type": "gitleaks_rule_id",
          "name": "Gitleaks rule ID Dropbox short lived API token",
          "value": "Dropbox short lived API token"
        }
      ]
    },
    {
      "id": "ad8df55b482a658db92e5d98186601ba65b569e8c742d6c395141c0421c8b04a",
      "category": "secret_detection",
      "name": "Grafana API token",
      "message": "Grafana API token detected; please remove and revoke it if this is a leak.",
      "description": "Grafana API token",
      "cve": "secrets.go:0e625ca6663dd3932c19f9ae0b840090ec38bd028182c27e4c743fad98a94ddd:Grafana API token",
      "severity": "Critical",
      "confidence": "Unknown",
      "raw_source_code_extract": "\"eyJrIjoiWWpNc1ZPS5RjdjdHTWlyVmtTcjI0Vk9xN1RkOGI1V3YiLCJuIjoieZl5b19vb30vb23iLCJpZCI6MX0=\"",
      "scanner": {
        "id": "gitleaks",
        "name": "Gitleaks"
      },
      "location": {
        "file": "secrets.go",
        "commit": {
          "sha": "0000000"
        },
        "start_line": 50
      },
      "identifiers": [
        {
          "type": "gitleaks_rule_id",
          "name": "Gitleaks rule ID Grafana API token",
          "value": "Grafana API token"
        }
      ]
    },
    {
      "id": "80bba79edc23638c38e68501b8375c1ecf6dbafc0fc5ed3cc8536a6ed9c2bce9",
      "category": "secret_detection",
      "name": "Contentful delivery API token",
      "message": "Contentful delivery API token detected; please remove and revoke it if this is a leak.",
      "description": "Contentful delivery API token",
      "cve": "secrets.go:0ed1e3937d4168124795470aea45c8643a69cff840621b3ef28ac0542212a222:Contentful delivery API token",
      "severity": "Critical",
      "confidence": "Unknown",
      "raw_source_code_extract": "0TNLpl9EbaoiefqjsMLM1hQ-bwZuZbJgmnD4teg2o59",
      "scanner": {
        "id": "gitleaks",
        "name": "Gitleaks"
      },
      "location": {
        "file": "secrets.go",
        "commit": {
          "sha": "0000000"
        },
        "start_line": 15
      },
      "identifiers": [
        {
          "type": "gitleaks_rule_id",
          "name": "Gitleaks rule ID Contentful delivery API token",
          "value": "Contentful delivery API token"
        }
      ]
    },
    {
      "id": "cf0aa56dd1656fba122d0b58f07b8c12c0d4a8e9cd75faf48a1c341f9dc5e4f1",
      "category": "secret_detection",
      "name": "Contentful preview API token",
      "message": "Contentful preview API token detected; please remove and revoke it if this is a leak.",
      "description": "Contentful preview API token",
      "cve": "secrets.go:0ed1e3937d4168124795470aea45c8643a69cff840621b3ef28ac0542212a222:Contentful preview API token",
      "severity": "Critical",
      "confidence": "Unknown",
      "raw_source_code_extract": "0TNLpl9EbaoiefqjsMLM1hQ-bwZuZbJgmnD4teg2o59",
      "scanner": {
        "id": "gitleaks",
        "name": "Gitleaks"
      },
      "location": {
        "file": "secrets.go",
        "commit": {
          "sha": "0000000"
        },
        "start_line": 15
      },
      "identifiers": [
        {
          "type": "gitleaks_rule_id",
          "name": "Gitleaks rule ID Contentful preview API token",
          "value": "Contentful preview API token"
        }
      ]
    },
    {
      "id": "b6e9a831a7053014edcaafce5213de11928661e3d2d170eed309752469350afe",
      "category": "secret_detection",
      "name": "Linear API token",
      "message": "Linear API token detected; please remove and revoke it if this is a leak.",
      "description": "Linear API token",
      "cve": "secrets.go:12d5452621fa9dffd92b4f8ecd78e0821b74e8bd62e0588f9f5a8bb426c9d67d:Linear API token",
      "severity": "Critical",
      "confidence": "Unknown",
      "raw_source_code_extract": "lin_api_tPmBQyIDelPeLZZB4rUiMZJQqPMIggqOEK0k3Bbo",
      "scanner": {
        "id": "gitleaks",
        "name": "Gitleaks"
      },
      "location": {
        "file": "secrets.go",
        "commit": {
          "sha": "0000000"
        },
        "start_line": 62
      },
      "identifiers": [
        {
          "type": "gitleaks_rule_id",
          "name": "Gitleaks rule ID Linear API token",
          "value": "Linear API token"
        }
      ]
    },
    {
      "id": "2fda2bdd22f88ab39ff091d6d71e8886b05a2fe9aed568ee22c750a7c2a5ecee",
      "category": "secret_detection",
      "name": "Hubspot API token",
      "message": "Hubspot API token detected; please remove and revoke it if this is a leak.",
      "description": "Hubspot API token",
      "cve": "secrets.go:1356d598f3fe4e6c415f645b316e4a5ca714d540b6edfba2ac18e46d784c75fd:Hubspot API token",
      "severity": "Critical",
      "confidence": "Unknown",
      "raw_source_code_extract": "dcd37820-bbf6-418e-b187-f471c64e36d4",
      "scanner": {
        "id": "gitleaks",
        "name": "Gitleaks"
      },
      "location": {
        "file": "secrets.go",
        "commit": {
          "sha": "0000000"
        },
        "start_line": 54
      },
      "identifiers": [
        {
          "type": "gitleaks_rule_id",
          "name": "Gitleaks rule ID Hubspot API token",
          "value": "Hubspot API token"
        }
      ]
    },
    {
      "id": "29bb6b617957ab3a763f41af952b275701a3a910b0d1bf7a4996ae2c1e3298b7",
      "category": "secret_detection",
      "name": "Flutterwave secret key",
      "message": "Flutterwave secret key detected; please remove and revoke it if this is a leak.",
      "description": "Flutterwave secret key",
      "cve": "secrets.go:1a4fcd42ef643fde0105d046381a078eece1fdbb40a920cf8f11a33c2b2cf0d4:Flutterwave secret key",
      "severity": "Critical",
      "confidence": "Unknown",
      "raw_source_code_extract": "FLWSECK_TEST-ca9f9a7af7953aed44391b1338b6f9ef-X",
      "scanner": {
        "id": "gitleaks",
        "name": "Gitleaks"
      },
      "location": {
        "file": "secrets.go",
        "commit": {
          "sha": "0000000"
        },
        "start_line": 42
      },
      "identifiers": [
        {
          "type": "gitleaks_rule_id",
          "name": "Gitleaks rule ID Flutterwave secret key",
          "value": "Flutterwave secret key"
        }
      ]
    },
    {
      "id": "189443e2ee6d50c8f16fcc4a259396e0362fc0f0df0f13f936bc92d5d1ffe72f",
      "category": "secret_detection",
      "name": "Bitbucket client ID",
      "message": "Bitbucket client ID detected; please remove and revoke it if this is a leak.",
      "description": "Bitbucket client ID",
      "cve": "secrets.go:1ba70f6739ab88691e5f86ae6fd6418865f0d4d73d96b4b74670ab6e6ba73785:Bitbucket client ID",
      "severity": "Critical",
      "confidence": "Unknown",
      "raw_source_code_extract": "Zf3D0LXCM3EIMbgJpUNnkRtOfOueHznB",
      "scanner": {
        "id": "gitleaks",
        "name": "Gitleaks"
      },
      "location": {
        "file": "secrets.go",
        "commit": {
          "sha": "0000000"
        },
        "start_line": 10
      },
      "identifiers": [
        {
          "type": "gitleaks_rule_id",
          "name": "Gitleaks rule ID Bitbucket client ID",
          "value": "Bitbucket client ID"
        }
      ]
    },
    {
      "id": "6cbe07b9117056cb45c9c142add58913198a2f8f85d88fa080aad1bfcdfcdc84",
      "category": "secret_detection",
      "name": "Lob API Key",
      "message": "Lob API Key detected; please remove and revoke it if this is a leak.",
      "description": "Lob API Key",
      "cve": "secrets.go:2d6e84fe17bb198a507e017fd57740761f2ff960528ad4e1540ec979536e430a:Lob API Key",
      "severity": "Critical",
      "confidence": "Unknown",
      "raw_source_code_extract": "live_5c03155f2266f3e00c20179c5b65502ab92",
      "scanner": {
        "id": "gitleaks",
        "name": "Gitleaks"
      },
      "location": {
        "file": "secrets.go",
        "commit": {
          "sha": "0000000"
        },
        "start_line": 66
      },
      "identifiers": [
        {
          "type": "gitleaks_rule_id",
          "name": "Gitleaks rule ID Lob API Key",
          "value": "Lob API Key"
        }
      ]
    },
    {
      "id": "fc615b25409296dda3d4c39474aa1f87fd13b5086fd640217252fd873df7c3d3",
      "category": "secret_detection",
      "name": "Asana Client Secret",
      "message": "Asana Client Secret detected; please remove and revoke it if this is a leak.",
      "description": "Asana Client Secret",
      "cve": "secrets.go:32fb0f79e9030fea2f7726c4b861bf12ba9c807432e1dd05116d78e46e0864d3:Asana Client Secret",
      "severity": "Critical",
      "confidence": "Unknown",
      "raw_source_code_extract": "d0e94828b0549eee7368e53f6cb41d17",
      "scanner": {
        "id": "gitleaks",
        "name": "Gitleaks"
      },
      "location": {
        "file": "secrets.go",
        "commit": {
          "sha": "0000000"
        },
        "start_line": 8
      },
      "identifiers": [
        {
          "type": "gitleaks_rule_id",
          "name": "Gitleaks rule ID Asana Client Secret",
          "value": "Asana Client Secret"
        }
      ]
    },
    {
      "id": "238851dace740ee9b492e5de39c0fed064ca42c77db9bd4073a34901c3539744",
      "category": "secret_detection",
      "name": "Lob Publishable API Key",
      "message": "Lob Publishable API Key detected; please remove and revoke it if this is a leak.",
      "description": "Lob Publishable API Key",
      "cve": "secrets.go:34ca1bc43f78936bb999aefe8c64e1fc6def39ec4221cc0fed9beb55baffad6c:Lob Publishable API Key",
      "severity": "Critical",
      "confidence": "Unknown",
      "raw_source_code_extract": "live_pub_0e1fe852b24b86f5cbd57192df2cabb",
      "scanner": {
        "id": "gitleaks",
        "name": "Gitleaks"
      },
      "location": {
        "file": "secrets.go",
        "commit": {
          "sha": "0000000"
        },
        "start_line": 68
      },
      "identifiers": [
        {
          "type": "gitleaks_rule_id",
          "name": "Gitleaks rule ID Lob Publishable API Key",
          "value": "Lob Publishable API Key"
        }
      ]
    },
    {
      "id": "01a128142b07f341df43fa166bf4cd4857a2769b9318ef8468a4ab594e21386c",
      "category": "secret_detection",
      "name": "Mailgun webhook signing key",
      "message": "Mailgun webhook signing key detected; please remove and revoke it if this is a leak.",
      "description": "Mailgun webhook signing key",
      "cve": "secrets.go:37d11d1ef03ae7d64860814a4751ef952312fb737992d3ce2d100316c27ab68c:Mailgun webhook signing key",
      "severity": "Critical",
      "confidence": "Unknown",
      "raw_source_code_extract": "275ca4bf433194fb9e41cb1d30b8d926-22ccdde5-933fceee",
      "scanner": {
        "id": "gitleaks",
        "name": "Gitleaks"
      },
      "location": {
        "file": "secrets.go",
        "commit": {
          "sha": "0000000"
        },
        "start_line": 76
      },
      "identifiers": [
        {
          "type": "gitleaks_rule_id",
          "name": "Gitleaks rule ID Mailgun webhook signing key",
          "value": "Mailgun webhook signing key"
        }
      ]
    },
    {
      "id": "5f3d5609f824ee422127e53b7e4086fe55e8d388eb13bdc840984852d31baf2e",
      "category": "secret_detection",
      "name": "Alibaba AccessKey ID",
      "message": "Alibaba AccessKey ID detected; please remove and revoke it if this is a leak.",
      "description": "Alibaba AccessKey ID",
      "cve": "secrets.go:4a8366a84283e6451b4c8492599d9c4c1e29dddb8d5c63a482f1b33f46429e06:Alibaba AccessKey ID",
      "severity": "Critical",
      "confidence": "Unknown",
      "raw_source_code_extract": "LTAI5t1oc8FSbpswMPd3JTKN",
      "scanner": {
        "id": "gitleaks",
        "name": "Gitleaks"
      },
      "location": {
        "file": "secrets.go",
        "commit": {
          "sha": "0000000"
        },
        "start_line": 5
      },
      "identifiers": [
        {
          "type": "gitleaks_rule_id",
          "name": "Gitleaks rule ID Alibaba AccessKey ID",
          "value": "Alibaba AccessKey ID"
        }
      ]
    },
    {
      "id": "e2e5e80e1770f9a199058b9dabbcd6651ac1c98bcb2ce5afdf8e43b95b66e800",
      "category": "secret_detection",
      "name": "Linkedin Client secret",
      "message": "Linkedin Client secret detected; please remove and revoke it if this is a leak.",
      "description": "Linkedin Client secret",
      "cve": "secrets.go:4dd3963a5a80768c7198775ff5dae2b6170b706533736d949f72aec1bc5c3fa7:Linkedin Client secret",
      "severity": "Critical",
      "confidence": "Unknown",
      "raw_source_code_extract": "JBxJIyEInUlAVLwN",
      "scanner": {
        "id": "gitleaks",
        "name": "Gitleaks"
      },
      "location": {
        "file": "secrets.go",
        "commit": {
          "sha": "0000000"
        },
        "start_line": 108
      },
      "identifiers": [
        {
          "type": "gitleaks_rule_id",
          "name": "Gitleaks rule ID Linkedin Client secret",
          "value": "Linkedin Client secret"
        }
      ]
    },
    {
      "id": "db6eb0ccf63b3c1b705cd5f9ddf450bcaf1414b2ba3b959a62ecfab730556a8d",
      "category": "secret_detection",
      "name": "Frame.io API token",
      "message": "Frame.io API token detected; please remove and revoke it if this is a leak.",
      "description": "Frame.io API token",
      "cve": "secrets.go:52b277c8ef8fd901591940e76dc8add5af3bf76767a370720cb9112fbdf023d7:Frame.io API token",
      "severity": "Critical",
      "confidence": "Unknown",
      "raw_source_code_extract": "fio-u-utrwGPpiRfGmkSu-S73kwmImy3YQH7pIMvBNWF2u3Ee2xZy6rz1Kx1YeZX07HyIA",
      "scanner": {
        "id": "gitleaks",
        "name": "Gitleaks"
      },
      "location": {
        "file": "secrets.go",
        "commit": {
          "sha": "0000000"
        },
        "start_line": 46
      },
      "identifiers": [
        {
          "type": "gitleaks_rule_id",
          "name": "Gitleaks rule ID Frame.io API token",
          "value": "Frame.io API token"
        }
      ]
    },
    {
      "id": "462d0bff525701488a573544c45a8f4331dcc97ea11d9aa7fae6fb3e19057b64",
      "category": "secret_detection",
      "name": "Ionic API token",
      "message": "Ionic API token detected; please remove and revoke it if this is a leak.",
      "description": "Ionic API token",
      "cve": "secrets.go:5484adfd739784e8dce17d0ee0b97a9a75efe16d852db5f7fe943fff6a782ba1:Ionic API token",
      "severity": "Critical",
      "confidence": "Unknown",
      "raw_source_code_extract": "ion_ukKfe2u7TrYBLzhtam6G46iqAcj1BU2llPb40iHm5K",
      "scanner": {
        "id": "gitleaks",
        "name": "Gitleaks"
      },
      "location": {
        "file": "secrets.go",
        "commit": {
          "sha": "0000000"
        },
        "start_line": 60
      },
      "identifiers": [
        {
          "type": "gitleaks_rule_id",
          "name": "Gitleaks rule ID Ionic API token",
          "value": "Ionic API token"
        }
      ]
    },
    {
      "id": "6241eaa9372f32ce712be171111e7ffbaa4a0cf772958ef40502522fcd794acc",
      "category": "secret_detection",
      "name": "Linkedin Client ID",
      "message": "Linkedin Client ID detected; please remove and revoke it if this is a leak.",
      "description": "Linkedin Client ID",
      "cve": "secrets.go:550b817c6fb3702cb9b348f74b3ac48f592eb0399def9aed643a1b4d219d50c9:Linkedin Client ID",
      "severity": "Critical",
      "confidence": "Unknown",
      "raw_source_code_extract": "88wj9qlu7vcbtj",
      "scanner": {
        "id": "gitleaks",
        "name": "Gitleaks"
      },
      "location": {
        "file": "secrets.go",
        "commit": {
          "sha": "0000000"
        },
        "start_line": 110
      },
      "identifiers": [
        {
          "type": "gitleaks_rule_id",
          "name": "Gitleaks rule ID Linkedin Client ID",
          "value": "Linkedin Client ID"
        }
      ]
    },
    {
      "id": "e9d6e9bd8a40140f150515b6f334468044d76dc90890e6d893bd04ac880a6ed5",
      "category": "secret_detection",
      "name": "Asana Client ID",
      "message": "Asana Client ID detected; please remove and revoke it if this is a leak.",
      "description": "Asana Client ID",
      "cve": "secrets.go:57313e84cd2c13c162d8e1cf5dbe0bfd7e1433217a36674e7a2ebc3b6a1212e7:Asana Client ID",
      "severity": "Critical",
      "confidence": "Unknown",
      "raw_source_code_extract": "1204326363763489",
      "scanner": {
        "id": "gitleaks",
        "name": "Gitleaks"
      },
      "location": {
        "file": "secrets.go",
        "commit": {
          "sha": "0000000"
        },
        "start_line": 7
      },
      "identifiers": [
        {
          "type": "gitleaks_rule_id",
          "name": "Gitleaks rule ID Asana Client ID",
          "value": "Asana Client ID"
        }
      ]
    },
    {
      "id": "661bd2c71129ac5f3a2807b0b395c2849ccf275227dfefc8cd572fab1193426b",
      "category": "secret_detection",
      "name": "Discord client ID",
      "message": "Discord client ID detected; please remove and revoke it if this is a leak.",
      "description": "Discord client ID",
      "cve": "secrets.go:5e9bb9fe96425dcb7bfbda9de7da969cd08daf8edcdbb4b236b005b78e936c23:Discord client ID",
      "severity": "Critical",
      "confidence": "Unknown",
      "raw_source_code_extract": "908561293872267899",
      "scanner": {
        "id": "gitleaks",
        "name": "Gitleaks"
      },
      "location": {
        "file": "secrets.go",
        "commit": {
          "sha": "0000000"
        },
        "start_line": 18
      },
      "identifiers": [
        {
          "type": "gitleaks_rule_id",
          "name": "Gitleaks rule ID Discord client ID",
          "value": "Discord client ID"
        }
      ]
    },
    {
      "id": "6558fed4ae1b3599f96f6290b09a4455701a01f8fd9e59e0766259ec5c36a7cb",
      "category": "secret_detection",
      "name": "MessageBird API token",
      "message": "MessageBird API token detected; please remove and revoke it if this is a leak.",
      "description": "MessageBird API token",
      "cve": "secrets.go:5ebd3ac7cefbaa24c38341f573c0324a999fa7810a2104a0837892ff2725542b:messagebird-api-token",
      "severity": "Critical",
      "confidence": "Unknown",
      "raw_source_code_extract": "QZ2o4gkpz9lldgum1V1yvmEKs",
      "scanner": {
        "id": "gitleaks",
        "name": "Gitleaks"
      },
      "location": {
        "file": "secrets.go",
        "commit": {
          "sha": "0000000"
        },
        "start_line": 80
      },
      "identifiers": [
        {
          "type": "gitleaks_rule_id",
          "name": "Gitleaks rule ID messagebird-api-token",
          "value": "messagebird-api-token"
        }
      ]
    },
    {
      "id": "7ea7e9769f3433ff881048031c38f04f9f8f97a6e7d44ec182f6ede210aa3fae",
      "category": "secret_detection",
      "name": "Bitbucket client secret",
      "message": "Bitbucket client secret detected; please remove and revoke it if this is a leak.",
      "description": "Bitbucket client secret",
      "cve": "secrets.go:5fef0028984054a72ac5d10644b86d77f08cf85f169adbfc1c7562ca7e12b680:Bitbucket client secret",
      "severity": "Critical",
      "confidence": "Unknown",
      "raw_source_code_extract": "HKH6h-ik4DgO5pG7ZbxtyItNygJMZ1D6z_vkBdhfCmWFyhjLvbiZEF3O-8WV9A76",
      "scanner": {
        "id": "gitleaks",
        "name": "Gitleaks"
      },
      "location": {
        "file": "secrets.go",
        "commit": {
          "sha": "0000000"
        },
        "start_line": 11
      },
      "identifiers": [
        {
          "type": "gitleaks_rule_id",
          "name": "Gitleaks rule ID Bitbucket client secret",
          "value": "Bitbucket client secret"
        }
      ]
    },
    {
      "id": "18e8bf7687da0475dc9d30297aa220e2938d0af1540ed9da6544dc4ed4c0ab8d",
      "category": "secret_detection",
      "name": "New Relic user API Key",
      "message": "New Relic user API Key detected; please remove and revoke it if this is a leak.",
      "description": "New Relic user API Key",
      "cve": "secrets.go:607de6406296da3cc945a8f11c86d9d0ff54e4bc2c0a5caed425dd719ed185a8:New Relic user API Key",
      "severity": "Critical",
      "confidence": "Unknown",
      "raw_source_code_extract": "\"NRAK-FFDW5VZ3B292B69NU9BL7F07OI9\"",
      "scanner": {
        "id": "gitleaks",
        "name": "Gitleaks"
      },
      "location": {
        "file": "secrets.go",
        "commit": {
          "sha": "0000000"
        },
        "start_line": 84
      },
      "identifiers": [
        {
          "type": "gitleaks_rule_id",
          "name": "Gitleaks rule ID New Relic user API Key",
          "value": "New Relic user API Key"
        }
      ]
    },
    {
      "id": "21888750d66273bc64973c4ea63a40e964680e30ee1023d2b1c11c593b153d8a",
      "category": "secret_detection",
      "name": "npm access token",
      "message": "npm access token detected; please remove and revoke it if this is a leak.",
      "description": "npm access token",
      "cve": "secrets.go:637ad0326eb755c6026cbe373e376e2f81873d2162ff04c2a4cb7a7d48b4e82e:npm access token",
      "severity": "Critical",
      "confidence": "Unknown",
      "raw_source_code_extract": "\"npm_JEbsYXyMwnGPcqZwk6fXplQNjmDHuJ0zoriU\"",
      "scanner": {
        "id": "gitleaks",
        "name": "Gitleaks"
      },
      "location": {
        "file": "secrets.go",
        "commit": {
          "sha": "0000000"
        },
        "start_line": 90
      },
      "identifiers": [
        {
          "type": "gitleaks_rule_id",
          "name": "Gitleaks rule ID npm access token",
          "value": "npm access token"
        }
      ]
    },
    {
      "id": "17765a9582f2ccc87f9b5f29ea72cab9f8b584dd7cd3b4ac156a88d845b57d39",
      "category": "secret_detection",
      "name": "Mailchimp API key",
      "message": "Mailchimp API key detected; please remove and revoke it if this is a leak.",
      "description": "Mailchimp API key",
      "cve": "secrets.go:652a9894985573701f16c5c0f9f260bc6bd7285c367e2be370e65ae4294b6761:Mailchimp API key",
      "severity": "Critical",
      "confidence": "Unknown",
      "raw_source_code_extract": "37f8bed34221abdc9c658654592b1128-us20",
      "scanner": {
        "id": "gitleaks",
        "name": "Gitleaks"
      },
      "location": {
        "file": "secrets.go",
        "commit": {
          "sha": "0000000"
        },
        "start_line": 70
      },
      "identifiers": [
        {
          "type": "gitleaks_rule_id",
          "name": "Gitleaks rule ID Mailchimp API key",
          "value": "Mailchimp API key"
        }
      ]
    },
    {
      "id": "85a9a1d37f973f6f7373fbc4885b4daded0bde4ea8fe476fb9897756e3718258",
      "category": "secret_detection",
      "name": "EasyPost API token",
      "message": "EasyPost API token detected; please remove and revoke it if this is a leak.",
      "description": "EasyPost API token",
      "cve": "secrets.go:68ee20ac370638c41ae7f60f69491ddbf297cdc0132c4d290768fb87918d42ae:EasyPost API token",
      "severity": "Critical",
      "confidence": "Unknown",
      "raw_source_code_extract": "\"EZAK20d88ba26944531abd4a7eb4b5f2bff9w9bTQT4LacmgoGcVqfA2zB\"",
      "scanner": {
        "id": "gitleaks",
        "name": "Gitleaks"
      },
      "location": {
        "file": "secrets.go",
        "commit": {
          "sha": "0000000"
        },
        "start_line": 31
      },
      "identifiers": [
        {
          "type": "gitleaks_rule_id",
          "name": "Gitleaks rule ID EasyPost API token",
          "value": "EasyPost API token"
        }
      ]
    },
    {
      "id": "1559b434f90a8a268ab658dc9ef32f61f9225293d844fa150244f5ca7ddbbab0",
      "category": "secret_detection",
      "name": "Adobe Client Secret",
      "message": "Adobe Client Secret detected; please remove and revoke it if this is a leak.",
      "description": "Adobe Client Secret",
      "cve": "secrets.go:7bc6e78650c2d3f04fc58ec0f7e62c83037b2770dc9c0e77cc790b49d21c7e7f:Adobe Client Secret",
      "severity": "Critical",
      "confidence": "Unknown",
      "raw_source_code_extract": "p8e-mBc6QIzXhnmHGhlfbSM8nNmdeF6w1fhj",
      "scanner": {
        "id": "gitleaks",
        "name": "Gitleaks"
      },
      "location": {
        "file": "secrets.go",
        "commit": {
          "sha": "0000000"
        },
        "start_line": 4
      },
      "identifiers": [
        {
          "type": "gitleaks_rule_id",
          "name": "Gitleaks rule ID Adobe Client Secret",
          "value": "Adobe Client Secret"
        }
      ]
    },
    {
      "id": "9f31ff8cb4b16899424234cd33461686351ed107472e16d1e86329a4b51b7dc4",
      "category": "secret_detection",
      "name": "Atlassian API token",
      "message": "Atlassian API token detected; please remove and revoke it if this is a leak.",
      "description": "Atlassian API token",
      "cve": "secrets.go:7d457505c3e351442ee48bd4f44f0b2dc795d5101002b8e497d423483919d434:Atlassian API token",
      "severity": "Critical",
      "confidence": "Unknown",
      "raw_source_code_extract": "yZIjJoDDNbJl1WlrASpM463E",
      "scanner": {
        "id": "gitleaks",
        "name": "Gitleaks"
      },
      "location": {
        "file": "secrets.go",
        "commit": {
          "sha": "0000000"
        },
        "start_line": 9
      },
      "identifiers": [
        {
          "type": "gitleaks_rule_id",
          "name": "Gitleaks rule ID Atlassian API token",
          "value": "Atlassian API token"
        }
      ]
    },
    {
      "id": "2f8901cf677bc4e77cf68f4c3d396ef559e2ce54354c3d907c670095a79221dc",
      "category": "secret_detection",
      "name": "Fastly API token",
      "message": "Fastly API token detected; please remove and revoke it if this is a leak.",
      "description": "Fastly API token",
      "cve": "secrets.go:7e7fc083f3ac09bec85305d12f2899990f1f9fe4a5c0e58902a58a43be59cf3e:Fastly API token",
      "severity": "Critical",
      "confidence": "Unknown",
      "raw_source_code_extract": "uhZtofOcNnzoH6F5-m0bzsLvCqIjzNFG",
      "scanner": {
        "id": "gitleaks",
        "name": "Gitleaks"
      },
      "location": {
        "file": "secrets.go",
        "commit": {
          "sha": "0000000"
        },
        "start_line": 34
      },
      "identifiers": [
        {
          "type": "gitleaks_rule_id",
          "name": "Gitleaks rule ID Fastly API token",
          "value": "Fastly API token"
        }
      ]
    },
    {
      "id": "64f7a468eca6a64bc558530acaa6204df8ac90da74b137cbd7a09c5b1fb6d7ca",
      "category": "secret_detection",
      "name": "Planetscale password",
      "message": "Planetscale password detected; please remove and revoke it if this is a leak.",
      "description": "Planetscale password",
      "cve": "secrets.go:8ad256d3806bcb6d74e617a4da9ec83092b411cc65321e887f2374ea466f921d:Planetscale password",
      "severity": "Critical",
      "confidence": "Unknown",
      "raw_source_code_extract": "pscale_pw__qerkvUp-boFZrRdC0In6y9uWjPSYdWAK1MCV2iORmZ",
      "scanner": {
        "id": "gitleaks",
        "name": "Gitleaks"
      },
      "location": {
        "file": "secrets.go",
        "commit": {
          "sha": "0000000"
        },
        "start_line": 92
      },
      "identifiers": [
        {
          "type": "gitleaks_rule_id",
          "name": "Gitleaks rule ID Planetscale password",
          "value": "Planetscale password"
        }
      ]
    },
    {
      "id": "1a93203642b3acedc43c6a149a6a30b5e80e60dd87a5185db497c4da5d0953a0",
      "category": "secret_detection",
      "name": "EasyPost test API token",
      "message": "EasyPost test API token detected; please remove and revoke it if this is a leak.",
      "description": "EasyPost test API token",
      "cve": "secrets.go:8dc0a35fab5e9c3e72d1c771cf7ddbdf198ce3ea0d0a3c6c5679024543e5cc09:EasyPost test API token",
      "severity": "Critical",
      "confidence": "Unknown",
      "raw_source_code_extract": "\"EZTK20d88ba26944531abd3a7eb4b5f2bff9gLvg0zLoOq19JvCv6MgTBB\"",
      "scanner": {
        "id": "gitleaks",
        "name": "Gitleaks"
      },
      "location": {
        "file": "secrets.go",
        "commit": {
          "sha": "0000000"
        },
        "start_line": 32
      },
      "identifiers": [
        {
          "type": "gitleaks_rule_id",
          "name": "Gitleaks rule ID EasyPost test API token",
          "value": "EasyPost test API token"
        }
      ]
    },
    {
      "id": "8c6d5a21b08928245a3633af0ada61e378797123c99f99b6128d434830e195d5",
      "category": "secret_detection",
      "name": "Dropbox long lived API token",
      "message": "Dropbox long lived API token detected; please remove and revoke it if this is a leak.",
      "description": "Dropbox long lived API token",
      "cve": "secrets.go:8e3239880a605b7abc0de6c56a508f90259b595b0403d4360a24c67701d79dd6:Dropbox long lived API token",
      "severity": "Critical",
      "confidence": "Unknown",
      "raw_source_code_extract": "DropboxLongLivedAccessToken = \"ungi76nUb5QAAAAAAAAAAfyt1jX1bdsZhuIysBl6CpoZNjWg_OM_KEunvbMNW-Gz\"",
      "scanner": {
        "id": "gitleaks",
        "name": "Gitleaks"
      },
      "location": {
        "file": "secrets.go",
        "commit": {
          "sha": "0000000"
        },
        "start_line": 28
      },
      "identifiers": [
        {
          "type": "gitleaks_rule_id",
          "name": "Gitleaks rule ID Dropbox long lived API token",
          "value": "Dropbox long lived API token"
        }
      ]
    },
    {
      "id": "7bf177ac35f91fa17398cd456dfd569c0328b4e029d1da4545c1cec7c87aa228",
      "category": "secret_detection",
      "name": "Discord API key",
      "message": "Discord API key detected; please remove and revoke it if this is a leak.",
      "description": "Discord API key",
      "cve": "secrets.go:92018a86223a0a46eaeda36349d2d5eeb11866d81169c3427518e108fa378daa:Discord API key",
      "severity": "Critical",
      "confidence": "Unknown",
      "raw_source_code_extract": "e7322523fb86ed64c836a979cf8465fbd436378c653c1db38f9ae87bc62a6fd5",
      "scanner": {
        "id": "gitleaks",
        "name": "Gitleaks"
      },
      "location": {
        "file": "secrets.go",
        "commit": {
          "sha": "0000000"
        },
        "start_line": 17
      },
      "identifiers": [
        {
          "type": "gitleaks_rule_id",
          "name": "Gitleaks rule ID Discord API key",
          "value": "Discord API key"
        }
      ]
    },
    {
      "id": "6e8de59be23be6998478eec5ce1f90ad7d8c02636ec3d20be82d45152cd809d6",
      "category": "secret_detection",
      "name": "Finicity client secret",
      "message": "Finicity client secret detected; please remove and revoke it if this is a leak.",
      "description": "Finicity client secret",
      "cve": "secrets.go:921fd8685cf12713f762e2e6a7cf04e69b3c7b81652fddee6c0a81fa1b659156:Finicity client secret",
      "severity": "Critical",
      "confidence": "Unknown",
      "raw_source_code_extract": "F6uaXf3yEdBwnAg35q1Z",
      "scanner": {
        "id": "gitleaks",
        "name": "Gitleaks"
      },
      "location": {
        "file": "secrets.go",
        "commit": {
          "sha": "0000000"
        },
        "start_line": 36
      },
      "identifiers": [
        {
          "type": "gitleaks_rule_id",
          "name": "Gitleaks rule ID Finicity client secret",
          "value": "Finicity client secret"
        }
      ]
    },
    {
      "id": "ae464089154f06ffb925e5418e1c171c3c5cd245d7e0da3498b9b389252e49d3",
      "category": "secret_detection",
      "name": "Finicity API token",
      "message": "Finicity API token detected; please remove and revoke it if this is a leak.",
      "description": "Finicity API token",
      "cve": "secrets.go:9534b0fb3deb1105bb17a8badcc3671c6d2bc695352cf2750fdcfefe30a92852:Finicity API token",
      "severity": "Critical",
      "confidence": "Unknown",
      "raw_source_code_extract": "1863cd09a446ede7669062c4ee2bf7ca",
      "scanner": {
        "id": "gitleaks",
        "name": "Gitleaks"
      },
      "location": {
        "file": "secrets.go",
        "commit": {
          "sha": "0000000"
        },
        "start_line": 38
      },
      "identifiers": [
        {
          "type": "gitleaks_rule_id",
          "name": "Gitleaks rule ID Finicity API token",
          "value": "Finicity API token"
        }
      ]
    },
    {
      "id": "64c777abb1841f2317fa22f8d083489c268ef72bac63b577344b0fb7e6d7845a",
      "category": "secret_detection",
      "name": "Intercom client secret/ID",
      "message": "Intercom client secret/ID detected; please remove and revoke it if this is a leak.",
      "description": "Intercom client secret/ID",
      "cve": "secrets.go:9894600197eccfee20f7faa31882d9a0ab3fd17e0d71375f28ebdcfd395b6212:Intercom client secret/ID",
      "severity": "Critical",
      "confidence": "Unknown",
      "raw_source_code_extract": "9173gc12-91f2-4825-8ad9-805232b1d98b",
      "scanner": {
        "id": "gitleaks",
        "name": "Gitleaks"
      },
      "location": {
        "file": "secrets.go",
        "commit": {
          "sha": "0000000"
        },
        "start_line": 58
      },
      "identifiers": [
        {
          "type": "gitleaks_rule_id",
          "name": "Gitleaks rule ID Intercom client secret/ID",
          "value": "Intercom client secret/ID"
        }
      ]
    },
    {
      "id": "8bded81bae2f1585e1179c681d568ec4d6bfad47c4a933af0c7df714f0a2499f",
      "category": "secret_detection",
      "name": "Beamer API token",
      "message": "Beamer API token detected; please remove and revoke it if this is a leak.",
      "description": "Beamer API token",
      "cve": "secrets.go:a591b4174b9a45fffe3716277dcd7a943a693cb55d6b6ae3a3ac9f3ec1a9fb08:Beamer API token",
      "severity": "Critical",
      "confidence": "Unknown",
      "raw_source_code_extract": "b_Wk3IIH700rIMUnNdJOAdikk45X7eDelZTTCzJ0Skohs=",
      "scanner": {
        "id": "gitleaks",
        "name": "Gitleaks"
      },
      "location": {
        "file": "secrets.go",
        "commit": {
          "sha": "0000000"
        },
        "start_line": 12
      },
      "identifiers": [
        {
          "type": "gitleaks_rule_id",
          "name": "Gitleaks rule ID Beamer API token",
          "value": "Beamer API token"
        }
      ]
    },
    {
      "id": "61677c33e69c3801e4da3fdc039a5a1c1df9514eb649baaa704ffacb690fb647",
      "category": "secret_detection",
      "name": "Dropbox API secret/key",
      "message": "Dropbox API secret/key detected; please remove and revoke it if this is a leak.",
      "description": "Dropbox API secret/key",
      "cve": "secrets.go:a758e25ab75e6cfb2da8717aa71ad257efa13a76ddf61c1562025463e31dc1b1:Dropbox API secret/key",
      "severity": "Critical",
      "confidence": "Unknown",
      "raw_source_code_extract": "DropboxAppKey = \"ds7qoiqb4je0rqq\"",
      "scanner": {
        "id": "gitleaks",
        "name": "Gitleaks"
      },
      "location": {
        "file": "secrets.go",
        "commit": {
          "sha": "0000000"
        },
        "start_line": 24
      },
      "identifiers": [
        {
          "type": "gitleaks_rule_id",
          "name": "Gitleaks rule ID Dropbox API secret/key",
          "value": "Dropbox API secret/key"
        }
      ]
    },
    {
      "id": "b1f3fae56cbff3316645f1846a430cb347e85f6152b797d0e5adeccd2ee280cd",
      "category": "secret_detection",
      "name": "Postman API token",
      "message": "Postman API token detected; please remove and revoke it if this is a leak.",
      "description": "Postman API token",
      "cve": "secrets.go:ac0b93b80951d1f4296d9718fd71e120cc752870f3107841c0244946e2e0baba:Postman API token",
      "severity": "Critical",
      "confidence": "Unknown",
      "raw_source_code_extract": "PMAK-628534d1b6d710004b0cc1c1-0b7434831ddd15645fe09352dcc4d048b6",
      "scanner": {
        "id": "gitleaks",
        "name": "Gitleaks"
      },
      "location": {
        "file": "secrets.go",
        "commit": {
          "sha": "0000000"
        },
        "start_line": 96
      },
      "identifiers": [
        {
          "type": "gitleaks_rule_id",
          "name": "Gitleaks rule ID Postman API token",
          "value": "Postman API token"
        }
      ]
    },
    {
      "id": "8910bdef6f9b04828f49a57b1b2de28c045350a08db2cc748df75df4a49b83bd",
      "category": "secret_detection",
      "name": "Planetscale API token",
      "message": "Planetscale API token detected; please remove and revoke it if this is a leak.",
      "description": "Planetscale API token",
      "cve": "secrets.go:ae47cb64d3f455a57b3ae6074e0ccec9c16ec7c0da9750877a215e6cf8da0c08:Planetscale API token",
      "severity": "Critical",
      "confidence": "Unknown",
      "raw_source_code_extract": "pscale_tkn_r7EGkxciX8Jdr_PjZ6O1NFP-47051zzcAqORihDW3Zf",
      "scanner": {
        "id": "gitleaks",
        "name": "Gitleaks"
      },
      "location": {
        "file": "secrets.go",
        "commit": {
          "sha": "0000000"
        },
        "start_line": 94
      },
      "identifiers": [
        {
          "type": "gitleaks_rule_id",
          "name": "Gitleaks rule ID Planetscale API token",
          "value": "Planetscale API token"
        }
      ]
    },
    {
      "id": "e20aee17d036fe29ff869f2b357ba1a0ae5cad54e98fc2e9398544b1aa5e7008",
      "category": "secret_detection",
      "name": "New Relic ingest browser API token",
      "message": "New Relic ingest browser API token detected; please remove and revoke it if this is a leak.",
      "description": "New Relic ingest browser API token",
      "cve": "secrets.go:af205e81c02e51002c5e1806175efbbd38d379f33ab941184395ea91d538b626:New Relic ingest browser API token",
      "severity": "Critical",
      "confidence": "Unknown",
      "raw_source_code_extract": "\"NRJS-96bbe36499d469a6bc4\"",
      "scanner": {
        "id": "gitleaks",
        "name": "Gitleaks"
      },
      "location": {
        "file": "secrets.go",
        "commit": {
          "sha": "0000000"
        },
        "start_line": 88
      },
      "identifiers": [
        {
          "type": "gitleaks_rule_id",
          "name": "Gitleaks rule ID New Relic ingest browser API token",
          "value": "New Relic ingest browser API token"
        }
      ]
    },
    {
      "id": "76f464935c768bee7f3b6b12a3c8c35080c675387171703c7d764fdb65b26590",
      "category": "secret_detection",
      "name": "Databricks API token",
      "message": "Databricks API token detected; please remove and revoke it if this is a leak.",
      "description": "Databricks API token",
      "cve": "secrets.go:af728963476c8c7606397ddd783bc6e7f4e076434cfe039a4284bcfe2175fe3f:Databricks API token",
      "severity": "Critical",
      "confidence": "Unknown",
      "raw_source_code_extract": "dapi1a3c3c45d67790b1f234667a8bc8012c",
      "scanner": {
        "id": "gitleaks",
        "name": "Gitleaks"
      },
      "location": {
        "file": "secrets.go",
        "commit": {
          "sha": "0000000"
        },
        "start_line": 16
      },
      "identifiers": [
        {
          "type": "gitleaks_rule_id",
          "name": "Gitleaks rule ID Databricks API token",
          "value": "Databricks API token"
        }
      ]
    },
    {
      "id": "e2f6c1c758eb07b50b215313f42dbf588220f1ca18a00da0e38572de5d6e59b2",
      "category": "secret_detection",
      "name": "Clojars API token",
      "message": "Clojars API token detected; please remove and revoke it if this is a leak.",
      "description": "Clojars API token",
      "cve": "secrets.go:b0172fc6e316498d3c6399a60399a820ba6620f49c3646572ab08ad00a234e4c:Clojars API token",
      "severity": "Critical",
      "confidence": "Unknown",
      "raw_source_code_extract": "CLOJARS_34bf0e88955ff5a1c328d6a7491acc4f48e865a7b8dd4d70a70749037443",
      "scanner": {
        "id": "gitleaks",
        "name": "Gitleaks"
      },
      "location": {
        "file": "secrets.go",
        "commit": {
          "sha": "0000000"
        },
        "start_line": 13
      },
      "identifiers": [
        {
          "type": "gitleaks_rule_id",
          "name": "Gitleaks rule ID Clojars API token",
          "value": "Clojars API token"
        }
      ]
    },
    {
      "id": "af7ef8ae3f45a9b67d6f9e7880396d28b6ee78f83f0c95ccdd9347d52ca6acce",
      "category": "secret_detection",
      "name": "Sendinblue API token",
      "message": "Sendinblue API token detected; please remove and revoke it if this is a leak.",
      "description": "Sendinblue API token",
      "cve": "secrets.go:b3b41ba71bb9cd052be86a75ab38970d0defe877ae7e7e1468a3bf49d57d4f4c:Sendinblue API token",
      "severity": "Critical",
      "confidence": "Unknown",
      "raw_source_code_extract": "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",
      "scanner": {
        "id": "gitleaks",
        "name": "Gitleaks"
      },
      "location": {
        "file": "secrets.go",
        "commit": {
          "sha": "0000000"
        },
        "start_line": 104
      },
      "identifiers": [
        {
          "type": "gitleaks_rule_id",
          "name": "Gitleaks rule ID Sendinblue API token",
          "value": "Sendinblue API token"
        }
      ]
    },
    {
      "id": "3fb89ee7f6142c3d515ed20cffbab79daff4c09de5d3aa5a67d0a89dae9a6ccd",
      "category": "secret_detection",
      "name": "Twitch API token",
      "message": "Twitch API token detected; please remove and revoke it if this is a leak.",
      "description": "Twitch API token",
      "cve": "secrets.go:b8be0ec61f03232c3e42bc4367cb4e29cdedf97bcec9f389e5c9add98d03db2a:Twitch API token",
      "severity": "Critical",
      "confidence": "Unknown",
      "raw_source_code_extract": "zwqjvffo863374zioz1gd26thgsmu5",
      "scanner": {
        "id": "gitleaks",
        "name": "Gitleaks"
      },
      "location": {
        "file": "secrets.go",
        "commit": {
          "sha": "0000000"
        },
        "start_line": 112
      },
      "identifiers": [
        {
          "type": "gitleaks_rule_id",
          "name": "Gitleaks rule ID Twitch API token",
          "value": "Twitch API token"
        }
      ]
    },
    {
      "id": "91eb6bc5c05ae80f01bff81a1b30fea6948e96ba5184efa978358e30efc62846",
      "category": "secret_detection",
      "name": "Intercom API token",
      "message": "Intercom API token detected; please remove and revoke it if this is a leak.",
      "description": "Intercom API token",
      "cve": "secrets.go:b9dfd4d221f21a51343591ef0b0b046bcbc5bd352a1aa90fa91b7947ef64eef5:Intercom API token",
      "severity": "Critical",
      "confidence": "Unknown",
      "raw_source_code_extract": "dG9rOjVjMjRjZWQ3XkZkNMJfNKkzMj9iNDI4XzhmMDlkNCI4NTdiNDoxOjB=",
      "scanner": {
        "id": "gitleaks",
        "name": "Gitleaks"
      },
      "location": {
        "file": "secrets.go",
        "commit": {
          "sha": "0000000"
        },
        "start_line": 56
      },
      "identifiers": [
        {
          "type": "gitleaks_rule_id",
          "name": "Gitleaks rule ID Intercom API token",
          "value": "Intercom API token"
        }
      ]
    },
    {
      "id": "584da5d1d6e552776d4d4133e702c7b1c8c800a6d17fab15434ee1f97d90648b",
      "category": "secret_detection",
      "name": "Discord client secret",
      "message": "Discord client secret detected; please remove and revoke it if this is a leak.",
      "description": "Discord client secret",
      "cve": "secrets.go:b9e507b24646d9fb9599727e6eda6d46b6642f03eedd9c1b5d51d0cc98cc37b1:Discord client secret",
      "severity": "Critical",
      "confidence": "Unknown",
      "raw_source_code_extract": "8dyfuiRyqFvVc3RRr_edRk-fK__JItpZ",
      "scanner": {
        "id": "gitleaks",
        "name": "Gitleaks"
      },
      "location": {
        "file": "secrets.go",
        "commit": {
          "sha": "0000000"
        },
        "start_line": 20
      },
      "identifiers": [
        {
          "type": "gitleaks_rule_id",
          "name": "Gitleaks rule ID Discord client secret",
          "value": "Discord client secret"
        }
      ]
    },
    {
      "id": "773f348b239a5e4ef8616bf026c62282d7ce0b257e3698996344d49eec2220ce",
      "category": "secret_detection",
      "name": "Adobe Client ID (Oauth Web)",
      "message": "Adobe Client ID (Oauth Web) detected; please remove and revoke it if this is a leak.",
      "description": "Adobe Client ID (Oauth Web)",
      "cve": "secrets.go:bc7317262c1586e7c32a8f2af8ec9426fb3227bc1f0a62164414bd7ba81b2bab:Adobe Client ID (Oauth Web)",
      "severity": "Critical",
      "confidence": "Unknown",
      "raw_source_code_extract": "4ab4b080d9ce4072a6be2629c399d653",
      "scanner": {
        "id": "gitleaks",
        "name": "Gitleaks"
      },
      "location": {
        "file": "secrets.go",
        "commit": {
          "sha": "0000000"
        },
        "start_line": 3
      },
      "identifiers": [
        {
          "type": "gitleaks_rule_id",
          "name": "Gitleaks rule ID Adobe Client ID (Oauth Web)",
          "value": "Adobe Client ID (Oauth Web)"
        }
      ]
    },
    {
      "id": "de66ccdb1730b7daf445c32fa1ca7d3120d40c7a62bf678c05f188fb8f2c535b",
      "category": "secret_detection",
      "name": "GoCardless API token",
      "message": "GoCardless API token detected; please remove and revoke it if this is a leak.",
      "description": "GoCardless API token",
      "cve": "secrets.go:bd203da84c58289f3f0a1964e3f00d48a5938209ff50f25883f17021df3e8eaa:GoCardless API token",
      "severity": "Critical",
      "confidence": "Unknown",
      "raw_source_code_extract": "\"live_AOAWYR5Vbq070_oT6gBWelZUSYukL-wvtLr524d2\"",
      "scanner": {
        "id": "gitleaks",
        "name": "Gitleaks"
      },
      "location": {
        "file": "secrets.go",
        "commit": {
          "sha": "0000000"
        },
        "start_line": 48
      },
      "identifiers": [
        {
          "type": "gitleaks_rule_id",
          "name": "Gitleaks rule ID GoCardless API token",
          "value": "GoCardless API token"
        }
      ]
    },
    {
      "id": "59c7cc50d2a2d628befb4019a96e390ed4c2f55fd50c74563a4545eb48b09ff5",
      "category": "secret_detection",
      "name": "Hashicorp Terraform user/org API token",
      "message": "Hashicorp Terraform user/org API token detected; please remove and revoke it if this is a leak.",
      "description": "Hashicorp Terraform user/org API token",
      "cve": "secrets.go:bd52a2c5d83b20556a43143687b01cebe2822b9afcc511a66be79214b9c631fc:Hashicorp Terraform user/org API token",
      "severity": "Critical",
      "confidence": "Unknown",
      "raw_source_code_extract": "\"Nz0Vmo1pPzmszg.atlasv1.mZc9GYppy9YzIObgFHb6jFMfsA0AcLczXkDFyt5OskkFrcsmTCd4g4BQyyzpUb8qf9o\"",
      "scanner": {
        "id": "gitleaks",
        "name": "Gitleaks"
      },
      "location": {
        "file": "secrets.go",
        "commit": {
          "sha": "0000000"
        },
        "start_line": 52
      },
      "identifiers": [
        {
          "type": "gitleaks_rule_id",
          "name": "Gitleaks rule ID Hashicorp Terraform user/org API token",
          "value": "Hashicorp Terraform user/org API token"
        }
      ]
    },
    {
      "id": "fc043f44ba1d675c9fe12061baad57405ef4cb1c08dc66bc2060cc8ed7b70cb6",
      "category": "secret_detection",
      "name": "Dropbox API secret/key",
      "message": "Dropbox API secret/key detected; please remove and revoke it if this is a leak.",
      "description": "Dropbox API secret/key",
      "cve": "secrets.go:d0251f5c58bb1e9b5afe565138bdd7512a67e218dac526c01c3425c40bb87218:Dropbox API secret/key",
      "severity": "Critical",
      "confidence": "Unknown",
      "raw_source_code_extract": "DropboxAppSecret = \"qfxr7lh83tbkmaz\"",
      "scanner": {
        "id": "gitleaks",
        "name": "Gitleaks"
      },
      "location": {
        "file": "secrets.go",
        "commit": {
          "sha": "0000000"
        },
        "start_line": 26
      },
      "identifiers": [
        {
          "type": "gitleaks_rule_id",
          "name": "Gitleaks rule ID Dropbox API secret/key",
          "value": "Dropbox API secret/key"
        }
      ]
    },
    {
      "id": "e8e91a94ebfb988384d5145af8b068bbd9723f76bb5ca6149f072ca810e606ac",
      "category": "secret_detection",
      "name": "Flutterwave encrypted key",
      "message": "Flutterwave encrypted key detected; please remove and revoke it if this is a leak.",
      "description": "Flutterwave encrypted key",
      "cve": "secrets.go:d055f4b3af146f99e6dc02ab35b05a09661f92ef74fccfbb5cbb67f6272b497b:Flutterwave encrypted key",
      "severity": "Critical",
      "confidence": "Unknown",
      "raw_source_code_extract": "FLWSECK_TEST1a4043e5ed0c",
      "scanner": {
        "id": "gitleaks",
        "name": "Gitleaks"
      },
      "location": {
        "file": "secrets.go",
        "commit": {
          "sha": "0000000"
        },
        "start_line": 44
      },
      "identifiers": [
        {
          "type": "gitleaks_rule_id",
          "name": "Gitleaks rule ID Flutterwave encrypted key",
          "value": "Flutterwave encrypted key"
        }
      ]
    },
    {
      "id": "199cfb6c2bae924eb6cda84cbce0c340ca431c043a475e07f6ecc9357699a720",
      "category": "secret_detection",
      "name": "Shippo API token",
      "message": "Shippo API token detected; please remove and revoke it if this is a leak.",
      "description": "Shippo API token",
      "cve": "secrets.go:d24df8e14b1962465e00eb9f9eed07e3ed0fcb35b4664cdd08ead5fe9f5e179d:Shippo API token",
      "severity": "Critical",
      "confidence": "Unknown",
      "raw_source_code_extract": "shippo_live_bbfb50ece8b8e0cddb45698e55401cfebc48e99b",
      "scanner": {
        "id": "gitleaks",
        "name": "Gitleaks"
      },
      "location": {
        "file": "secrets.go",
        "commit": {
          "sha": "0000000"
        },
        "start_line": 106
      },
      "identifiers": [
        {
          "type": "gitleaks_rule_id",
          "name": "Gitleaks rule ID Shippo API token",
          "value": "Shippo API token"
        }
      ]
    },
    {
      "id": "f95d8f9defdd2a7b257f4674a707ff43dff519f409e4f2d912c9fbc1222903a3",
      "category": "secret_detection",
      "name": "Alibaba Secret Key",
      "message": "Alibaba Secret Key detected; please remove and revoke it if this is a leak.",
      "description": "Alibaba Secret Key",
      "cve": "secrets.go:d2d0de280ab9e2005e55c585e32c4babc1457698868a963fabfa6ce6a09b030d:Alibaba Secret Key",
      "severity": "Critical",
      "confidence": "Unknown",
      "raw_source_code_extract": "76DyIO8tu5s6ZfNPMbyBMH1PZGsRzN",
      "scanner": {
        "id": "gitleaks",
        "name": "Gitleaks"
      },
      "location": {
        "file": "secrets.go",
        "commit": {
          "sha": "0000000"
        },
        "start_line": 6
      },
      "identifiers": [
        {
          "type": "gitleaks_rule_id",
          "name": "Gitleaks rule ID Alibaba Secret Key",
          "value": "Alibaba Secret Key"
        }
      ]
    },
    {
      "id": "7054e360b97f44d8a2ec8d4d98841e3c12cdbe0b071f609704cbdb61a687825a",
      "category": "secret_detection",
      "name": "Dynatrace API token",
      "message": "Dynatrace API token detected; please remove and revoke it if this is a leak.",
      "description": "Dynatrace API token",
      "cve": "secrets.go:d8324faa2f7e11b97eaac9266cf9c92d897bd967751a4f4c5aff5d7b3e1420cd:Dynatrace API token",
      "severity": "Critical",
      "confidence": "Unknown",
      "raw_source_code_extract": "\"dt0c01.RBOVG3QKMDQASN2TP4ZOOBYS.M3JWBBGAMSEFBYR3AZI62OOROQRBJ2JDJO66UHDP4Z77B27IENHOTCBVP7TQ2QLI\"",
      "scanner": {
        "id": "gitleaks",
        "name": "Gitleaks"
      },
      "location": {
        "file": "secrets.go",
        "commit": {
          "sha": "0000000"
        },
        "start_line": 30
      },
      "identifiers": [
        {
          "type": "gitleaks_rule_id",
          "name": "Gitleaks rule ID Dynatrace API token",
          "value": "Dynatrace API token"
        }
      ]
    },
    {
      "id": "ef93c645249a1101392f7203220ebee4acb33876bd7fa8468e2cd5d79830f5b9",
      "category": "secret_detection",
      "name": "Typeform API token",
      "message": "Typeform API token detected; please remove and revoke it if this is a leak.",
      "description": "Typeform API token",
      "cve": "secrets.go:e0d09b6c64bd911106de66ebbdef7b61fffaddf89a4192169018d1a3cce08299:Typeform API token",
      "severity": "Critical",
      "confidence": "Unknown",
      "raw_source_code_extract": "tfp_HeDK4ZeCwwCHdvSnVnzKtjiyB1rLFyzspa7Y3Fo9yAp8_3pcodefNH4DhnE",
      "scanner": {
        "id": "gitleaks",
        "name": "Gitleaks"
      },
      "location": {
        "file": "secrets.go",
        "commit": {
          "sha": "0000000"
        },
        "start_line": 114
      },
      "identifiers": [
        {
          "type": "gitleaks_rule_id",
          "name": "Gitleaks rule ID Typeform API token",
          "value": "Typeform API token"
        }
      ]
    },
    {
      "id": "3ae110c55241a8d563f3711b928607dca52f64f77cd17fdeeb784c81628f2b66",
      "category": "secret_detection",
      "name": "Sendgrid API token",
      "message": "Sendgrid API token detected; please remove and revoke it if this is a leak.",
      "description": "Sendgrid API token",
      "cve": "secrets.go:e1b76901fa073114c9dda9d20cba7c677a7773d4d931a46043ae60c49703c3f8:Sendgrid API token",
      "severity": "Critical",
      "confidence": "Unknown",
      "raw_source_code_extract": "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",
      "scanner": {
        "id": "gitleaks",
        "name": "Gitleaks"
      },
      "location": {
        "file": "secrets.go",
        "commit": {
          "sha": "0000000"
        },
        "start_line": 102
      },
      "identifiers": [
        {
          "type": "gitleaks_rule_id",
          "name": "Gitleaks rule ID Sendgrid API token",
          "value": "Sendgrid API token"
        }
      ]
    },
    {
      "id": "ab06704599ed818f28371da6201df0a30e67cc1eb2110cd6427126a953bc98f0",
      "category": "secret_detection",
      "name": "Mapbox API token",
      "message": "Mapbox API token detected; please remove and revoke it if this is a leak.",
      "description": "Mapbox API token",
      "cve": "secrets.go:e48feea52bf6a9f60693b0d7edf52d6b64f9f9d5c3a99b9709fa6cc3cfca2dfa:Mapbox API token",
      "severity": "Critical",
      "confidence": "Unknown",
      "raw_source_code_extract": "pk.eyJ2IjoiZmV4YWEiLBJhIjoiJ2t2bGhvaFJzZGdhOBJ3bWFnbjh0dBd4diJ9.fxmBJ3SL31MF6t0JDXk7Yq",
      "scanner": {
        "id": "gitleaks",
        "name": "Gitleaks"
      },
      "location": {
        "file": "secrets.go",
        "commit": {
          "sha": "0000000"
        },
        "start_line": 78
      },
      "identifiers": [
        {
          "type": "gitleaks_rule_id",
          "name": "Gitleaks rule ID Mapbox API token",
          "value": "Mapbox API token"
        }
      ]
    },
    {
      "id": "b452ad2ca8b5c05a7c993d58955f86ab4a71e1c78cc24ec9eab47ffeebfc28f9",
      "category": "secret_detection",
      "name": "Duffel API token",
      "message": "Duffel API token detected; please remove and revoke it if this is a leak.",
      "description": "Duffel API token",
      "cve": "secrets.go:e7094f958804b809c64bd24a448510142b9fc69bdb72657951a93eccffc8a307:Duffel API token",
      "severity": "Critical",
      "confidence": "Unknown",
      "raw_source_code_extract": "\"duffel_test_gXjm31mMe36vCiHYTtHHfCmNGwxj-Ib1o4liEZdTKCT\"",
      "scanner": {
        "id": "gitleaks",
        "name": "Gitleaks"
      },
      "location": {
        "file": "secrets.go",
        "commit": {
          "sha": "0000000"
        },
        "start_line": 29
      },
      "identifiers": [
        {
          "type": "gitleaks_rule_id",
          "name": "Gitleaks rule ID Duffel API token",
          "value": "Duffel API token"
        }
      ]
    },
    {
      "id": "77d27c1eac8cb6d70b1edc93f92b211b68d093e1a430a514918a76e172fd3678",
      "category": "secret_detection",
      "name": "Rubygem API token",
      "message": "Rubygem API token detected; please remove and revoke it if this is a leak.",
      "description": "Rubygem API token",
      "cve": "secrets.go:e8add3c07b1d68e10bd13cc91e301888e094f9f20efd86eb929f7b6733e40ec7:Rubygem API token",
      "severity": "Critical",
      "confidence": "Unknown",
      "raw_source_code_extract": "rubygems_ac4f80d5d6c06ecdd417f11bcab2b614735fcf082d851aeb",
      "scanner": {
        "id": "gitleaks",
        "name": "Gitleaks"
      },
      "location": {
        "file": "secrets.go",
        "commit": {
          "sha": "0000000"
        },
        "start_line": 100
      },
      "identifiers": [
        {
          "type": "gitleaks_rule_id",
          "name": "Gitleaks rule ID Rubygem API token",
          "value": "Rubygem API token"
        }
      ]
    },
    {
      "id": "ddbaa948fd62f60e878824d91a96b93c8860e6700f27752deced036e4daa3204",
      "category": "secret_detection",
      "name": "Linear client secret/ID",
      "message": "Linear client secret/ID detected; please remove and revoke it if this is a leak.",
      "description": "Linear client secret/ID",
      "cve": "secrets.go:eb6f8176d8650890bf83cd205545a092327a7b3bc6176170459c082904697601:Linear client secret/ID",
      "severity": "Critical",
      "confidence": "Unknown",
      "raw_source_code_extract": "b4a7f4d7d9ee1fbccb62eb3ddc2c2a42",
      "scanner": {
        "id": "gitleaks",
        "name": "Gitleaks"
      },
      "location": {
        "file": "secrets.go",
        "commit": {
          "sha": "0000000"
        },
        "start_line": 64
      },
      "identifiers": [
        {
          "type": "gitleaks_rule_id",
          "name": "Gitleaks rule ID Linear client secret/ID",
          "value": "Linear client secret/ID"
        }
      ]
    },
    {
      "id": "6936368515cd4feaa166b38dec9e37892f2b212ed3bee49c6bbe059c3b86dd30",
      "category": "secret_detection",
      "name": "Pulumi API token",
      "message": "Pulumi API token detected; please remove and revoke it if this is a leak.",
      "description": "Pulumi API token",
      "cve": "secrets.go:ed9f8222b5c37770572191431f44401e0fc29d2ed7f1ac34ec4dcc696405db24:Pulumi API token",
      "severity": "Critical",
      "confidence": "Unknown",
      "raw_source_code_extract": "pul-1fbfa873a23b100a42f877f56fb7b3f61c1e2077",
      "scanner": {
        "id": "gitleaks",
        "name": "Gitleaks"
      },
      "location": {
        "file": "secrets.go",
        "commit": {
          "sha": "0000000"
        },
        "start_line": 98
      },
      "identifiers": [
        {
          "type": "gitleaks_rule_id",
          "name": "Gitleaks rule ID Pulumi API token",
          "value": "Pulumi API token"
        }
      ]
    },
    {
      "id": "b504e9a7da0d6f11a2bed7622b46ed9b62e0ae20a26e927ab7ea269c8c626280",
      "category": "secret_detection",
      "name": "Doppler API token",
      "message": "Doppler API token detected; please remove and revoke it if this is a leak.",
      "description": "Doppler API token",
      "cve": "secrets.go:f070ae0a04aec7e6e36a865e2a4ea1e4f457bc2f964de9bc860770e57fa27e6d:Doppler API token",
      "severity": "Critical",
      "confidence": "Unknown",
      "raw_source_code_extract": "\"dp.pt.gj5QCuhZaap37aCbpzP1Duxm7susBo1KFV8mNt4iJXN\"",
      "scanner": {
        "id": "gitleaks",
        "name": "Gitleaks"
      },
      "location": {
        "file": "secrets.go",
        "commit": {
          "sha": "0000000"
        },
        "start_line": 22
      },
      "identifiers": [
        {
          "type": "gitleaks_rule_id",
          "name": "Gitleaks rule ID Doppler API token",
          "value": "Doppler API token"
        }
      ]
    },
    {
      "id": "47d514b7348fb7922c10c7c22606730c2f494050904c749cb6e4449d9da6382b",
      "category": "secret_detection",
      "name": "MessageBird API client ID",
      "message": "MessageBird API client ID detected; please remove and revoke it if this is a leak.",
      "description": "MessageBird API client ID",
      "cve": "secrets.go:fbe8f65f77085b8c0952f18d0aa4cd16b11fd83af740e8aee58fe7879608be3f:MessageBird API client ID",
      "severity": "Critical",
      "confidence": "Unknown",
      "raw_source_code_extract": "f194d5db-5826-24c7-b421-2f5897308c49",
      "scanner": {
        "id": "gitleaks",
        "name": "Gitleaks"
      },
      "location": {
        "file": "secrets.go",
        "commit": {
          "sha": "0000000"
        },
        "start_line": 82
      },
      "identifiers": [
        {
          "type": "gitleaks_rule_id",
          "name": "Gitleaks rule ID MessageBird API client ID",
          "value": "MessageBird API client ID"
        }
      ]
    },
    {
      "id": "ff218a3032d435fc80c448df7ee798797fc9e3c3dc13ed53faf5606a32959799",
      "category": "secret_detection",
      "name": "Mailgun public validation key",
      "message": "Mailgun public validation key detected; please remove and revoke it if this is a leak.",
      "description": "Mailgun public validation key",
      "cve": "secrets.go:fea9d7f1d03675802022ccfea52ff5faca617d794172ad86091b3b13bc77bfe5:Mailgun public validation key",
      "severity": "Critical",
      "confidence": "Unknown",
      "raw_source_code_extract": "pubkey-1e14c9dbe3c1b868554e745247d5d036",
      "scanner": {
        "id": "gitleaks",
        "name": "Gitleaks"
      },
      "location": {
        "file": "secrets.go",
        "commit": {
          "sha": "0000000"
        },
        "start_line": 74
      },
      "identifiers": [
        {
          "type": "gitleaks_rule_id",
          "name": "Gitleaks rule ID Mailgun public validation key",
          "value": "Mailgun public validation key"
        }
      ]
    }
  ],
  "scan": {
    "analyzer": {
      "id": "secrets",
      "name": "secrets",
      "url": "https://gitlab.com/gitlab-org/security-products/analyzers/secrets",
      "vendor": {
        "name": "GitLab"
      }
    },
    "scanner": {
      "id": "gitleaks",
      "name": "Gitleaks",
      "url": "https://github.com/zricethezav/gitleaks",
      "vendor": {
        "name": "GitLab"
      },
      "version": "8.5.3"
    },
    "type": "secret_detection",
    "start_time": "2022-03-30T17:01:25",
    "end_time": "2022-03-30T17:01:25",
    "status": "success"
  }
}