{
  "development": {
    "username": "root",
    "password": "root",
    "database": "fut_backend",
    "host": "127.0.0.1",
    "dialect": "postgres"
  },
  "test": {
    "username": "root",
    "password": null,
    "database": "database_test",
    "host": "127.0.0.1",
    "dialect": "mysql"
  },
  "production": {
    "username": "****",
    "password": "****",
    "database": "****",
    "host": "ec2-34-205-209-14.compute-1.amazonaws.com",
    "dialect": "postgres",
    "dialectOptions": {
      "ssl": {
        "rejectUnauthorized": false
      }
    }
  }
}
