digraph tree {
    "000000000000000000000000" [label=<000000000000000000000000>];
    "0_NC_045512" [label=<0_NC_045512>];
    "100000000000000000000000" [label=<<font color='red'><B>1</B></font>00000000000000000000000>];
    "110000000000000000000000" [label=<1<font color='red'><B>1</B></font>0000000000000000000000>];
    "111000000000000000000000" [label=<11<font color='red'><B>1</B></font>000000000000000000000>];
    "111000000010000000000000" [label=<1110000000<font color='red'><B>1</B></font>0000000000000>];
    "111000000011000000000000" [label=<11100000001<font color='red'><B>1</B></font>000000000000>];
    "1_Spain|EPI_ISL_418251" [label=<1_Spain|EPI_ISL_418251>];
    "111100000000000000000000" [label=<111<font color='red'><B>1</B></font>00000000000000000000>];
    "111100000000001000000000" [label=<11110000000000<font color='red'><B>1</B></font>000000000>];
    "111100000000001100000000" [label=<111100000000001<font color='red'><B>1</B></font>00000000>];
    "111100000000001110000000" [label=<1111000000000011<font color='red'><B>1</B></font>0000000>];
    "4_Spain|EPI_ISL_436301" [label=<4_Spain|EPI_ISL_436301>];
    "111100000000000000010000" [label=<1111000000000000000<font color='red'><B>1</B></font>0000>];
    "111100000000000000011000" [label=<11110000000000000001<font color='red'><B>1</B></font>000>];
    "111100000000000000011100" [label=<111100000000000000011<font color='red'><B>1</B></font>00>];
    "6_Spain|EPI_ISL_444976" [label=<6_Spain|EPI_ISL_444976>];
    "111100000000100000000000" [label=<111100000000<font color='red'><B>1</B></font>00000000000>];
    "111100000000110000000000" [label=<1111000000001<font color='red'><B>1</B></font>0000000000>];
    "111100000000110000000010" [label=<1111000000001100000000<font color='red'><B>1</B></font>0>];
    "7_Spain|EPI_ISL_444975" [label=<7_Spain|EPI_ISL_444975>];
    "111000000000000001000000" [label=<11100000000000000<font color='red'><B>1</B></font>000000>];
    "111000000000000001100000" [label=<111000000000000001<font color='red'><B>1</B></font>00000>];
    "5_Spain|EPI_ISL_436324" [label=<5_Spain|EPI_ISL_436324>];
    "000010000000000000000000" [label=<0000<font color='red'><B>1</B></font>0000000000000000000>];
    "000011000000000000000000" [label=<00001<font color='red'><B>1</B></font>000000000000000000>];
    "000011100000000000000000" [label=<000011<font color='red'><B>1</B></font>00000000000000000>];
    "000011110000000000000000" [label=<0000111<font color='red'><B>1</B></font>0000000000000000>];
    "000011111000000000000000" [label=<00001111<font color='red'><B>1</B></font>000000000000000>];
    "000011111100000000000000" [label=<000011111<font color='red'><B>1</B></font>00000000000000>];
    "2_Spain|EPI_ISL_419240" [label=<2_Spain|EPI_ISL_419240>];
    "000011111100000000000001" [label=<00001111110000000000000<font color='red'><B>1</B></font>>];
    "3_Spain|EPI_ISL_419685" [label=<3_Spain|EPI_ISL_419685>];
    "000000000000000000000000" -> "0_NC_045512" [style=bold,label=""];
    "000000000000000000000000" -> "100000000000000000000000" [style=bold,label="3037"];
    "000000000000000000000000" -> "000010000000000000000000" [style=bold,label="28863"];
    "100000000000000000000000" -> "110000000000000000000000" [style=bold,label="14408"];
    "110000000000000000000000" -> "111000000000000000000000" [style=bold,label="23403"];
    "111000000000000000000000" -> "111000000010000000000000" [style=bold,label="11244"];
    "111000000000000000000000" -> "111100000000000000000000" [style=bold,label="20268"];
    "111000000000000000000000" -> "111000000000000001000000" [style=bold,label="22404"];
    "111000000010000000000000" -> "111000000011000000000000" [style=bold,label="21263"];
    "111000000011000000000000" -> "1_Spain|EPI_ISL_418251" [style=bold,label=""];
    "111100000000000000000000" -> "111100000000001000000000" [style=bold,label="17126"];
    "111100000000000000000000" -> "111100000000000000010000" [style=bold,label="8739"];
    "111100000000000000000000" -> "111100000000100000000000" [style=bold,label="28883"];
    "111100000000001000000000" -> "111100000000001100000000" [style=bold,label="27578"];
    "111100000000001100000000" -> "111100000000001110000000" [style=bold,label="28812"];
    "111100000000001110000000" -> "4_Spain|EPI_ISL_436301" [style=bold,label=""];
    "111100000000000000010000" -> "111100000000000000011000" [style=bold,label="18744"];
    "111100000000000000011000" -> "111100000000000000011100" [style=bold,label="22893"];
    "111100000000000000011100" -> "6_Spain|EPI_ISL_444976" [style=bold,label=""];
    "111100000000100000000000" -> "111100000000110000000000" [style=bold,label="6354"];
    "111100000000110000000000" -> "111100000000110000000010" [style=bold,label="5176"];
    "111100000000110000000010" -> "7_Spain|EPI_ISL_444975" [style=bold,label=""];
    "111000000000000001000000" -> "111000000000000001100000" [style=bold,label="29144"];
    "111000000000000001100000" -> "5_Spain|EPI_ISL_436324" [style=bold,label=""];
    "000010000000000000000000" -> "000011000000000000000000" [style=bold,label="9477"];
    "000011000000000000000000" -> "000011100000000000000000" [style=bold,label="14805"];
    "000011100000000000000000" -> "000011110000000000000000" [style=bold,label="25979"];
    "000011110000000000000000" -> "000011111000000000000000" [style=bold,label="28144"];
    "000011111000000000000000" -> "000011111100000000000000" [style=bold,label="28657"];
    "000011111100000000000000" -> "2_Spain|EPI_ISL_419240" [style=bold,label=""];
    "000011111100000000000000" -> "000011111100000000000001" [style=bold,label="2001"];
    "000011111100000000000001" -> "3_Spain|EPI_ISL_419685" [style=bold,label=""];
	{rank = same; "0_NC_045512"; "1_Spain|EPI_ISL_418251"; "2_Spain|EPI_ISL_419240"; "3_Spain|EPI_ISL_419685"; "4_Spain|EPI_ISL_436301"; "5_Spain|EPI_ISL_436324"; "6_Spain|EPI_ISL_444976"; "7_Spain|EPI_ISL_444975";}
}