digraph tree {
    "00000000000000000" [label=<00000000000000000>];
    "0_NC_045512" [label=<0_NC_045512>];
    "00000000100000000" [label=<00000000<font color='red'><B>1</B></font>00000000>];
    "00000000100000001" [label=<0000000010000000<font color='red'><B>1</B></font>>];
    "1_Italy|EPI_ISL_412974" [label=<1_Italy|EPI_ISL_412974>];
    "10000000000000000" [label=<<font color='red'><B>1</B></font>0000000000000000>];
    "11000000000000000" [label=<1<font color='red'><B>1</B></font>000000000000000>];
    "11100000000000000" [label=<11<font color='red'><B>1</B></font>00000000000000>];
    "2_Italy|EPI_ISL_412973" [label=<2_Italy|EPI_ISL_412973>];
    "3_Italy|EPI_ISL_417423" [label=<3_Italy|EPI_ISL_417423>];
    "11110000000000000" [label=<111<font color='red'><B>1</B></font>0000000000000>];
    "11111000000000000" [label=<1111<font color='red'><B>1</B></font>000000000000>];
    "4_Italy|EPI_ISL_418256" [label=<4_Italy|EPI_ISL_418256>];
    "11111100000000000" [label=<11111<font color='red'><B>1</B></font>00000000000>];
    "11111110000000000" [label=<111111<font color='red'><B>1</B></font>0000000000>];
    "11111110010000000" [label=<111111100<font color='red'><B>1</B></font>0000000>];
    "7_Italy|EPI_ISL_435152" [label=<7_Italy|EPI_ISL_435152>];
    "11111111000000000" [label=<1111111<font color='red'><B>1</B></font>000000000>];
    "11111111000100000" [label=<11111111000<font color='red'><B>1</B></font>00000>];
    "11111111000110000" [label=<111111110001<font color='red'><B>1</B></font>0000>];
    "11111111000111000" [label=<1111111100011<font color='red'><B>1</B></font>000>];
    "11111111000111100" [label=<11111111000111<font color='red'><B>1</B></font>00>];
    "11111111000111110" [label=<111111110001111<font color='red'><B>1</B></font>0>];
    "8_Italy|EPI_ISL_436729" [label=<8_Italy|EPI_ISL_436729>];
    "5_Italy|EPI_ISL_419254" [label=<5_Italy|EPI_ISL_419254>];
    "11100000001000000" [label=<1110000000<font color='red'><B>1</B></font>000000>];
    "6_Italy|EPI_ISL_428854" [label=<6_Italy|EPI_ISL_428854>];
    "00000000000000000" -> "0_NC_045512" [style=bold,label=""];
    "00000000000000000" -> "00000000100000000" [style=bold,label="26144"];
    "00000000000000000" -> "10000000000000000" [style=bold,label="3037"];
    "00000000100000000" -> "00000000100000001" [style=bold,label="11083"];
    "00000000100000001" -> "1_Italy|EPI_ISL_412974" [style=bold,label=""];
    "10000000000000000" -> "11000000000000000" [style=bold,label="14408"];
    "11000000000000000" -> "11100000000000000" [style=bold,label="23403"];
    "11100000000000000" -> "2_Italy|EPI_ISL_412973" [style=bold,label=""];
    "11100000000000000" -> "3_Italy|EPI_ISL_417423" [style=bold,label=""];
    "11100000000000000" -> "11110000000000000" [style=bold,label="28883"];
    "11100000000000000" -> "5_Italy|EPI_ISL_419254" [style=bold,label=""];
    "11100000000000000" -> "11100000001000000" [style=bold,label="29009"];
    "11110000000000000" -> "11111000000000000" [style=bold,label="28881, 28882"];
    "11111000000000000" -> "4_Italy|EPI_ISL_418256" [style=bold,label=""];
    "11111000000000000" -> "11111100000000000" [style=bold,label="6869"];
    "11111100000000000" -> "11111110000000000" [style=bold,label="6866"];
    "11111110000000000" -> "11111110010000000" [style=bold,label="5986"];
    "11111110000000000" -> "11111111000000000" [style=bold,label="25459"];
    "11111110010000000" -> "7_Italy|EPI_ISL_435152" [style=bold,label=""];
    "11111111000000000" -> "11111111000100000" [style=bold,label="21627"];
    "11111111000100000" -> "11111111000110000" [style=bold,label="3045"];
    "11111111000110000" -> "11111111000111000" [style=bold,label="6449"];
    "11111111000111000" -> "11111111000111100" [style=bold,label="6863"];
    "11111111000111100" -> "11111111000111110" [style=bold,label="19677"];
    "11111111000111110" -> "8_Italy|EPI_ISL_436729" [style=bold,label=""];
    "11100000001000000" -> "6_Italy|EPI_ISL_428854" [style=bold,label=""];
	{rank = same; "0_NC_045512"; "1_Italy|EPI_ISL_412974"; "2_Italy|EPI_ISL_412973"; "3_Italy|EPI_ISL_417423"; "4_Italy|EPI_ISL_418256"; "5_Italy|EPI_ISL_419254"; "6_Italy|EPI_ISL_428854"; "7_Italy|EPI_ISL_435152"; "8_Italy|EPI_ISL_436729";}
}