digraph tree {
    "000000000000000000000" [label=<000000000000000000000>];
    "0_NC_045512" [label=<0_NC_045512>];
    "100000000000000000000" [label=<<font color='red'><B>1</B></font>00000000000000000000>];
    "110000000000000000000" [label=<1<font color='red'><B>1</B></font>0000000000000000000>];
    "111000000000000000000" [label=<11<font color='red'><B>1</B></font>000000000000000000>];
    "111010000000000000000" [label=<1110<font color='red'><B>1</B></font>0000000000000000>];
    "111011000000000000000" [label=<11101<font color='red'><B>1</B></font>000000000000000>];
    "111011100000000000000" [label=<111011<font color='red'><B>1</B></font>00000000000000>];
    "111011110000000000000" [label=<1110111<font color='red'><B>1</B></font>0000000000000>];
    "111011111000000000000" [label=<11101111<font color='red'><B>1</B></font>000000000000>];
    "111011111100000000000" [label=<111011111<font color='red'><B>1</B></font>00000000000>];
    "111011111110000000000" [label=<1110111111<font color='red'><B>1</B></font>0000000000>];
    "111011111110010000000" [label=<1110111111100<font color='red'><B>1</B></font>0000000>];
    "111011111110010000001" [label=<11101111111001000000<font color='red'><B>1</B></font>>];
    "Italy|EPI_ISL_436729" [label=<Italy|EPI_ISL_436729>];
    "111100000000000000000" [label=<111<font color='red'><B>1</B></font>00000000000000000>];
    "111100000000001000000" [label=<11110000000000<font color='red'><B>1</B></font>000000>];
    "Russia|EPI_ISL_430108" [label=<Russia|EPI_ISL_430108>];
    "111100000001000000000" [label=<11110000000<font color='red'><B>1</B></font>000000000>];
    "111100000001100000000" [label=<111100000001<font color='red'><B>1</B></font>00000000>];
    "Spain|EPI_ISL_444975" [label=<Spain|EPI_ISL_444975>];
    "111000000000000100000" [label=<111000000000000<font color='red'><B>1</B></font>00000>];
    "111000000000000110000" [label=<1110000000000001<font color='red'><B>1</B></font>0000>];
    "111000000000000111000" [label=<11100000000000011<font color='red'><B>1</B></font>000>];
    "111000000000000111100" [label=<111000000000000111<font color='red'><B>1</B></font>00>];
    "111000000000000111110" [label=<1110000000000001111<font color='red'><B>1</B></font>0>];
    "USA|EPI_ISL_435547" [label=<USA|EPI_ISL_435547>];
    "000000000000000000000" -> "0_NC_045512" [style=bold,label=""];
    "000000000000000000000" -> "100000000000000000000" [style=bold,label="3037"];
    "100000000000000000000" -> "110000000000000000000" [style=bold,label="23403"];
    "110000000000000000000" -> "111000000000000000000" [style=bold,label="14408"];
    "111000000000000000000" -> "111010000000000000000" [style=bold,label="3045"];
    "111000000000000000000" -> "111100000000000000000" [style=bold,label="20268"];
    "111000000000000000000" -> "111000000000000100000" [style=bold,label="1059"];
    "111010000000000000000" -> "111011000000000000000" [style=bold,label="6449"];
    "111011000000000000000" -> "111011100000000000000" [style=bold,label="6863"];
    "111011100000000000000" -> "111011110000000000000" [style=bold,label="6866"];
    "111011110000000000000" -> "111011111000000000000" [style=bold,label="6869"];
    "111011111000000000000" -> "111011111100000000000" [style=bold,label="19677"];
    "111011111100000000000" -> "111011111110000000000" [style=bold,label="21627"];
    "111011111110000000000" -> "111011111110010000000" [style=bold,label="28881, 28882"];
    "111011111110010000000" -> "111011111110010000001" [style=bold,label="25459"];
    "111011111110010000001" -> "Italy|EPI_ISL_436729" [style=bold,label=""];
    "111100000000000000000" -> "111100000000001000000" [style=bold,label="835"];
    "111100000000000000000" -> "111100000001000000000" [style=bold,label="6354"];
    "111100000000001000000" -> "Russia|EPI_ISL_430108" [style=bold,label=""];
    "111100000001000000000" -> "111100000001100000000" [style=bold,label="5176"];
    "111100000001100000000" -> "Spain|EPI_ISL_444975" [style=bold,label=""];
    "111000000000000100000" -> "111000000000000110000" [style=bold,label="11916"];
    "111000000000000110000" -> "111000000000000111000" [style=bold,label="18998"];
    "111000000000000111000" -> "111000000000000111100" [style=bold,label="25563"];
    "111000000000000111100" -> "111000000000000111110" [style=bold,label="27059"];
    "111000000000000111110" -> "USA|EPI_ISL_435547" [style=bold,label=""];
	{rank = same; "0_NC_045512"; "Italy|EPI_ISL_436729"; "Russia|EPI_ISL_430108"; "Spain|EPI_ISL_444975"; "USA|EPI_ISL_435547";}
}