SEQ_ID,TOOL,POSs,GENE,REF_COD,REF_AMMINO,MUT_COD,MUT_AMMINO,CDS_START,CDS_END
Italy|EPI_ISL_436729,kalign,[3037],GeneID:43740578,TTC,F,TTT,F,266,21555
Italy|EPI_ISL_436729,kalign,[3037],GeneID:43740578,TTC,F,TTT,F,266,13483
Italy|EPI_ISL_436729,kalign,[3045],GeneID:43740578,CCA,P,CTA,L,266,21555
Italy|EPI_ISL_436729,kalign,[3045],GeneID:43740578,CCA,P,CTA,L,266,13483
Italy|EPI_ISL_436729,kalign,[6449],GeneID:43740578,CTT,L,TTT,F,266,21555
Italy|EPI_ISL_436729,kalign,[6449],GeneID:43740578,CTT,L,TTT,F,266,13483
Italy|EPI_ISL_436729,kalign,[6863],GeneID:43740578,AAG,K,MAG,None,266,21555
Italy|EPI_ISL_436729,kalign,[6863],GeneID:43740578,AAG,K,MAG,None,266,13483
Italy|EPI_ISL_436729,kalign,[6866],GeneID:43740578,AAT,N,WAT,None,266,21555
Italy|EPI_ISL_436729,kalign,[6866],GeneID:43740578,AAT,N,WAT,None,266,13483
Italy|EPI_ISL_436729,kalign,[6869],GeneID:43740578,ACT,T,WCT,None,266,21555
Italy|EPI_ISL_436729,kalign,[6869],GeneID:43740578,ACT,T,WCT,None,266,13483
Italy|EPI_ISL_436729,kalign,[14408],GeneID:43740578,CCT,P,CTT,L,266,21555
Italy|EPI_ISL_436729,kalign,[19677],GeneID:43740578,CAG,Q,CAR,None,266,21555
Italy|EPI_ISL_436729,kalign,[21627],GeneID:43740568,ACT,T,AYT,None,21563,25384
Italy|EPI_ISL_436729,kalign,[23403],GeneID:43740568,GAT,D,GGT,G,21563,25384
Italy|EPI_ISL_436729,kalign,[25459],GeneID:43740569,GCT,A,KCT,None,25393,26220
Italy|EPI_ISL_436729,kalign,"[28881, 28882]",GeneID:43740575,AGG,R,AAA,K,28274,29533
Italy|EPI_ISL_436729,kalign,[28883],GeneID:43740575,GGA,G,CGA,R,28274,29533
Russia|EPI_ISL_430108,kalign,[835],GeneID:43740578,TTC,F,TTT,F,266,21555
Russia|EPI_ISL_430108,kalign,[835],GeneID:43740578,TTC,F,TTT,F,266,13483
Russia|EPI_ISL_430108,kalign,[3037],GeneID:43740578,TTC,F,TTT,F,266,21555
Russia|EPI_ISL_430108,kalign,[3037],GeneID:43740578,TTC,F,TTT,F,266,13483
Russia|EPI_ISL_430108,kalign,[14408],GeneID:43740578,CCT,P,CTT,L,266,21555
Russia|EPI_ISL_430108,kalign,[20268],GeneID:43740578,TTA,L,TTG,L,266,21555
Russia|EPI_ISL_430108,kalign,[23403],GeneID:43740568,GAT,D,GGT,G,21563,25384
USA|EPI_ISL_435547,kalign,[1059],GeneID:43740578,ACC,T,ATC,I,266,21555
USA|EPI_ISL_435547,kalign,[1059],GeneID:43740578,ACC,T,ATC,I,266,13483
USA|EPI_ISL_435547,kalign,[3037],GeneID:43740578,TTC,F,TTT,F,266,21555
USA|EPI_ISL_435547,kalign,[3037],GeneID:43740578,TTC,F,TTT,F,266,13483
USA|EPI_ISL_435547,kalign,[11916],GeneID:43740578,TCA,S,TTA,L,266,21555
USA|EPI_ISL_435547,kalign,[11916],GeneID:43740578,TCA,S,TTA,L,266,13483
USA|EPI_ISL_435547,kalign,[14408],GeneID:43740578,CCT,P,CTT,L,266,21555
USA|EPI_ISL_435547,kalign,[18998],GeneID:43740578,GCA,A,GTA,V,266,21555
USA|EPI_ISL_435547,kalign,[23403],GeneID:43740568,GAT,D,GGT,G,21563,25384
USA|EPI_ISL_435547,kalign,[25563],GeneID:43740569,CAG,Q,CAT,H,25393,26220
USA|EPI_ISL_435547,kalign,[27059],GeneID:43740571,TAC,Y,TAT,Y,26523,27191
Spain|EPI_ISL_444975,kalign,[3037],GeneID:43740578,TTC,F,TTT,F,266,21555
Spain|EPI_ISL_444975,kalign,[3037],GeneID:43740578,TTC,F,TTT,F,266,13483
Spain|EPI_ISL_444975,kalign,[5176],GeneID:43740578,ACA,T,ACG,T,266,21555
Spain|EPI_ISL_444975,kalign,[5176],GeneID:43740578,ACA,T,ACG,T,266,13483
Spain|EPI_ISL_444975,kalign,[6354],GeneID:43740578,TCA,S,TTA,L,266,21555
Spain|EPI_ISL_444975,kalign,[6354],GeneID:43740578,TCA,S,TTA,L,266,13483
Spain|EPI_ISL_444975,kalign,[14408],GeneID:43740578,CCT,P,CTT,L,266,21555
Spain|EPI_ISL_444975,kalign,[20268],GeneID:43740578,TTA,L,TTG,L,266,21555
Spain|EPI_ISL_444975,kalign,[23403],GeneID:43740568,GAT,D,GGT,G,21563,25384
Spain|EPI_ISL_444975,kalign,[28883],GeneID:43740575,GGA,G,AGA,R,28274,29533
