{
	"$schema": "https://raw.githubusercontent.com/martinring/tmlanguage/master/tmlanguage.json",
	"name": "Tetrayder ultra programing language",
	"patterns": [
		{
			"include": "#comments"
		},
		{
			"include": "#keywords"
		},
		{
			"include": "#operators"
		},
		{
			"include": "#constants"
		},
		{
			"include": "#paramDescriptions"
		},
		{
			"include": "#strings"
		}
	],
	"repository": {
		"comments":{
			"patterns": [
				{
					"begin": "//",
					"end": "\\n",
					"name": "comment.line.tdr"
				}
			]
		},
		"keywords": {
			"patterns": [{
				"name": "keyword.control.tdr",
				"match": "IF|THEN|FROM|ADD|RUN|CALC|SELECT|METHOD|TAKE|REMOVE|COUNT|ANALIZE|ORDER_BY|DESC"
			}]
		},
		"operators": {
			"patterns": [{
				"name": "support.type.tdr",
				"match": "COMB|PARAM|MIN|MAX|GRAPH|AVG|OR|AND|FIRST|LAST|ALL"
			}]
		},
		"constants": {
			"patterns": [{
				"name": "variable.name",
				"match": "PROGNAME|METRIC|(?:[-z]\\w+[-]?)+"
			}]
		},
		"paramDescriptions": {
			"patterns": [{
				"name": "keyword.other.unit",
				"match": "ENUM|RANGE|COND|GRID|RANDOM|SCRIPT|FLAG"
			}]
		},
		"strings": {
			"name": "string.quoted.double.tdr",
			"begin": "\"",
			"end": "\"",
			"patterns": [
				{
					"name": "constant.character.escape.tdr",
					"match": "\\\\."
				}
			]
		}
	},
	"scopeName": "source.tdr"
}