Name,Age,Event,Sex,Division,BodyweightKg,WeightClassKg,Squat1Kg,Squat2Kg,Squat3Kg,Squat4Kg,Best3SquatKg,Bench1Kg,Bench2Kg,Bench3Kg,Bench4Kg,Best3BenchKg,Deadlift1Kg,Deadlift2Kg,Deadlift3Kg,Deadlift4Kg,Best3DeadliftKg,TotalKg,Equipment,Place
McKenna Kozina,16,SBD,F,Teen 16-17,46.5,48,45,55,70,77.5,70,45,-50,-50,,45,45,65,80,,80,195,Raw,1
Christina Lam,27,SBD,F,Open,47.8,48,82.5,90,-92.5,,90,55,57.5,-60,,57.5,112.5,117.5,123.5,128,123.5,271,Raw,1
Peyton Swagar,13,SBD,F,Teen 12-13,55.5,56,42.5,47.5,52.5,,52.5,25,32.5,37.5,,37.5,65,67.5,70,,70,160,Raw,1
Sherine Thoummarath,21,SBD,F,Junior 20-24,54.9,56,112.5,120,-125,,120,52.5,60,-62.5,,60,142.5,158,-160,,158,338,Raw,1
Taylor Mann,18,SBD,F,Teen 18-19,56.6,60,75,77.5,82.5,,82.5,50,52.5,55,,55,92.5,95,97.5,,97.5,235,Raw,1
Kaitlyn Coolen,23,SBD,F,Junior 20-24,58.9,60,85,-90,,,85,37.5,40,-42.5,,40,105,112.5,120,-125.5,120,245,Raw,1
Sandra Cappon,47,SBD,F,Master 45-49,60,60,80,87.5,92.5,95,92.5,57.5,-60,-60,,57.5,115,125,130,132.5,130,280,Raw,1
Liv Price,17,SBD,F,Teen 16-17,64.8,67.5,102.5,-110,-110,,102.5,52.5,55,57.5,,57.5,107.5,110,115,,115,275,Raw,1
Megan Kretschmer,26,SBD,F,Open,63.5,67.5,110,115,120,,120,60,-65,-65,,60,127.5,140,-150,,140,320,Raw,1
Andrea Melito,25,SBD,F,Open,65.7,67.5,97.5,105,117.5,,117.5,57.5,-67.5,-67.5,,57.5,115,125,-137.5,,125,300,Raw,2
Crystal Tuesek,30,SBD,F,Open,66.9,67.5,95,100,105,,105,45,52.5,55,,55,117.5,122.5,127.5,,127.5,287.5,Raw,3
Jessica Stephens,25,SBD,F,Open,65.3,67.5,67.5,-80,-80,,67.5,35,40,-45,,40,87.5,92.5,105,,105,212.5,Raw,4
Gillian McCann,35,SBD,F,Submaster 35-39,66.8,67.5,102.5,107.5,110,112.5,110,67.5,72.5,75,,75,130,140,145,,145,330,Raw,1
Leyla Guliyeva,35,SBD,F,Submaster 35-39,64.5,67.5,82.5,90,95,,95,52.5,-57.5,-57.5,,52.5,122.5,135,142.5,,142.5,290,Raw,2
Sheila Sutton,39,SBD,F,Submaster 35-39,67.2,67.5,92.5,102.5,107.5,-112.5,107.5,45,-52.5,52.5,,52.5,110,120,130,,130,290,Raw,3
Carla Morris,38,SBD,F,Submaster 35-39,64.7,67.5,82.5,85,-90,,85,50,52.5,-57.5,,52.5,85,92.5,-100,,92.5,230,Raw,4
Elizabeth Fraser,19,SBD,F,Teen 18-19,73.6,75,92.5,100,-110,,100,55,62.5,65,-67.5,65,117.5,-125,-125,,117.5,282.5,Raw,1
Meghan Trebilco,23,SBD,F,Junior 20-24,74,75,97.5,107.5,112.5,,112.5,75,77.5,-80,,77.5,122.5,135,140,143,140,330,Raw,1
Ashley Proulx,20,SBD,F,Junior 20-24,73.6,75,72.5,80,85,,85,50,52.5,57.5,,57.5,110,117.5,122.5,,122.5,265,Raw,2
Caitlin Ryan,22,SBD,F,Junior 20-24,70.3,75,70,75,-80,,75,35,-40,-40,,35,77.5,82.5,90,,90,200,Raw,3
Bonni Rogers,31,SBD,F,Open,72.2,75,110,115,-120,,115,67.5,-70,-70,,67.5,157.5,165,172.5,,172.5,355,Raw,1
Erin Kronstedt,29,SBD,F,Open,70.6,75,92.5,100,105,,105,57.5,60,-62.5,,60,117.5,-127.5,127.5,,127.5,292.5,Raw,2
Sylwia Wenslaw,32,SBD,F,Open,71.6,75,-75,77.5,80,,80,-50,-50,-50,,,107.5,-112.5,112.5,,112.5,192.5,Raw,3
Marissa Brolo,40,SBD,F,Master 40-44,74.5,75,-97.5,100,-110,,100,60,62.5,-65,,62.5,120,130,137.5,-142.5,137.5,300,Raw,1
Geri Reimer,47,SBD,F,Master 45-49,70.7,75,82.5,-87.5,92.5,,92.5,55,60,-65,,60,105,110,120,,120,272.5,Raw,1
Allison MacNearney,54,SBD,F,Master 50-54,74.1,75,52.5,62.5,72.5,,72.5,35,37.5,40,,40,92.5,110,120,,120,232.5,Raw,1
Zahra Woods,19,SBD,F,Teen 18-19,79.7,82.5,-90,95,100,,100,45,50,-55,,50,105,115,-125,,115,265,Raw,1
Taylor Wheatley,26,SBD,F,Open,80.1,82.5,95,102.5,-107.5,,102.5,65,70,-72.5,,70,132.5,140,-147.5,,140,312.5,Raw,1
Vanessa Reed,33,SBD,F,Open,80.2,82.5,105,110,-112.5,,110,57.5,-62.5,62.5,,62.5,-115,115,-120,,115,287.5,Raw,2
Nora Kish,39,SBD,F,Submaster 35-39,81.6,82.5,112.5,120,-125,,120,55,57.5,-60,,57.5,140,147.5,-155,,147.5,325,Raw,1
Jenn Swagar,42,SBD,F,Master 40-44,75.5,82.5,-85,90,95,,95,75,80,-85,,80,130,135,140,,140,315,Raw,1
Lori McWatters,46,SBD,F,Master 45-49,81.1,82.5,80,85,88,90,88,57.5,63.5,-65,,63.5,115,125,131,,131,282.5,Raw,1
Michelle Balsillie,45,SBD,F,Master 45-49,78.6,82.5,80,85,87.5,,87.5,47.5,52.5,57.5,-64,57.5,90,95,100,,100,245,Raw,2
Margaret Estabrooks,68,SBD,F,Master 65-69,79.6,82.5,47.5,-52.5,52.5,,52.5,35,37.5,40,,40,82.5,87.5,92.5,,92.5,185,Raw,1
Dawn Krpan,39,SBD,F,Submaster 35-39,84.5,90,107.5,117.5,125,130,125,57.5,60,-65,,60,135,147.5,155,,155,340,Raw,1
Suzanne Westcott,42,SBD,F,Master 40-44,85.9,90,102.5,107.5,112.5,,112.5,65,-70,-70,,65,112.5,117.5,125,,125,302.5,Raw,1
Amber Hamilton,34,SBD,F,Open,100.7,90+,110,115,120,,120,70,77.5,-86,,77.5,125,135,145,,145,342.5,Raw,1
Alanna Gibson,35,SBD,F,Submaster 35-39,118.7,90+,97.5,110,-120,,110,65,70,72.5,,72.5,110,120,130,,130,312.5,Raw,1
Nigel Whitford,24,SBD,M,Junior 20-24,55.6,56,130,135,140,,140,90,95,100,102.5,100,165,175,185,-190,185,425,Raw,1
Alex Saretsky,26,SBD,M,Open,67,67.5,185,195,197.5,,197.5,-140,-140,-140,,,220,-230,-230,,220,417.5,Raw,1
Colin Yuen,29,SBD,M,Open,65.1,67.5,100,112.5,122.5,,122.5,70,-77.5,-77.5,,70,140,150,162.5,,162.5,355,Raw,2
Rahul Singh,26,SBD,M,Open,67.5,67.5,92.5,-97.5,97.5,,97.5,70,77.5,-85,,77.5,137.5,142.5,-147.5,,142.5,317.5,Raw,3
Brenden Eberle,23,SBD,M,Junior 20-24,74.7,75,,,,,,142.5,147.5,-150,,147.5,250,260,-272.5,,260,,Raw,DQ
Victor Akpawan,28,SBD,M,Open,82.1,82.5,207.5,217.5,,,217.5,125,137.5,142.5,,142.5,260,280.5,,,280.5,640.5,Raw,1
Kyle Winstanley,28,SBD,M,Open,82.4,82.5,175,-180,-182.5,,175,122.5,127.5,-132.5,,127.5,232.5,-245,-245,,232.5,535,Raw,2
Gordon Daviau,33,SBD,M,Open,82.1,82.5,-170,170,-180,,170,-100,-115,115,,115,200,212.5,-220,,212.5,497.5,Raw,3
Vitalie Ursu,36,SBD,M,Submaster 35-39,80.2,82.5,210,230,-240,,230,160,-170,-170,,160,250,272.5,-280,,272.5,662.5,Raw,1
Kory Kozina,35,SBD,M,Submaster 35-39,82.4,82.5,137.5,160,-165,,160,92.5,-100,-100,,92.5,160,-170,-170,,160,412.5,Raw,2
Paul Butts,46,SBD,M,Master 45-49,88.9,90,125,-135,-135,,125,-85,87.5,-90,,87.5,140,152.5,-160,,152.5,365,Raw,1
Colin Mullany,56,SBD,M,Master 55-59,86.5,90,100,,,,100,120,128,132.5,-137.5,132.5,100,,,,100,332.5,Raw,1
Stanley Guedes,31,SBD,M,Open,89.1,90,240,255,-265,,255,140,147.5,152.5,,152.5,282.5,305,-317.5,,305,712.5,Raw,1
Kyle Kirzinger,32,SBD,M,Open,87.1,90,135,147.5,155,,155,82.5,87.5,-95,,87.5,165,180,190,,190,432.5,Raw,2
Brodie Pattenden,30,SBD,M,Open,89.4,90,117.5,132.5,140,,140,87.5,97.5,-107.5,,97.5,145,155,162.5,,162.5,400,Raw,3
Warren Carrol,40,SBD,M,Master 40-44,96.4,100,170,177.5,-182.5,,177.5,130,137.5,-145,,137.5,165,175,185,,185,500,Raw,1
Spencer Stevens,48,SBD,M,Master 45-49,92.5,100,140,150,162.5,,162.5,70,80,87.5,-108,87.5,160,175,190,-201,190,440,Raw,1
Kevin Lutz,23,SBD,M,Junior 20-24,99.5,100,217.5,235,242.5,,242.5,165,172.5,-177.5,,172.5,225,240,250,,250,665,Raw,1
Christopher Carrera,23,SBD,M,Junior 20-24,97.2,100,195,205,212.5,,212.5,147.5,-160,-160,,147.5,240,250,-260,,250,610,Raw,2
Sebastian Lindner,27,SBD,M,Open,99.4,100,205,215,-220,,215,125,130,135,,135,237.5,250,255,,255,605,Raw,1
Blair Lunau,34,SBD,M,Open,90.5,100,-122.5,132.5,137.5,,137.5,95,105,107.5,110,107.5,160,175,190,201,190,435,Raw,3
Dawson Holloway,31,SBD,M,Open,95.2,100,-150,157.5,162.5,,162.5,95,-97.5,97.5,,97.5,162.5,172.5,180,,180,440,Raw,2
Andrew Harding,34,SBD,M,Open,94.6,100,130,135,-145,,135,90,95,97.5,,97.5,160,175,190,-201,190,422.5,Raw,4
Patrick Cullum,46,SBD,M,Master 45-49,108.7,110,210,215,-225,,215,-130,-130,-130,,,182.5,225,240,,240,455,Raw,1
Mike Proskow,50,SBD,M,Master 50-54,106,110,105,110,115,,115,137.5,140,-145,,140,150,160,170,,170,425,Raw,1
Brent Woolnough,58,SBD,M,Master 55-59,109.1,110,-175,175,,,175,135,142.5,147.5,150,147.5,-190,-190,-190,,,,Raw,DQ
Alexander Pronchuk,23,SBD,M,Junior 20-24,104.1,110,220,232.5,-242.5,,232.5,142.5,150,-152.5,,150,255,280,-295,,280,662.5,Raw,1
Robby Wang,26,SBD,M,Open,108.3,110,190,205,-210,,205,110,-120,120,,120,230,247.5,-260,,247.5,572.5,Raw,1
Mike Frost,29,SBD,M,Open,124.9,125,195,205,212.5,,212.5,167.5,172.5,175,,175,260,272.5,282.5,,282.5,670,Raw,1
Chris Caleffi,32,SBD,M,Open,111,125,180,192.5,200,,200,130,137.5,145,,145,205,212.5,-225,,212.5,557.5,Raw,2
Justin Fraser,29,SBD,M,Open,120.9,125,162.5,177.5,-185,,177.5,102.5,110,-120,,110,182.5,192.5,205,,205,492.5,Raw,3
Meagen Lynn,31,BD,F,Open,102.6,90+,,,,,,52.5,-57.5,-57.5,,52.5,95,105,-137.5,,105,157.5,Raw,1
Mark Anderson,32,BD,M,Open,135.2,140,,,,,,100,107.5,-110,,107.5,180,-190,195,,195,302.5,Raw,1
Cory Fisher,44,B,F,Master 40-44,58.8,60,,,,,,60,65,-67.5,,65,,,,,,65,Raw,1
Teresa Lindgren,32,B,F,Open,73.7,75,,,,,,47.5,50,-55,,50,,,,,,50,Raw,1
Stephanie Miller,37,B,F,Submaster 35-39,68.9,75,,,,,,45,-50,-50,,45,,,,,,45,Raw,1
Alan Day,91,B,M,Master 80+,74.4,75,,,,,,57.5,63,65,-68,65,,,,,,65,Raw,1
Mike Habina,50,B,M,Master 50-54,81.3,82.5,,,,,,127.5,132.5,-137.5,,132.5,,,,,,132.5,Raw,1
Kevin Wais,25,B,M,Open,81.4,82.5,,,,,,173,183,187,191,187,,,,,,187,Raw,1
Garner Bleskie,46,B,M,Master 45-49,89.9,90,,,,,,137.5,-142.5,142.5,,142.5,,,,,,142.5,Raw,1
Tom Hoekstra,56,B,M,Master 55-59,118,125,,,,,,-145,145,150,,150,,,,,,150,Raw,1
Gino Caleffi,10,D,M,Youth,28.6,48,,,,,,,,,,,50,55,-60,,55,55,Raw,1
Theoren Wood,26,D,M,Open,106.5,110,,,,,,,,,,,210,220,232.5,,232.5,232.5,Raw,1
