Name,Age,Division,BodyweightKg,WeightClassKg,Squat1Kg,Squat2Kg,Squat3Kg,Squat4Kg,Best3SquatKg,Bench1Kg,Bench2Kg,Bench3Kg,Best3BenchKg,Deadlift1Kg,Deadlift2Kg,Deadlift3Kg,Best3DeadliftKg,TotalKg,Place,Event,Equipment,Sex
Bec Giles,32,F-OR,64.9,67.5,140,147.5,152.5,,152.5,80,85,-90,85,137.5,147.5,157.5,157.5,395,3,SBD,Wraps,F
Braeden Small,23,F-OR,59.5,60,95,102.5,110,,110,62.5,67.5,-72.5,67.5,110,117.5,125,125,302.5,3,SBD,Wraps,F
Caitlin Barraclough,22,F-OR,66,67.5,105,112.5,117.5,,117.5,70,75,-77.5,75,117.5,127.5,140,140,332.5,4,SBD,Wraps,F
Casey Pawson,22,F-OR,64.4,67.5,155,170,175,,175,87.5,95,100,100,160,175,185,185,460,2,SBD,Wraps,F
Gemma Stewart,32,F-OR,105.1,110,142.5,150,160,,160,85,90,92.5,92.5,165,172.5,-175,172.5,425,3,SBD,Wraps,F
Julia Falvey,36,F-OR,58.6,60,127.5,132.5,135,,135,65,70,72.5,72.5,160,170,175,175,382.5,1,SBD,Wraps,F
Kate Crook,18,F-OR,56,56,95,105,-110,,105,45,50,-52.5,50,105,110,115,115,270,2,SBD,Wraps,F
Lauren Brown,34,F-OR,87.7,90,170,-180,-180,,170,77.5,85,90,90,145,155,162.5,162.5,422.5,1,SBD,Wraps,F
Mahli Roberts,27,F-OR,67.3,67.5,165,175,180,,180,95,100,102.5,102.5,170,185,-190,185,467.5,1,SBD,Wraps,F
Melissa Hall,45,F-OR,59.1,60,,,,,,65,70,-72.5,70,120,130,140,140,210,1,BD,Raw,F
Nicole Farrell,28,F-OR,47.9,48,95,105,112.5,,112.5,-50,-50,-50,,,,,,,DQ,SBD,Wraps,F
Nikita King,24,F-OR,73.1,75,117.5,122.5,130,,130,60,65,-70,65,132.5,137.5,142.5,142.5,337.5,3,SBD,Wraps,F
Perdita Barrington,39,F-OR,89,90,150,165,-180,,165,57.5,62.5,65,65,140,150,155,155,385,2,SBD,Wraps,F
Rebecca Kieseker,31,F-OR,74,75,132.5,137.5,145,,145,67.5,72.5,75,75,150,160,167.5,167.5,387.5,2,SBD,Wraps,F
Rebekah O'Keefe,28,F-OR,56.5,60,102.5,107.5,-112.5,,107.5,55,60,-65,60,120,130,135,135,302.5,2,SBD,Wraps,F
Renee Brown,32,F-OR,67.1,67.5,115,130,-135,,130,55,60,-65,60,115,-130,-130,115,305,6,SBD,Wraps,F
Robin Collins,39,F-OR,81.9,82.5,170,180,190.5,,190.5,67.5,72.5,75,75,140,155,-165,155,420.5,1,SBD,Wraps,F
Sa Dang,35,F-OR,51.2,52,100,107.5,115,,115,60,65,-67.5,65,125,132.5,137.5,137.5,317.5,1,SBD,Wraps,F
Sarah Rainbow,22,F-OR,104,110,175,182.5,187.5,,187.5,125,140,-147.5,140,200,215,-225,215,542.5,1,SBD,Wraps,F
Sarah Rodwell,34,F-OR,74,75,170,180,-190,,180,75,82.5,90,90,205,215,226,226,496,1,SBD,Wraps,F
Stella Kalis,27,F-OR,66.7,67.5,110,-117.5,117.5,,117.5,52.5,55,-60,55,140,150,-160,150,322.5,5,SBD,Wraps,F
Stephanie Duarte,32,F-OR,55.1,56,122.5,135,140,,140,52.5,57.5,60,60,115,125,-132.5,125,325,1,SBD,Wraps,F
Suzie Maude,42,F-OR,104.3,110,200,210,220,,220,90,95,100,100,180,190,-195,190,510,2,SBD,Wraps,F
Toni Potter,47,F-OR,110.3,110+,100,-117.5,117.5,,117.5,60,,,60,125,140,147.5,147.5,325,1,SBD,Wraps,F
Tricia Liebke,43,F-OR,89.1,90,110,-117.5,-117.5,,110,65,67.5,-72.5,67.5,115,122.5,130,130,307.5,3,SBD,Wraps,F
Andrew Grennall,29,M-OR,96.3,100,245,255,265,,265,165,172.5,180,180,255,262.5,270,270,715,1,SBD,Wraps,M
Angus Hannon,24,M-OR,81.8,82.5,-150,-150,150,,150,-130,130,132.5,132.5,195,205,215,215,497.5,5,SBD,Wraps,M
Brandon Bateman,19,M-OR,83.6,90,150,155,-170,,155,100,-105,105,105,180,195,205,205,465,6,SBD,Wraps,M
Braydn Vit,21,M-OR,93.2,100,210,232.5,245,,245,145,160,165,165,240,252.5,-270,252.5,662.5,4,SBD,Wraps,M
Chris Mcgeary,31,M-OR,100,100,205,225,-237.5,,225,125,140,-145,140,260,285,-287.5,285,650,5,SBD,Wraps,M
Clay Smith,30,M-OR,89.5,90,210,227.5,235,,235,110,-117.5,117.5,117.5,205,220,-235,220,572.5,4,SBD,Wraps,M
Daniel Goode,22,M-OR,96.4,100,170,182.5,-190,,182.5,115,122.5,127.5,127.5,-205,205,-217.5,205,515,12,SBD,Wraps,M
David Galvin,17,M-OR,77.3,82.5,145,152.5,160,,160,110,115,120,120,170,180,192.5,192.5,472.5,6,SBD,Wraps,M
David Wicks,52,M-OR,88.8,90,135,145,150,,150,90,95,100,100,170,180,190,190,440,8,SBD,Wraps,M
Dean Haines,29,M-OR,63.3,67.5,120,135,140,,140,75,80,-85,80,170,180,-190,180,400,1,SBD,Wraps,M
Gareth Small,54,M-OR,80.8,82.5,-190,190,205,,205,105,-112.5,-112.5,105,187.5,200,207.5,207.5,517.5,4,SBD,Wraps,M
Gary Wilson,59,M-OR,88,90,140,150,-160,,150,105,115,-122.5,115,170,185,200,200,465,7,SBD,Wraps,M
Jack Lehfeldt,22,M-OR,94.7,100,225,245,260,,260,130,140,-147.5,140,260,280,-290,280,680,3,SBD,Wraps,M
Jesse Furner,31,M-OR,88.1,90,190,210,220,,220,85,95,100,100,185,205,-212.5,205,525,5,SBD,Wraps,M
Justin Kannenberg,34,M-OR,98.7,100,190,205,220,,220,135,-145,-145,135,240,250,260,260,615,8,SBD,Wraps,M
Liam Janse Van Rensburg,22,M-OR,95.1,100,180,195,205,,205,125,135,140,140,220,230,245,245,590,9,SBD,Wraps,M
Mathew Burton,33,M-OR,96.4,100,190,210,225,,225,137.5,147.5,150,150,220,240,245,245,620,7,SBD,Wraps,M
Michael Brown,32,M-OR,89,90,225,-230,-230,,225,135,-140,-140,135,207.5,215,225,225,585,3,SBD,Wraps,M
Michael Houbert,25,M-OR,87.4,90,260,280,290,,290,155,165,170,170,250,265,272.5,272.5,732.5,1,SBD,Wraps,M
Mitchell Burns,22,M-OR,89.8,90,195,205,215,,215,125,-132.5,-132.5,125,225,245,250,250,590,2,SBD,Wraps,M
Mitchell Mackinnonn,41,M-OR,99.6,100,255,270,280,,280,132.5,140,145,145,260,275,-292.5,275,700,2,SBD,Wraps,M
Nathan Guttormsen,16,M-OR,96.6,100,150,160,165,,165,102.5,107.5,112.5,112.5,170,180,190,190,467.5,14,SBD,Wraps,M
Nathan Liebke,43,M-OR,98.7,100,177.5,190,202.5,,202.5,110,115,-120,115,227.5,245,252.5,252.5,570,10,SBD,Wraps,M
Nic Heath,19,M-OR,80.4,82.5,210,220,231,237.5,231,120,130,132.5,132.5,220,230,240,240,603.5,1,SBD,Wraps,M
Peter Kentrotis,25,M-OR,79.6,82.5,165,180,190,,190,105,112.5,117.5,117.5,185,197.5,210,210,517.5,3,SBD,Wraps,M
Royden Young,31,M-OR,96.5,100,160,172.5,182.5,,182.5,110,120,-125,120,195,210,220,220,522.5,11,SBD,Wraps,M
Ryan Woollett,20,M-OR,78.7,82.5,185,200,-220,,200,95,-105,105,105,190,205,212.5,212.5,517.5,2,SBD,Wraps,M
Simon Stockton,36,M-OR,95,100,155,170,-182.5,,170,122.5,130,135,135,150,165,175,175,480,13,SBD,Wraps,M
Thomas Rowan,28,M-OR,95.9,100,220,240,250,,250,100,110,120,120,220,240,250,250,620,6,SBD,Wraps,M
Blane Robertson,46,M-OR,125.5,140,315,340,-352.5,,340,175,185,-190.5,185,290,-315,315,315,840,1,SBD,Wraps,M
Brad McMahon,33,M-OR,75,75,225,235,242.5,,242.5,122.5,130,-137.5,130,230,-240,-240,230,602.5,1,SBD,Wraps,M
Cameron Jolliffe,24,M-OR,122.8,125,155,170,-185,,170,122.5,130,-132.5,130,227.5,245,252.5,252.5,552.5,9,SBD,Wraps,M
Dave Waugh,27,M-OR,169.9,140+,265,-285,-300,,265,147.5,155,-162.5,155,260,270,-280,270,690,3,SBD,Wraps,M
David Stearman,24,M-OR,108.2,110,290,305,317.5,,317.5,170,180,,180,275,-290,-290,275,772.5,2,SBD,Wraps,M
Dean Bunton,31,M-OR,128,140,230,250,262.5,,262.5,135,145,-150,145,225,240,-250,240,647.5,2,SBD,Wraps,M
Dean Pascoe,40,M-OR,107,110,240,260,-275,,260,155,167.5,172.5,172.5,240,255,270,270,702.5,4,SBD,Wraps,M
Heath Young,21,M-OR,104.3,110,225,245,255,,255,120,132.5,137.5,137.5,230,-250,250,250,642.5,5,SBD,Wraps,M
Jason Mitchell,35,M-OR,106.5,110,190,210,-230,,210,140,150,-155,150,240,-250,255,255,615,6,SBD,Wraps,M
Jason Pagan,35,M-OR,122.8,125,310,-325,325,,325,170,175,180,180,280,295,300,300,805,5,SBD,Wraps,M
Jay Hodges,29,M-OR,118.1,125,285,300,-305,,300,190,200,-210,200,290,315,-325,315,815,4,SBD,Wraps,M
Josh Brownie,24,M-OR,107.2,110,285,300,310,,310,150,160,-165,160,247.5,260,280,280,750,3,SBD,Wraps,M
Josh Tait,32,M-OR,122.1,125,250,270,280,,280,220,230,242.5,242.5,260,272.5,300,300,822.5,3,SBD,Wraps,M
Josh Wright,29,M-OR,147.7,140+,305,-320,-330,,305,170,185,-190,185,280,295,-315,295,785,2,SBD,Wraps,M
Luke Poli,41,M-OR,162.6,140+,330,,,,330,180,200,,200,320,340,,340,870,1,SBD,Wraps,M
Michael Brook,31,M-OR,74.9,75,210,225,230,,230,135,142.5,-147.5,142.5,220,,,220,592.5,2,SBD,Wraps,M
Michael Coward,22,M-OR,117.1,125,260,280,290,,290,190,202.5,210,210,290,310,325,325,825,2,SBD,Wraps,M
Neil Jose,38,M-OR,125.8,140,165,172.5,180,,180,127.5,135,137.5,137.5,175,190,200,200,517.5,3,SBD,Wraps,M
Riccardo Ciarrocchi,23,M-OR,109.4,110,290,310,320,,320,175,182.5,190,190,290,305,-315,305,815,1,SBD,Wraps,M
Ryan Mayfield,29,M-OR,120.5,125,265,285,300,,300,155,165,-170,165,290,310,-315,310,775,6,SBD,Wraps,M
Shane Thomson,34,M-OR,123.2,125,245,265,280,,280,135,145,150,150,240,260,272.5,272.5,702.5,8,SBD,Wraps,M
Tim Krause,38,M-OR,124.1,125,305,317.5,322.5,,322.5,207.5,-212.5,,207.5,330,355,-367.5,355,885,1,SBD,Wraps,M
Trent McFadzen,39,M-OR,118.5,125,290,305,317.5,,317.5,-145,145,155,155,290,300,-307.5,300,772.5,7,SBD,Wraps,M
