Sex,Place,Name,Country,BirthYear,Age,BodyweightKg,WeightClassKg,Bench1Kg,Bench2Kg,Bench3Kg,Bench4Kg,Best3BenchKg,TotalKg,Event,Equipment,Division
M,1,Omar Sami Hamadeh Qarada,Jordan,1981,,45.66,49,,,,,172,172,B,Raw,Open
M,2,Mustafa Radhi,Iraq,1990,,48.43,49,,,,,167,167,B,Raw,Open
M,3,Farman Basha,India,1974,,46.8,49,,,,,154,154,B,Raw,Open
M,4,Patrick Ardon,France,1983,,45.9,49,,,,,133,133,B,Raw,Open
M,5,Hadj Ahmed Beyour,Algeria,1983,,47.19,49,,,,,130,130,B,Raw,Open
M,6,Benian Richard Duffi,Ivory Coast,1991,,47.29,49,,,,,100,100,B,Raw,Open
M,1,Taha Abdelmagid,Egypt,1987,,51.92,54,165,170,172,,172,172,B,Raw,Open
M,2,Alidou Diamoutene,Ivory Coast,1977,,52.8,54,160,165,-171,,165,165,B,Raw,Open
M,3,Hussen Juboori,Iraq,1982,,53.5,54,165,-171,-171,,165,165,B,Raw,Open
M,4,Sergii Khvalinskyi,Ukraine,1986,,52.66,54,-155,155,-157,,155,155,B,Raw,Open
M,5,Motnok Khlaeo,Thailand,1967,,51.64,54,110,120,125,,125,125,B,Raw,Open
M,6,Faisal Alsayan,UAE,1983,,53.59,54,-55,58,62,,62,62,B,Raw,Open
M,7,Oscar Emmet Hancock,Ireland,1999,,51.83,54,57,-60,-60,,57,57,B,Raw,Open
M,1,Sherif Othman,Egypt,1982,32,58.31,59,195,200,210,-215,210,210,B,Raw,Open
M,2,Narong Kasanun,Thailand,1977,,58.1,59,,,,,170,170,B,Raw,Open
M,3,Mohammad Tarbash,Jordan,1984,,57.34,59,,,,,167,167,B,Raw,Open
M,4,Mekan Agalikov,Turkmenistan,1988,,57.16,59,,,,,160,160,B,Raw,Open
M,5,Ruslan Korchynskyi,Ukraine,1993,,57.62,59,,,,,142,142,B,Raw,Open
M,6,Billel Bouchefra,Algeria,1984,,57.79,59,,,,,140,140,B,Raw,Open
M,1,Rasool Mohsin,Iraq,1987,,64.71,65,,,,,205,205,B,Raw,Open
M,2,Shaban Yehia Ibrahim,Egypt,1975,,64.86,65,,,,,195,195,B,Raw,Open
M,3,Hocine Bettir,Algeria,1990,,63.87,65,,,,,182,182,B,Raw,Open
M,4,Marek Trykacz,Poland,1985,,63.83,65,,,,,174,174,B,Raw,Open
M,5,Shadi Issa,Syria,1986,,64.24,65,,,,,163,163,B,Raw,Open
M,6,Ahmad Razm Azar,Azerbaijan,1992,,63.89,65,,,,,155,155,B,Raw,Open
M,7,Mohamed El Maataoui,Morocco,1975,,62.87,65,,,,,145,145,B,Raw,Open
M,8,Bartosz Kuriata,Poland,1987,,59.6,65,,,,,130,130,B,Raw,Open
M,9,Adou Herve Ano,Ivory Coast,1983,,63.16,65,,,,,127,127,B,Raw,Open
M,10,Aseel Alhawsawi,Saudi Arabia,1997,,63.12,65,,,,,110,110,B,Raw,Open
M,1,Mohamed Sobhy Elelfat,Egypt,1979,,71.16,72,,,-220,,218,218,B,Raw,Open
M,2,Abdelkareem Mohmmad Ahmad Khattab,Jordan,1991,,71.93,72,,,,,202,202,B,Raw,Open
M,3,Sergey Meladze,Turkmenistan,1980,,69.76,72,,,,,185,185,B,Raw,Open
M,4,Kampa Pongtao,Thailand,1977,,67.74,72,,,,,170,170,B,Raw,Open
M,5,Ma Hussein Mat Noh,Malaysia,1980,,70.83,72,,,,,160,160,B,Raw,Open
M,6,Saif Zaabi,UAE,1979,,68.22,72,,,,,130,130,B,Raw,Open
M,7,Ali Mashbari,Saudi Arabia,1980,,70.74,72,,,,,130,130,B,Raw,Open
M,8,Mohammad Abuarar,Jordan,1996,,70.77,72,,,,,121,121,B,Raw,Open
M,1,Metwaly Mathna,Egypt,1974,,79.71,80,-193,193,,,193,193,B,Raw,Open
M,2,Yerkebulan Kadirov,Kazakhstan,1989,,76.1,80,-135,135,147,,147,147,B,Raw,Open
M,3,Adel Shanbih,UAE,1989,,75.86,80,146,-148,-148,,146,146,B,Raw,Open
M,4,Davit Kobalia,Georgia,1989,,78.29,80,110,-115,-115,,110,110,B,Raw,Open
M,NS,Nabil Abdulkareen,UAE,1981,,,80,,,,,,,B,Raw,Open
M,1,Hany Abdelhady,Egypt,1980,,87.02,88,,,,,220,220,B,Raw,Open
M,2,Sodnompiljee Enkhbayar,Mongolia,1985,,86.32,88,,,,,205,205,B,Raw,Open
M,3,Gunduz Ismayilov,Azerbaijan,1972,,87.01,88,,,,,195,195,B,Raw,Open
M,4,Yurii Kupriianov,Ukraine,1982,,85.95,88,,,,,185,185,B,Raw,Open
M,5,Nurul Azhar Norrin,Malaysia,1986,,85.99,88,,,,,176,176,B,Raw,Open
M,6,Mario Hochberg,Germany,1970,,86.39,88,,,,,172,172,B,Raw,Open
M,7,Yegor Bolinger,Kazakhstan,1994,,85.62,88,,,,,143,143,B,Raw,Open
M,8,Ali Babajanov,Azerbaijan,1996,,80.11,88,,,,,123,123,B,Raw,Open
M,9,Reginald Byrne,Ireland,1970,,85.57,88,,,,,102,102,B,Raw,Open
M,1,Mohamed Eldib,Egypt,1979,,95.45,97,228,235,241,,241,241,B,Raw,Open
M,2,Mohammed Khamis Khalaf,UAE,1969,,91.39,97,,,,,230,230,B,Raw,Open
M,3,Yee Khie Jong,Malaysia,1988,,95.96,97,,,,,210,210,B,Raw,Open
M,4,Anton Kriukov,Ukraine,1988,,96,97,,,,,205,205,B,Raw,Open
M,5,Hamza Bouali,Algeria,1973,,93.97,97,,,,,190,190,B,Raw,Open
M,6,Bayram Saparov,Turkmenistan,1972,,92.1,97,,,,,180,180,B,Raw,Open
M,7,Abdalla Alnaqbi,UAE,1991,,92.2,97,,,,,165,165,B,Raw,Open
M,8,Vladimir Cherepanov,Kazakhstan,1990,,91.05,97,,,,,154,154,B,Raw,Open
M,9,Serik Spatilov,Kazakhstan,1970,,93.97,97,,,,,147,147,B,Raw,Open
M,10,Toninho Norden,Netherlands,1987,,93.93,97,,,,,145,145,B,Raw,Open
M,11,Jeroen Velthuis,Netherlands,1967,,95.44,97,,,,,120,120,B,Raw,Open
M,1,Elshan Huseynov,Azerbaijan,1977,,103.78,107,230,235,-241,,235,235,B,Raw,Open
M,2,Mohamed Ahmed,Egypt,1982,,100.32,107,220,-230,-235,,220,220,B,Raw,Open
M,3,Jamil Elshebli,Jordan,1979,,104.72,107,-190,194,204,,204,204,B,Raw,Open
M,4,Mohd Shahmil Md Saad,Malaysia,1986,,103.82,107,192,-196,-196,,192,192,B,Raw,Open
M,1,Ahmed Khamis Albaloushi,UAE,1974,,121.53,107+,195,202,-207,,202,202,B,Raw,Open
M,2,Khalid Al Najim,Saudi Arabia,1984,,146.73,107+,180,186,-190,,186,186,B,Raw,Open
M,DQ,Csaba Szavai,Hungary,1957,,121.98,107+,-185,-190,-192,,,,B,Raw,Open
M,DQ,Aliyev Maharram,Azerbaijan,1964,,148.4,107+,-200,-200,-205,,,,B,Raw,Open
F,1,Nawal Ramadan,Egypt,1992,,39.97,41,,,,,94,94,B,Raw,Open
F,2,Noura Baddour,Syria,1984,,38.28,41,,,,,85,85,B,Raw,Open
F,3,Maryna Kopiika,Ukraine,1991,,40.02,41,,,,,80,80,B,Raw,Open
F,4,Roza Matyakubova,Turkmenistan,1993,,40.01,41,,,,,65,65,B,Raw,Open
F,1,Zeinab Oteify,Egypt,1978,,44.48,45,,,,,97,97,B,Raw,Open
F,2,Rayisa Toporkova,Ukraine,1986,,44.78,45,,,,,90,90,B,Raw,Open
F,3,Sakina Khatun,India,1989,,43.13,45,,,,,85,85,B,Raw,Open
F,4,Samira Guerioua,Algeria,1984,,41.88,45,,,,,80,80,B,Raw,Open
F,5,Akissi Michelle Kouadio,Ivory Coast,1979,,43.3,45,,,,,72,72,B,Raw,Open
F,1,Lidiya Solovyova,Ukraine,1978,,49.23,50,,,,,102,102,B,Raw,Open
F,2,Gihan Abdelaziz,Egypt,1974,,49.96,50,,,,,100,100,B,Raw,Open
F,3,Mozah Alzeyoudi,UAE,1992,,49.45,50,,,,,60,60,B,Raw,Open
F,1,Rehab Ahmed,Egypt,1991,,53.3,55,,,,,106,106,B,Raw,Open
F,2,Fatema Alhasan,Syria,1977,,54.62,55,,,,,80,80,B,Raw,Open
F,3,Khadija Benkrara,Morocco,1978,,53.91,55,,,,,77,77,B,Raw,Open
F,4,Bikakhanim Valiyeva,Azerbaijan,1987,,52.67,55,,,,,58,58,B,Raw,Open
F,5,Maryam Alzeyoudi,UAE,1996,,53.31,55,,,,,47,47,B,Raw,Open
F,1,Malgorzata Halas-Koralewska,Poland,1987,,56.85,61,,,,,103,103,B,Raw,Open
F,2,Tetyana Shyrokolava,Ukraine,1979,,57.79,61,,,,,100,100,B,Raw,Open
F,3,Natali Elias,Syria,1980,,60.93,61,,,,,85,85,B,Raw,Open
F,1,Amal Mahmoud,Egypt,1978,,66.18,67,,,,,122,122,B,Raw,Open
F,2,Naima Elyousri,Morocco,1981,,65.1,67,,,,,107,107,B,Raw,Open
F,3,Asma Issa,Jordan,1991,,65.61,67,,,,,85,85,B,Raw,Open
F,1,Souhad Ghazouani,France,1982,,70.05,73,,,,,130,130,B,Raw,Open
F,2,Amany Ali,Egypt,1976,,72.83,73,,,,,117,117,B,Raw,Open
F,3,Rasha Alshikh,Syria,1975,,72.94,73,,,,,105,105,B,Raw,Open
F,4,Mayagozel Ekeyeva,Turkmenistan,1986,,71.8,73,,,,,95,95,B,Raw,Open
F,5,Alina Kumeyko,Ukraine,1997,,72.3,73,,,,,90,90,B,Raw,Open
F,1,Gehan Hassan,Egypt,1972,,76.97,79,,,,,122,122,B,Raw,Open
F,2,Tharwh Tayseer Hamdan Alhajaj,Jordan,1973,,78.66,79,,,,,110,110,B,Raw,Open
F,3,Lyubov Semenyuk,Ukraine,1959,,77.76,79,,,,,100,100,B,Raw,Open
F,1,Randa Mahmoud,Egypt,1987,,85,86,125,-130,130,,130,130,B,Raw,Open
F,NS,Haifa Naqbi,UAE,1981,,,86,,,,,,,B,Raw,Open
F,1,Nadia Ali,Egypt,1974,,101.42,86+,135,-140,-140,,135,135,B,Raw,Open
F,2,Rania Ali Morshedi,Egypt,1980,,103.94,86+,125,-128,-130,,125,125,B,Raw,Open
F,3,Melaica Tuinfort,Netherlands,1990,,100.81,86+,116,-121,-121,,116,116,B,Raw,Open
F,4,Ansaf Alnuaimi,UAE,1980,,92.15,86+,65,70,-72,,70,70,B,Raw,Open
