Division,WeightClassKg,Place,Name,Team,BodyweightKg,Best3SquatKg,Best3BenchKg,Best3DeadliftKg,TotalKg,Equipment,Event,Sex
Boys,52,1,Gilberto Olguin,Waco Connally,51.71,117.93,68.04,127.01,312.98,Single-ply,SBD,M
Boys,52,2,ZaQuavion Golden,Hearne,51.17,113.4,61.23,113.4,288.03,Single-ply,SBD,M
Boys,56,1,Faison Stroop,Waco University,54.34,115.67,70.31,136.08,322.05,Single-ply,SBD,M
Boys,56,2,Collin Taylor,Thorndale,55.52,127.01,61.23,127.01,315.25,Single-ply,SBD,M
Boys,56,3,Jared Rocha,Waco Reicher Catholic,53.52,106.59,58.97,136.08,301.64,Single-ply,SBD,M
Boys,56,4,Lane Francis,Bosqueville,55.07,117.93,54.43,115.67,288.03,Single-ply,SBD,M
Boys,56,5,Caden Crenshaw,Lorena,54.98,90.72,54.43,106.59,251.74,Single-ply,SBD,M
Boys,56,6,Cade Haring,Franklin,54.79,90.72,54.43,104.33,249.48,Single-ply,SBD,M
Boys,60,1,Bryan McNeill,Rogers,59.6,158.76,86.18,165.56,410.5,Single-ply,SBD,M
Boys,60,2,Ethan Rodriguez,Lorena,59.78,136.08,65.77,145.15,347,Single-ply,SBD,M
Boys,60,3,Stephen McNaught,Meridian,59.87,97.52,56.7,131.54,285.76,Single-ply,SBD,M
Boys,60,4,Wyatt Churchman,China Spring,56.43,92.99,52.16,138.35,283.5,Single-ply,SBD,M
Boys,60,5,Edgar Garcia,China Spring,59.87,83.91,52.16,111.13,247.21,Single-ply,SBD,M
Boys,67.5,1,Ethan Pierce,Rogers,66.77,185.97,104.33,181.44,471.74,Single-ply,SBD,M
Boys,67.5,2,Estafano Lopez,Waco University,60.51,158.76,97.52,172.37,428.64,Single-ply,SBD,M
Boys,67.5,3,Dylan Martin,Valley Mills,65.5,147.42,86.18,167.83,401.43,Single-ply,SBD,M
Boys,67.5,4,Aaron Seery,Alvarado,66.22,154.22,90.72,154.22,399.16,Single-ply,SBD,M
Boys,67.5,5,Christian Rokes,Franklin,61.96,138.35,86.18,142.88,367.41,Single-ply,SBD,M
Boys,67.5,6,Brandon Williams,Waco Connally,67.13,129.27,88.45,136.08,353.8,Single-ply,SBD,M
Boys,67.5,7,Tyler Evans,Franklin,64.05,131.54,65.77,131.54,328.85,Single-ply,SBD,M
Boys,67.5,8,Luis Moya,Valley Mills,67.13,122.47,61.23,122.47,306.17,Single-ply,SBD,M
Boys,67.5,9,Brice Tonkin,Waco Reicher Catholic,64.05,97.52,63.5,113.4,274.42,Single-ply,SBD,M
Boys,67.5,10,Ricardo Alvarez,Alvarado,62.23,142.88,65.77,,208.65,Single-ply,SB,M
Boys,67.5,11,Bryan Perez,Grapeland,66.04,111.13,,,111.13,Single-ply,S,M
Boys,75,1,Cedrion Goldman,Hearne,71.94,176.9,90.72,181.44,449.06,Single-ply,SBD,M
Boys,75,2,Jordan Morgan,Waco La Vega,74.57,176.9,95.25,167.83,439.98,Single-ply,SBD,M
Boys,75,3,Peyton Alvey,Alvarado,74.84,158.76,97.52,149.69,405.97,Single-ply,SBD,M
Boys,75,4,Ian Smith,Bosqueville,72.12,151.95,86.18,136.08,374.21,Single-ply,SBD,M
Boys,75,5,Danny Rowe,Alvarado,72.03,129.27,92.99,117.93,340.19,Single-ply,SBD,M
Boys,75,6,Austin Thompson,Alvarado,71.76,117.93,79.38,124.74,322.05,Single-ply,SBD,M
Boys,82.5,DQ,Will Hedges,Valley Mills,69.85,,,,,Single-ply,SBD,M
Boys,75,DQ,Jayden Rodemaker,Grapeland,72.12,120.2,,,,Single-ply,SBD,M
Boys,82.5,1,Cameron Riess,Grapeland,80.83,272.16,174.63,224.53,671.32,Single-ply,SBD,M
Boys,82.5,2,Kaleb Hairston,Thorndale,81.1,272.16,158.76,226.8,657.71,Single-ply,SBD,M
Boys,82.5,3,Connor Molkenbuhr,China Spring,78.56,181.44,129.27,204.12,514.83,Single-ply,SBD,M
Boys,82.5,4,James Carpenter,Rogers,82.1,188.24,92.99,183.7,464.93,Single-ply,SBD,M
Boys,82.5,5,Carson Ford,Lorena,78.02,167.83,88.45,181.44,437.72,Single-ply,SBD,M
Boys,82.5,6,Dylan Roudebush,Alvarado,79.11,163.29,104.33,161.03,428.64,Single-ply,SBD,M
Boys,82.5,7,Marcus DeLeon,Waco Connally,79.29,181.44,99.79,147.42,428.64,Single-ply,SBD,M
Boys,82.5,8,Daylon Bartosh,Lorena,80.1,156.49,95.25,158.76,410.5,Single-ply,SBD,M
Boys,82.5,9,Douglas Varcasia,China Spring,77.2,129.27,83.91,142.88,356.07,Single-ply,SBD,M
Boys,82.5,10,Jose Vega,Valley Mills,75.57,136.08,77.11,140.61,353.8,Single-ply,SBD,M
Boys,82.5,11,Corbin Preusse,Thorndale,81.74,158.76,68.04,124.74,351.53,Single-ply,SBD,M
Boys,82.5,12,Dalton Martin,Valley Mills,81.92,136.08,68.04,145.15,349.27,Single-ply,SBD,M
Boys,82.5,13,Perez Ryan,Waco Reicher Catholic,81.74,149.69,68.04,129.27,347,Single-ply,SBD,M
Boys,82.5,14,Tommy Ward,Valley Mills,80.92,170.1,,,170.1,Single-ply,S,M
Boys,90,1,Drew Roberts,Bosqueville,87.91,238.14,165.56,217.72,621.42,Single-ply,SBD,M
Boys,90,2,Vincent Wilson,Rogers,87.82,226.8,154.22,208.65,589.67,Single-ply,SBD,M
Boys,90,3,Cortney Young #2,Rogers,88.63,247.21,124.74,206.38,578.33,Single-ply,SBD,M
Boys,90,4,Wyatt Faulkinberry,Lorena,89.63,190.51,136.08,201.85,528.44,Single-ply,SBD,M
Boys,90,5,Teondre Parsons,Waco University,82.92,181.44,131.54,181.44,494.42,Single-ply,SBD,M
Boys,90,6,Josh Begesse,China Spring,88.81,190.51,102.06,185.97,478.54,Single-ply,SBD,M
Boys,90,7,Terry Murphy,Waco University,83.46,158.76,106.59,176.9,442.25,Single-ply,SBD,M
Boys,90,8,Daylon Moorefield,China Spring,85.82,158.76,102.06,181.44,442.25,Single-ply,SBD,M
Boys,90,9,Matt Duewall,Franklin,84.91,165.56,99.79,149.69,415.04,Single-ply,SBD,M
Boys,90,10,Elijah Muhammad,Waco University,89.63,136.08,97.52,181.44,415.04,Single-ply,SBD,M
Boys,90,11,Cory Preusse,Thorndale,88.09,154.22,95.25,154.22,403.7,Single-ply,SBD,M
Boys,90,12,Mason Liles,Thorndale,85.82,156.49,90.72,145.15,392.36,Single-ply,SBD,M
Boys,90,13,Logan Schuetz,China Spring,88.72,129.27,102.06,142.88,374.21,Single-ply,SBD,M
Boys,90,14,Enrique Martinez,Alvarado,89.54,142.88,88.45,142.88,374.21,Single-ply,SBD,M
Boys,90,15,Tyler Huf,Thorndale,84.64,122.47,79.38,158.76,360.61,Single-ply,SBD,M
Boys,90,16,Justin Bowers,Normangee,88.09,99.79,72.57,136.08,308.44,Single-ply,SBD,M
Boys,100,1,Pat Foley,Hearne,91.35,226.8,129.27,190.51,546.58,Single-ply,SBD,M
Boys,100,2,Jacob Byrd,Lorena,97.79,219.99,111.13,195.04,526.17,Single-ply,SBD,M
Boys,100,3,Anthony Stokley,Franklin,97.98,190.51,131.54,190.51,512.56,Single-ply,SBD,M
Boys,100,4,Mason Howell,Bosqueville,95.8,204.12,122.47,183.7,510.29,Single-ply,SBD,M
Boys,100,5,Logan Davidson,Lorena,98.52,188.24,115.67,201.85,505.76,Single-ply,SBD,M
Boys,100,6,Aaron Davis,Grapeland,95.16,201.85,95.25,188.24,485.34,Single-ply,SBD,M
Boys,100,7,Sterling Harris,Lorena,98.34,188.24,108.86,181.44,478.54,Single-ply,SBD,M
Boys,100,8,Zaen Davis,Lorena,98.07,183.7,106.59,156.49,446.79,Single-ply,SBD,M
Boys,100,9,Zephaniah Johnson,Waco University,94.17,147.42,95.25,181.44,424.11,Single-ply,SBD,M
Boys,100,10,Louis Alvarado,Waco University,97.34,142.88,81.65,165.56,390.09,Single-ply,SBD,M
Boys,100,11,Brian Williams,Waco Connally,95.16,147.42,95.25,142.88,385.55,Single-ply,SBD,M
Boys,100,12,Cody Duewall,Franklin,94.71,147.42,83.91,138.35,369.68,Single-ply,SBD,M
Boys,100,13,Hunter Heath,Bosqueville,93.35,124.74,,,124.74,Single-ply,S,M
Boys,100,DQ,Jackson Bayer,Waco Reicher Catholic,98.61,,,,,Single-ply,SBD,M
Boys,110,1,Zach Solano,Rogers,105.69,274.42,158.76,206.38,639.57,Single-ply,SBD,M
Boys,110,2,Steven Frausto,Waco Connally,106.68,249.48,124.74,235.87,610.08,Single-ply,SBD,M
Boys,110,3,Mike Cervantes,Lorena,109.41,208.65,115.67,226.8,551.11,Single-ply,SBD,M
Boys,110,4,Cameron Fimbres,Waco Connally,102.78,231.33,120.2,190.51,542.04,Single-ply,SBD,M
Boys,110,5,Dylan Woods,Hearne,106.59,213.19,108.86,181.44,503.49,Single-ply,SBD,M
Boys,110,6,Tyler Sparks,Lorena,101.06,167.83,102.06,199.58,469.47,Single-ply,SBD,M
Boys,110,7,Gabriel Gongora,Waco La Vega,109.68,190.51,106.59,172.37,469.47,Single-ply,SBD,M
Boys,110,8,James Baggett,Waco La Vega,104.42,172.37,115.67,176.9,464.93,Single-ply,SBD,M
Boys,110,9,Franco Rae,Grapeland,108.68,192.78,104.33,167.83,464.93,Single-ply,SBD,M
Boys,110,10,Cerdarian Davis,Grapeland,100.88,170.1,86.18,204.12,460.4,Single-ply,SBD,M
Boys,110,11,Jayden Arthur,Alvarado,108.95,136.08,90.72,181.44,408.23,Single-ply,SBD,M
Boys,110,12,James Dickson,Lorena,104.05,145.15,83.91,167.83,396.89,Single-ply,SBD,M
Boys,110,13,Connor Arney,Rogers,103.6,158.76,74.84,161.03,394.63,Single-ply,SBD,M
Boys,110,DQ,Anthony Banda,Normangee,107.14,204.12,,,,Single-ply,SBD,M
Boys,125,1,Blake Johnson,Franklin,122.02,326.59,176.9,272.16,775.64,Single-ply,SBD,M
Boys,125,2,Logan Begesse,China Spring,117.57,238.14,136.08,190.51,564.72,Single-ply,SBD,M
Boys,125,3,Crispin Salinas,Chilton,111.22,208.65,127.01,222.26,557.92,Single-ply,SBD,M
Boys,125,4,Tracy Linton,Waco University,122.38,174.63,142.88,165.56,483.08,Single-ply,SBD,M
Boys,125,5,Kolton Benton,Rogers,123.1,197.31,102.06,183.7,483.08,Single-ply,SBD,M
Boys,125,6,Dalton Zander,Bosqueville,122.2,190.51,113.4,176.9,480.81,Single-ply,SBD,M
Boys,125,7,Jonathan Luman,Thorndale,110.95,181.44,111.13,183.7,476.27,Single-ply,SBD,M
Boys,125,8,Trey Guzman,Alvarado,114.85,163.29,113.4,158.76,435.45,Single-ply,SBD,M
Boys,125,9,Gabe Guerrero,Hearne,115.76,104.33,74.84,127.01,306.17,Single-ply,SBD,M
Boys,125+,1,David Garcia,Alvarado,146.96,294.84,231.33,254.01,780.18,Single-ply,SBD,M
Boys,125+,2,Robert Gober,Waco Connally,131.81,281.23,149.69,231.33,662.24,Single-ply,SBD,M
Boys,125+,3,Tyler Flowers,Bosqueville,142.97,244.94,151.95,258.55,655.44,Single-ply,SBD,M
Boys,125+,4,Jairo Rodriguez,Waco La Vega,129.09,247.21,156.49,235.87,639.57,Single-ply,SBD,M
Boys,125+,5,Ethan Mendoza,Rogers,127.37,272.16,158.76,204.12,635.03,Single-ply,SBD,M
Boys,125+,6,Jaylen Tobler,Waco Connally,176.36,272.16,124.74,181.44,578.33,Single-ply,SBD,M
Boys,125+,7,Dexter Elmore,Waco University,125.74,226.8,120.2,188.24,535.24,Single-ply,SBD,M
Boys,125+,8,Henry Dawson,Waco La Vega,131.81,215.46,,208.65,424.11,Single-ply,SD,M
Boys,125+,DQ,Tanner Keith,Grapeland,136.8,,,,,Single-ply,SBD,M
Boys,,DQ,Cody Smith,Franklin,,,,,,Single-ply,SBD,M
Boys,,DQ,David Dewberry,Franklin,,,,,,Single-ply,SBD,M
Boys,,DQ,Clayton Rosprim,Franklin,,,,,,Single-ply,SBD,M
Boys,,DQ,Jamal Williams,Waco La Vega,,,,,,Single-ply,SBD,M
Boys,,DQ,Edwardo Gonzales,Hearne,,,,,,Single-ply,SBD,M
Boys,,DQ,Alex Ramirez,Hearne,,,,,,Single-ply,SBD,M
Boys,,DQ,Jackob Hines,Hearne,,,,,,Single-ply,SBD,M
Boys,,DQ,Vincent Torres,Waco Connally,,,,,,Single-ply,SBD,M
Boys,,DQ,Tylon Johnson,Waco Connally,,,,,,Single-ply,SBD,M
Boys,,DQ,Patrick Saucedo,Bosqueville,,,,,,Single-ply,SBD,M
Boys,,DQ,Garrett Garvelli,Bosqueville,,,,,,Single-ply,SBD,M
Boys,,DQ,Corey Brooks,Thorndale,,,,,,Single-ply,SBD,M
Boys,,DQ,Ethan Booker,Thorndale,,,,,,Single-ply,SBD,M
Boys,,DQ,Ruben Briones,Thorndale,,,,,,Single-ply,SBD,M
