Name,WeightClassKg,Squat1Kg,Squat2Kg,Squat3Kg,Best3SquatKg,Bench1Kg,Bench2Kg,Bench3Kg,Best3BenchKg,Bench4Kg,Deadlift1Kg,Deadlift2Kg,Deadlift3Kg,Best3DeadliftKg,Deadlift4Kg,TotalKg,Event,Equipment,Sex,Division,Place
Wiley Spencer,52,165,-175,-175,165,100,105,-107.5,105,,170,-185,-185,170,,440,SBD,Single-ply,M,Open,1
Tracey Beard,52,-157.5,157.5,-165,157.5,102.5,-107.5,-107.5,102.5,-107.5,135,147.5,-150,147.5,,407.5,SBD,Single-ply,F,Open,2
Susie Benford,52,117.5,127.5,130,130,60,65,67.5,67.5,,137.5,152.5,155,155,157.5,352.5,SBD,Single-ply,F,Open,3
Doug Heath,60,197.5,215,-227.5,215,147.5,157.5,162.5,162.5,,215,-232.5,232.5,232.5,,610,SBD,Single-ply,M,Open,1
Paul Fogt,60,217.5,232.5,240,240,127.5,-140,-140,127.5,,210,222.5,227.5,227.5,,595,SBD,Single-ply,M,Open,2
Steve Drum,60,217.5,230,-237.5,230,135,-140,-140,135,,215,222.5,-232.5,222.5,,587.5,SBD,Single-ply,M,Open,3
Judy Averbach,60,175,-182.5,-182.5,175,100,-105,,100,,175,182.5,-192.5,182.5,,457.5,SBD,Single-ply,F,Open,4
Joe Schmidt,60,-167.5,,,,,,,,,,,,,,,SBD,Single-ply,M,Open,DQ
Lisa Dellinger,60,-160,-160,-160,,,,,,,,,,,,,SBD,Single-ply,F,Open,DQ
Pete Scholz,67.5,235,-240,-240,235,147.5,-152.5,-152.5,147.5,,255,265,280,280,,662.5,SBD,Single-ply,M,Open,1
Abe Roman,67.5,-232.5,-232.5,232.5,232.5,152.5,-162.5,-162.5,152.5,,230,-247.5,-247.5,230,,615,SBD,Single-ply,M,Open,2
A. Berardinelli,67.5,-227.5,227.5,-242.5,227.5,147.5,157.5,-160,157.5,,227.5,-247.5,-247.5,227.5,,612.5,SBD,Single-ply,M,Open,3
Fred Toins,75,277.5,-290,-290,277.5,160,167.5,-172.5,167.5,,290,300,-305,300,,745,SBD,Single-ply,M,Open,1
Bob Wahl,75,295,-315,-315,295,137.5,147.5,-150,147.5,,280,295,-305,295,,737.5,SBD,Single-ply,M,Open,2
Fabian Wambsgans,75,247.5,-260,-260,247.5,-160,160,-165,160,,272.5,280,285,285,,692.5,SBD,Single-ply,M,Open,3
Dan Carlson,75,-257.5,-272.5,272.5,272.5,157.5,-167.5,-167.5,157.5,,235,-252.5,-260,235,,665,SBD,Single-ply,M,Open,4
Karen Mitchell,75,170,-187.5,187.5,187.5,75,85,87.5,87.5,,160,182.5,190,190,,465,SBD,Single-ply,F,Open,5
Adrian Serio,75,-232.5,-237.5,-237.5,,-147.5,147.5,-155,147.5,,,,,,,,SBD,Single-ply,M,Open,DQ
Lori Verhagen,75,-175,-175,-175,,,,,,,,,,,,,SBD,Single-ply,F,Open,DQ
Steven Ickow,82.5,295,305,-312.5,305,137.5,167.5,-172.5,167.5,,250,257.5,-272.5,257.5,,730,SBD,Single-ply,M,Open,1
Mike Vanhee,82.5,-280,-280,280,280,157.5,-165,-165,157.5,,265,287.5,-300,287.5,,725,SBD,Single-ply,M,Open,2
Chris Confessore,82.5,-300,-300,-300,,242.5,250,-255,250,-255,,,,,,,SBD,Single-ply,M,Open,DQ
Mike Barguera,82.5,-327.5,-327.5,-327.5,,,,,,,,,,,,,SBD,Single-ply,M,Open,DQ
Pat Person,90,365,-392.5,-392.5,365,195,-205,205,205,,300,322.5,330,330,,900,SBD,Single-ply,M,Open,1
Charles Siler,90,-322.5,340,-347.5,340,212.5,220,-222.5,220,,302.5,312.5,-317.5,312.5,,872.5,SBD,Single-ply,M,Open,2
Brad Kiltz,90,287.5,305,317.5,317.5,182.5,195,-200,195,,287.5,317.5,-330,317.5,,830,SBD,Single-ply,M,Open,3
Chad Yetka,90,327.5,-345,-345,327.5,182.5,190,-195,190,,292.5,-305,,292.5,,810,SBD,Single-ply,M,Open,4
Bill Bentley,90,282.5,295,-305,295,175,192.5,-195,192.5,,282.5,-297.5,-297.5,282.5,,770,SBD,Single-ply,M,Open,5
Ron Dionne,90,-282.5,292.5,312.5,312.5,-182.5,182.5,-192.5,182.5,,270,-285,,270,,765,SBD,Single-ply,M,Open,6
D. Christiansen,90,287.5,-305,-307.5,287.5,170,-177.5,-177.5,170,,300,-315,-315,300,,757.5,SBD,Single-ply,M,Open,7
Gary Drigo,100,347.5,360,370,370,237.5,247.5,-252.5,247.5,,310,327.5,337.5,337.5,,955,SBD,Single-ply,M,Open,1
Kevin Shepard,100,317.5,-327.5,,317.5,217.5,237.5,242.5,242.5,,315,327.5,337.5,337.5,,897.5,SBD,Single-ply,M,Open,2
Brad Stevenson,100,337.5,360,367.5,367.5,200,-210,-210,200,,310,-322.5,-322.5,310,,877.5,SBD,Single-ply,M,Open,3
Mark Schmidt,100,325,332.5,-340,332.5,205,-210,-210,205,,317.5,332.5,-335,332.5,,870,SBD,Single-ply,M,Open,4
Miles Baird,100,-337.5,352.5,-365,352.5,175,-190,-190,175,,297.5,320,330,330,,857.5,SBD,Single-ply,M,Open,5
Jimmy Kelly,100,320,337.5,-350,337.5,217.5,232.5,-237.5,232.5,,282.5,-292.5,-292.5,282.5,,852.5,SBD,Single-ply,M,Open,6
Edgar Bright,100,320,-332.5,-332.5,320,182.5,195,-200,195,,327.5,-335,-335,327.5,,842.5,SBD,Single-ply,M,Open,7
Mike Meza,100,-320,320,-325,320,-215,-215,-215,,,,,,,,,SBD,Single-ply,M,Open,DQ
Dave Ferguson,100,25,,,25,192.5,-202.5,-202.5,192.5,,,,,,,,SBD,Single-ply,M,Open,DQ
Jeff Wright,100,-320,,,,,,,,,,,,,,,SBD,Single-ply,M,Open,DQ
Tony Pharr,110,357.5,-372.5,-372.5,357.5,240,250,-252.5,250,,340,360,-372.5,360,,967.5,SBD,Single-ply,M,Open,1
Doug Borden,110,-345,345,372.5,372.5,197.5,210,220,220,,330,355,-360,355,,947.5,SBD,Single-ply,M,Open,2
Paul Immekus,110,377.5,-390,-390,377.5,210,215,220,220,,322.5,330,340,340,,937.5,SBD,Single-ply,M,Open,3
Louis Simmons,110,-337.5,337.5,367.5,367.5,207.5,227.5,237.5,237.5,,297.5,317.5,-322.5,317.5,,922.5,SBD,Single-ply,M,Open,4
Rick Cornett,110,345,360,-370,360,202.5,207.5,210,210,,272.5,282.5,292.5,292.5,,862.5,SBD,Single-ply,M,Open,5
Steve Glende,110,300,,-320,300,167.5,175,-180,175,,330,-352.5,-352.5,330,,805,SBD,Single-ply,M,Open,6
Brad Krick,110,300,-320,-320,300,185,-200,-200,185,,300,-315,,300,,785,SBD,Single-ply,M,Open,7
Jay Manda,110,-312.5,312.5,-332.5,312.5,-205,-205,-205,,,,,,,,,SBD,Single-ply,M,Open,DQ
Wes Estep,125,350,362.5,370,370,-252.5,252.5,265,265,,320,-332.5,332.5,332.5,,967.5,SBD,Single-ply,M,Open,1
Brad Kretsch,125,-360,360,-380,360,222.5,232.5,237.5,237.5,,350,360,-372.5,360,,957.5,SBD,Single-ply,M,Open,2
Ken Ryder,125,310,322.5,335,335,245,257.5,-262.5,257.5,,322.5,337.5,-345,337.5,,930,SBD,Single-ply,M,Open,3
Vince Villanucci,125,312.5,330,342.5,342.5,212.5,227.5,232.5,232.5,,312.5,335,347.5,347.5,,922.5,SBD,Single-ply,M,Open,4
Mike Notario,125,345,-362.5,-362.5,345,220,227.5,-230,227.5,,312.5,325,-335,325,,897.5,SBD,Single-ply,M,Open,5
Doug Pool,125,332.5,345,352.5,352.5,215,227.5,-232.5,227.5,,307.5,317.5,-327.5,317.5,,897.5,SBD,Single-ply,M,Open,6
Jeff Thill,125,312.5,-335,335,335,217.5,235,237.5,237.5,,325,-347.5,-367.5,325,,897.5,SBD,Single-ply,M,Open,7
Randy Scott,125,322.5,-342.5,345,345,210,-217.5,222.5,222.5,,295,312.5,-320,312.5,,880,SBD,Single-ply,M,Open,8
Doug Dicke,125,,,,,237.5,245,-252.5,245,,,,,,,,B,Single-ply,M,Open,DQ
Stu Thompson,125,-325,-325,-325,,,,,,,,,,,,,SBD,Single-ply,M,Open,DQ
Dorian Wright,125+,342.5,-357.5,-357.5,342.5,-235,235,-245,235,,350,370,-377.5,370,,947.5,SBD,Single-ply,M,Open,1
Russ Barlow,125+,330,-347.5,-347.5,330,-227.5,227.5,235,235,,327.5,-337.5,-337.5,327.5,,892.5,SBD,Single-ply,M,Open,2
Jeff Cook,125+,325,-340,340,340,182.5,-190,,182.5,,115,317.5,340,340,,862.5,SBD,Single-ply,M,Open,3
Gary Heisey,125+,330,-352.5,-355,330,175,185,192.5,192.5,,-390,,,,,,SBD,Single-ply,M,Open,DQ
