Place,Name,State,WeightClassKg,BodyweightKg,Age,Best3SquatKg,Best3BenchKg,Best3DeadliftKg,TotalKg,Sex,Division,Equipment,Deadlift4Kg,Event
1,Sofia Sepulveda,CA,52,48.9,20,87.5,42.5,112.5,242.5,F,Junior 20-23,Raw,,SBD
2,Nikki Damian,CA,52,48.25,21,67.5,27.5,77.5,172.5,F,Junior 20-23,Raw,,SBD
1,Annalyn Dejamco,CA,67.5,67.5,20,127.5,52.5,160,340,F,Junior 20-23,Raw,,SBD
2,Amber Sumida,CA,67.5,67.4,21,90,57.5,107.5,255,F,Junior 20-23,Raw,,SBD
1,Victoria Ly,CA,82.5,82.05,20,172.5,75,195,442.5,F,Junior 20-23,Raw,,SBD
1,Martina Carrillo,CA,56,55.4,22,100,50,115,265,F,Open,Raw,,SBD
1,Mikenna Kossow,CA,60,59.5,24,95,65,100,260,F,Open,Raw,,SBD
1,Jamie Best,CA,67.5,66.55,30,130,72.5,145,347.5,F,Open,Raw,,SBD
2,Annalyn Dejamco,CA,67.5,67.5,20,127.5,52.5,160,340,F,Open,Raw,,SBD
3,Joyna Reyes,CA,67.5,65.9,26,75,40,85,200,F,Open,Raw,,SBD
1,Audrey Schoen,CA,75,72,34,132.5,72.5,140,345,F,Open,Raw,,SBD
2,Brittney Gates,CA,75,74.5,27,122.5,62.5,155,340,F,Open,Raw,,SBD
3,Amanda Gates,CA,75,73.35,22,115,55,135,305,F,Open,Raw,,SBD
1,Victoria Ly,CA,82.5,82.05,20,172.5,75,195,442.5,F,Open,Raw,,SBD
2,Traviz Cabatingan,CA,82.5,80.95,31,142.5,92.5,177.5,412.5,F,Open,Raw,,SBD
3,Cecillia French,CA,82.5,80.65,29,117.5,72.5,137.5,327.5,F,Open,Raw,,SBD
4,Melanie Garcia,CA,82.5,80.55,33,105,65,127.5,297.5,F,Open,Raw,,SBD
1,Carolyn Mitchell,CA,90+,133.95,27,192.5,75,195,462.5,F,Open,Raw,,SBD
2,Herika Hernandez,CA,90+,108.75,35,155,65,170,390,F,Open,Raw,,SBD
3,Tatum McGuire,CA,90+,123.55,29,125,72.5,162.5,360,F,Open,Raw,,SBD
DQ,Tiana Reola,CA,90+,109.2,29,100,-55,127.5,,F,Open,Raw,,SBD
1,Herika Hernandez,CA,90+,108.75,35,155,65,170,390,F,Submaster 35-39,Raw,,SBD
1,Kathleen Sousa,CA,56,53.75,48,72.5,42.5,105,220,F,Master 45-49,Raw,,SBD
1,Christine Secada,CA,90+,90.95,41,152.5,67.5,150,370,F,Master 40-44,Raw,,SBD
2,Rebecca Martin,CA,90+,134.9,43,112.5,72.5,152.5,337.5,F,Master 40-44,Raw,,SBD
1,Joshua Turner,CA,100,97.15,18,250,150,282.5,682.5,M,Junior 18-19,Raw,,SBD
1,Roice Natividad,CA,82.5,76.95,20,175,100,205,480,M,Junior 20-23,Raw,,SBD
1,Mason Merilles,CA,125,121.65,22,275,190,310,775,M,Junior 20-23,Raw,,SBD
1,Julio Sanchez #1,CA,82.5,81.75,25,205,145,250,600,M,Open,Raw,,SBD
2,Dean Seago,CA,82.5,79.95,26,210,122.5,245,577.5,M,Open,Raw,,SBD
1,Ryan Taylor,CA,90,82.9,27,212.5,130,215,557.5,M,Open,Raw,,SBD
1,Mitchell Custer,CA,100,98.15,32,215,140,267.5,622.5,M,Open,Raw,,SBD
1,Thomas Greene,CA,110,109.15,31,215,137.5,245,597.5,M,Open,Raw,,SBD
2,Jesse Martinez,CA,110,107.1,29,200,122.5,240,562.5,M,Open,Raw,,SBD
1,Mason Merilles,CA,125,121.65,22,275,190,310,775,M,Open,Raw,,SBD
2,Michael Anguelo,CA,125,113.4,25,257.5,187.5,237.5,682.5,M,Open,Raw,,SBD
1,Anand Pai,CA,110,107.05,56,180,115,227.5,522.5,M,Master 55-59,Raw,,SBD
1,Robert Eccleston,CA,140,137,45,190,172.5,247.5,610,M,Master 45-49,Raw,,SBD
1,Nicolas Herrera,CA,90,88.55,22,240,145,282.5,667.5,M,Junior 20-23,Wraps,,SBD
DQ,Andre Blugh,CA,90,89.45,22,277.5,175,-237.5,,M,Junior 20-23,Wraps,,SBD
1,Nicolas Herrera,CA,90,88.55,22,240,145,282.5,667.5,M,Open,Wraps,,SBD
DQ,Andre Blugh,CA,90,89.45,20,277.5,175,-237.5,,M,Open,Wraps,,SBD
1,Kiefer Haynes,CA,100,97.5,25,282.5,137.5,295,715,M,Open,Wraps,,SBD
1,Peter Murphy,CA,100,97.15,65,172.5,90,195,457.5,M,Master 65-69,Wraps,,SBD
1,Brad Moberg,CA,110,107.1,52,205,152.5,217.5,575,M,Master 50-54,Wraps,,SBD
1,JD Whitelow,CA,125,113.3,52,237.5,175,272.5,685,M,Master 50-54,Wraps,,SBD
1,Paul Root,CA,125,115.55,61,150,92.5,150,392.5,M,Master 60-64,Wraps,,SBD
1,Tim Crutchley,CA,140+,140.2,61,237.5,130,227.5,595,M,Master 60-64,Wraps,237.5,SBD
1,Sylvia Nix,CA,75,73.25,48,142.5,80,157.5,380,F,Master 45-49,Single-ply,160,SBD
1,Amber Sumida,CA,67.5,67.4,21,,57.5,,57.5,F,Junior 20-23,Raw,,B
1,Anthony Covarruvias,CA,75,75,26,,160,,160,M,Open,Raw,,B
1,Victor Minchillo,CA,82.5,80.66,24,,140,,140,M,Open,Raw,,B
1,Brian Oliver,CA,125,119.55,24,,130,,130,M,Open,Raw,,B
1,Robert Eccleston,CA,140,137,45,,172.5,,172.5,M,Master 45-49,Raw,,B
1,Sylvia Nix,CA,75,73.25,48,,80,,80,F,Open,Single-ply,,B
1,Sylvia Nix,CA,75,73.25,48,,80,,80,F,Master 45-49,Single-ply,,B
