Place,Name,State,WeightClassKg,BodyweightKg,Age,Best3SquatKg,Best3BenchKg,Best3DeadliftKg,TotalKg,Squat4Kg,Deadlift4Kg,Sex,Division,Equipment,Event
1,Savannah Kelly,OR,75,69.7,20,105,47.5,125,277.5,,,F,Junior 20-23,Raw,SBD
1,Christina Goldberg,OR,56,55.8,31,85,57.5,97.5,240,,,F,Open,Raw,SBD
1,Marya Wallen,OR,60,59.8,24,107.5,67.5,155,330,,,F,Open,Raw,SBD
2,Jenna Osterman,OR,60,56.3,25,107.5,67.5,142.5,317.5,,,F,Open,Raw,SBD
3,Maggie Graham,OR,60,59.6,31,77.5,50,122.5,250,,,F,Open,Raw,SBD
1,Jenny Adams,OR,67.5,64.3,38,107.5,67.5,155,330,,,F,Open,Raw,SBD
2,Kiara Holtman,OR,67.5,62.3,28,82.5,57.5,117.5,257.5,,,F,Open,Raw,SBD
3,Lynndzee Hemphill,OR,67.5,62.5,29,75,45,95,215,,,F,Open,Raw,SBD
1,Zorahgail Balino,OR,75,73.5,35,137.5,72.5,177.5,387.5,,,F,Open,Raw,SBD
2,Dawn Dominguez,OR,75,74.4,46,140.5,80,147.5,368,145,155,F,Open,Raw,SBD
3,Sarah Eggleston,OR,75,73.3,36,90,52.5,125,267.5,,,F,Open,Raw,SBD
4,Angela Lusby,OR,75,74.2,43,92.5,57.5,107.5,257.5,,,F,Open,Raw,SBD
1,Heather Leavitt,OR,82.5,80.9,27,95,55,120,270,,,F,Open,Raw,SBD
1,Stephanie Cantrell,OR,90,82.9,39,135,65,177.5,377.5,140,,F,Open,Raw,SBD
1,Kaelani Binford,OR,90+,104.8,28,127.5,65,152.5,345,130,,F,Open,Raw,SBD
DQ,Tarissa Richardson,OR,90+,124.6,31,107.5,,,,,,F,Open,Raw,SBD
1,Jenny Adams,OR,67.5,64.3,38,107.5,67.5,155,330,,,F,Submaster 35-39,Raw,SBD
DQ,Lacey Hunter,OR,75,74.7,35,92.5,,137.5,,,,F,Submaster 35-39,Raw,SBD
1,Stephanie Cantrell,OR,90,82.9,39,135,65,177.5,377.5,140,,F,Submaster 35-39,Raw,SBD
2,Kathryn Martinez-Gilbertson,OR,90,88,35,127.5,65,130,322.5,,,F,Submaster 35-39,Raw,SBD
1,Cindy Kyle,OR,90+,119.9,37,160,85,182.5,427.5,165,,F,Submaster 35-39,Raw,SBD
1,Jun-Nicole Matsushita,OR,67.5,66.4,42,52.5,50,117.5,220,,,F,Master 40-44,Raw,SBD
1,Chelsea Miller,OR,75,74.2,41,110,87.5,135,332.5,,,F,Master 40-44,Raw,SBD
2,Angela Lusby,OR,75,74.2,43,92.5,57.5,107.5,257.5,,,F,Master 40-44,Raw,SBD
1,Dawn Dominguez,OR,75,74.4,46,140.5,80,147.5,368,145,155,F,Master 45-49,Raw,SBD
1,Guadalupe Melendrez,OR,75,69.5,52,95,47.5,97.5,240,,,F,Master 50-54,Raw,SBD
1,Eileen Smith,OR,75,70.3,57,82.5,47.5,112.5,242.5,,,F,Master 55-59,Raw,SBD
1,Tracy Richardson,OR,90+,106.8,44,100,55,142.5,297.5,,,F,Master 40-44,Raw,SBD
1,Elaine May,OR,90+,97.1,56,100,60,145,305,,,F,Master 55-59,Raw,SBD
1,Hudson Kemnitz,OR,75,74.4,15,115,72.5,162.5,350,,165,M,Junior 13-15,Raw,SBD
1,Chad Pinney,OR,75,73.9,17,167.5,102.5,182.5,452.5,,,M,Junior 16-17,Raw,SBD
1,Kordell Cole,OR,75,73.2,21,165,102.5,237.5,505,,,M,Junior 20-23,Raw,SBD
2,Sean Collum,OR,75,74.4,23,170,120,215,505,,,M,Junior 20-23,Raw,SBD
1,Sam Wurtz,OR,82.5,80.7,19,177.5,107.5,202.5,487.5,,,M,Junior 18-19,Raw,SBD
1,Matthew Houston,OR,82.5,81.1,21,180,132.5,212.5,525,,,M,Junior 20-23,Raw,SBD
2,Tyler Hake,OR,82.5,80.5,20,182.5,122.5,205,510,,,M,Junior 20-23,Raw,SBD
1,Jordan Nelson,OR,90,89.8,23,197.5,142.5,220,560,,,M,Junior 20-23,Raw,SBD
1,Jesse Ponedel,OR,100,97.4,22,227.5,170,242.5,640,,,M,Junior 20-23,Raw,SBD
1,Dustin Pereira,OR,125,122.2,23,235,165,250,650,,,M,Junior 20-23,Raw,SBD
1,Zack Smith,OR,140,132.9,23,320,215,320.5,855.5,340.5,,M,Junior 20-23,Raw,SBD
1,Trevor Ryan,OR,75,73.4,26,175,132.5,220,527.5,,,M,Open,Raw,SBD
1,Nick Clements,OR,82.5,80.3,32,142.5,92.5,177.5,412.5,,,M,Open,Raw,SBD
2,Devin Kosloff,OR,82.5,77.6,28,132.5,92.5,177.5,402.5,,,M,Open,Raw,SBD
1,Patrick Whalen,OR,90,89.3,31,175,105,200,480,,,M,Open,Raw,SBD
1,Nick Rogers,OR,100,99.4,25,245,192.5,285,722.5,,,M,Open,Raw,SBD
3,Jesse Ponedel,OR,100,97.4,22,227.5,170,242.5,640,,,M,Open,Raw,SBD
1,Aaron Adams #1,OR,125,123,42,232.5,147.5,220,600,,,M,Open,Raw,SBD
2,James Mulligan,OR,125,114.7,28,162.5,102.5,205,470,,,M,Open,Raw,SBD
DQ,Bo Anderson,WA,125,124,25,,170,300,,,,M,Open,Raw,SBD
1,Zack Smith,OR,140,132.9,23,320,215,320.5,855.5,340.5,,M,Open,Raw,SBD
1,Gustavo Corona,OR,82.5,80.2,35,175,125,192.5,492.5,,,M,Submaster 35-39,Raw,SBD
1,Christopher Jewell,OR,100,95.3,39,250,160,235,645,,,M,Submaster 35-39,Raw,SBD
DQ,Jeremy Leckie,OR,75,75,42,190,132.5,,,,,M,Master 40-44,Raw,SBD
1,Gordon Smith,OR,90,85.7,57,137.5,102.5,215,455,,,M,Master 55-59,Raw,SBD
DQ,Vincent Faini,OR,90,82.9,60,,120,125,,,,M,Master 60-64,Raw,SBD
1,Jim Alsup,OR,90,88.6,65,92.5,77.5,127.5,297.5,,,M,Master 65-69,Raw,SBD
1,Cory Frank,OR,110,110,41,207.5,125,240,572.5,,,M,Master 40-44,Raw,SBD
2,Brian Kemnitz,OR,110,105.4,42,187.5,125,255,567.5,,,M,Master 40-44,Raw,SBD
1,Dick Conway,OR,110,104.6,75,100,105,150,355,,152.5,M,Master 75-79,Raw,SBD
1,Cole Oace,OR,60,58.6,19,145,97.5,172.5,415,,177.5,M,Junior 18-19,Wraps,SBD
1,Samuel Burns,OR,100,91,20,197.5,112.5,210,520,,,M,Junior 20-23,Wraps,SBD
1,Jeron Kerridge,OR,125,121.6,31,255,182.5,252.5,690,,,M,Open,Wraps,SBD
2,Chase Brooks,OR,125,114,30,202.5,165,260,627.5,,,M,Open,Wraps,SBD
1,Shad Beck,OR,125,122.5,48,195,182.5,195,572.5,,,M,Master 45-49,Wraps,SBD
1,Shane Ramberg,OR,110,106.6,33,210,145,215,570,,,M,Open,Single-ply,SBD
1,Randy Ellis,OR,110,110,58,182.5,160,215,557.5,,,M,Master 55-59,Single-ply,SBD
DQ,Tarissa Richardson,OR,90+,124.6,31,,,,,,,F,Open,Raw,B
1,Chelsea Miller,OR,75,74.2,41,,87.5,,87.5,,,F,Master 40-44,Raw,B
1,Guadalupe Melendrez,OR,75,69.5,52,,47.5,,47.5,,,F,Master 50-54,Raw,B
1,Bo Anderson,WA,125,124,25,,170,,170,,,M,Open,Raw,B
1,Ed Macauley,OR,110,104.9,57,,165,,165,,,M,Master 55-59,Raw,B
1,Shane Ramberg,OR,110,106.6,33,,145,,145,,,M,Open,Single-ply,B
DQ,Joe Beteta,OR,90,89.1,72,,,,,,,M,Master 70-74,Single-ply,B
1,Cindy Kyle,OR,90+,119.9,37,,,182.5,182.5,,,F,Submaster 35-39,Raw,D
1,Guadalupe Melendrez,OR,75,69.5,52,,,97.5,97.5,,,F,Master 50-54,Raw,D
1,Matt Gaechter,OR,100,97.8,39,,,287.5,287.5,,,M,Open,Raw,D
1,Bo Anderson,WA,125,124,25,,,300,300,,,M,Open,Raw,D
2,Patricio Ramirez,OR,125,115.5,40,,,287.5,287.5,,,M,Open,Raw,D
1,Matt Gaechter,OR,100,97.8,39,,,287.5,287.5,,,M,Submaster 35-39,Raw,D
1,Patricio Ramirez,OR,125,115.5,40,,,287.5,287.5,,,M,Master 40-44,Raw,D
1,Randy Ellis,OR,110,110,58,,,215,215,,,M,Master 55-59,Single-ply,D
