Sex,Equipment,Division,WeightClassKg,Name,BodyweightKg,Best3BenchKg,TotalKg,Event,Place
F,Raw,Amateur Open,52,Adria Battaglia,50.5,27.5,27.5,B,1
F,Raw,Amateur Open,82.5,Dana Rygwelski,80.45,87.5,87.5,B,1
F,Raw,Amateur Submaster 33-39,82.5,Dana Rygwelski,80.45,87.5,87.5,B,1
F,Raw,Amateur Submaster 33-39,52,Adria Battaglia,50.5,27.5,27.5,B,1
M,Raw,Amateur Open,90,Adam Dobie,90,160,160,B,1
M,Raw,Amateur Submaster 33-39,90,Adam Dobie,90,160,160,B,1
M,Multi-ply,Amateur Submaster 33-39,140,Jordan Lawler,131.65,302.5,302.5,B,1
M,Multi-ply,Amateur Open,140,Jordan Lawler,131.65,302.5,302.5,B,1
