Name,WeightClassKg,BodyweightKg,State,Best3SquatKg,Best3BenchKg,Best3DeadliftKg,TotalKg,Bench4Kg,Deadlift4Kg,Event,Equipment,Sex,Division,Place
Sidney Alleshouse,75,73.94,KY,129.27,68.04,142.88,340.19,,,SBD,Wraps,M,Teenage 13-15,1
Shelton Wood,100,97.98,TN,165.56,102.06,181.44,449.06,,,SBD,Wraps,M,Teenage 13-15,1
Seth Maddaloni,118,110.31,TN,163.29,108.86,204.12,476.27,,,SBD,Wraps,M,Teenage 16-17,1
Melitana Cancino,90,87.54,TN,204.12,154.22,217.72,576.06,,,SBD,Wraps,M,Teenage 18-19,1
Shane Wood,125,120.66,TN,170.1,147.42,170.1,487.61,,,SBD,Wraps,M,Teenage 18-19,1
Bobby Lawson,75,74.66,TN,158.76,136.08,197.31,492.15,,201.85,SBD,Wraps,M,Juniors,1
CJ Allen,100,97.52,GA,206.38,115.67,226.8,548.85,,,SBD,Wraps,M,Juniors,1
Jeremy Cain,118,117.48,TN,226.8,170.1,272.16,669.05,,,SBD,Wraps,M,Juniors,1
Kristen Eckstrand,52,51.07,TN,90.72,63.5,102.06,256.28,65.77,,SBD,Wraps,F,Open,1
Tilia Vandoran,67.5,66.9,TN,90.72,47.63,133.81,272.16,,,SBD,Wraps,F,Open,1
Michael Bledsoe,75,73.94,TN,174.63,113.4,206.38,494.42,,,SBD,Wraps,M,Open,1
Yarnell Marks,82.5,81.65,MS,183.7,170.1,226.8,580.6,,,SBD,Wraps,M,Open,1
Asa Ramour,82.5,80.29,TN,204.12,151.95,204.12,560.19,,,SBD,Wraps,M,Open,2
Russell Berry,82.5,81.19,TN,167.83,140.61,215.46,523.9,,,SBD,Wraps,M,Open,3
Steve Owens,82.5,79.38,TN,158.76,111.13,195.04,464.93,,,SBD,Wraps,M,Open,4
Jacob Giesecke,90,84.55,KY,208.65,129.27,251.74,589.67,,,SBD,Wraps,M,Open,1
Georgi Kapitanon,90,86.18,TN,190.51,127.01,199.58,517.1,,,SBD,Wraps,M,Open,2
Doug Larson,90,89.81,TN,142.88,106.59,231.33,480.81,,,SBD,Wraps,M,Open,3
Matt Rawlins,110,105.23,GA,226.8,102.06,206.38,535.24,,,SBD,Wraps,M,Open,1
Nathan Holt,118,117.48,TN,272.16,165.56,272.16,709.87,,,SBD,Wraps,M,Open,1
Jeremy Adams #2,118,117.48,TN,242.67,170.1,238.14,650.91,,,SBD,Wraps,M,Open,2
Rob Robinson,140,139.16,NC,249.48,181.44,256.28,687.19,,,SBD,Wraps,M,Open,1
Vance Walker,90,87.72,TN,215.46,151.95,242.67,610.08,,249.48,SBD,Wraps,M,Sub-Masters,1
Dwon Johnson,140+,179.17,GA,281.23,151.95,272.16,705.34,,,SBD,Wraps,M,Sub-Masters,1
WC Carter,100,98.88,AL,340.19,251.74,292.57,884.51,,,SBD,Single-ply,M,Open,1
Dale Alleshouse,100,95.25,KY,249.48,,,,,,SBD,Single-ply,M,Open,DQ
Jim Elmore,90,88.81,TN,174.63,92.99,192.78,460.4,,,SBD,Single-ply,M,Masters 60-64,1
John Hurle,125,124.28,KY,247.21,149.69,201.85,598.74,,,SBD,Single-ply,M,Masters 60-64,1
Joe Dasha,125,123.83,TN,274.42,102.06,267.62,644.1,,,SBD,Multi-ply,M,Teenage 16-17,1
Justin McAdoo,82.5,81.19,TN,226.8,204.12,238.14,669.05,,,SBD,Multi-ply,M,Open,1
Patrick Maupin,110,108.41,KY,365.14,285.76,317.51,968.42,,,SBD,Multi-ply,M,Open,1
Kevin McLeod,118,117.93,SC,394.63,299.37,272.16,966.15,,,SBD,Multi-ply,M,Open,1
Chris Moore,140,132.45,TN,362.87,256.28,272.16,891.31,,,SBD,Multi-ply,M,Open,1
Tracy Johnson,110,108.86,TN,272.16,215.46,249.48,737.09,,,SBD,Multi-ply,M,Sub-Masters,1
Thomas Tinch,125,123.92,TN,215.46,165.56,217.72,598.74,,,SBD,Multi-ply,M,Sub-Masters,1
James Robinson,125,121.65,KY,294.84,226.8,294.84,816.47,,,SBD,Multi-ply,M,Masters 45-49,1
Judd Forbes,75,74.39,TN,192.78,136.08,192.78,521.63,,,SBD,Multi-ply,M,Masters 60-64,1
Tommy Chadwell,110,107.5,TN,165.56,,,165.56,,,S,Wraps,M,Teenage 18-19,1
Nathan Awad,110,108.41,TN,349.27,,,349.27,,,S,Wraps,M,Open,1
Wesley Claborn,118,113.4,GA,,158.76,258.55,417.3,,,BD,Raw,M,Teenage 16-17,1
Sara Gregory,60,57.97,TN,,58.97,124.74,183.7,,,BD,Raw,F,Teenage 18-19,1
Brandon Fabor,90,85.73,TN,,120.2,235.87,356.07,,,BD,Raw,M,Juniors,1
Derek Harrison,100,90.99,TN,,151.95,231.33,383.29,,,BD,Raw,M,Juniors,1
Lisa McAdoo,56,53.52,TN,,45.36,102.06,147.42,,,BD,Raw,F,Open,1
Jani Joffre,60,59.42,TN,,58.97,108.86,167.83,,,BD,Raw,F,Open,1
Joan Plumer,52,51.8,KY,,49.9,115.67,165.56,,,BD,Raw,F,Masters 45-49,1
Aaron Goodson,75,71.67,TN,,124.74,183.7,308.44,,,BD,Raw,M,Open,1
Jason Mitchell,90,89.81,TN,,129.27,244.94,374.21,,,BD,Raw,M,Open,1
Matt Holder,90,83.46,TN,,140.61,190.51,331.12,,,BD,Raw,M,Open,2
Roy Brown,110,106.96,AR,,197.31,274.42,471.74,201.85,,BD,Raw,M,Sub-Masters,1
Hartwell Strain,110,109.77,TN,,142.88,247.21,390.09,,,BD,Single-ply,M,Open,1
Elliott Ladd,125,122.47,TN,,310.71,265.35,576.06,,,BD,Multi-ply,M,Open,1
Elliott Ladd,125,122.47,TN,,310.71,265.35,576.06,,,BD,Multi-ply,M,Masters 45-49,1
Tommy Chadwell,110,107.5,TN,,149.69,,149.69,,,B,Raw,M,Teenage 18-19,1
Jon VanDoran,75,72.8,TN,,136.08,,136.08,,,B,Raw,M,Open,1
Cleve Tatum,140+,144.06,GA,,249.48,,249.48,,,B,Raw,M,Open,1
Derek Davis,100,96.98,TN,,170.1,,170.1,,,B,Raw,M,Sub-Masters,1
Lee Morris,100,94.35,AL,,188.24,,188.24,,,B,Raw,M,Masters 40-44,1
David Moorfield,100,98.7,TN,,138.35,,138.35,,,B,Raw,M,Masters 50-54,1
Chester Wooten,100,99.34,TN,,183.7,,183.7,190.51,,B,Raw,M,Masters 65-69,1
Gerald Lambdin,110,108.05,TN,,106.59,,106.59,,,B,Raw,M,Masters 70-74,1
Joe Elmore,90,89.9,TN,,170.1,,170.1,,,B,Single-ply,M,Open,1
Tim Moon,125,119.75,GA,,294.84,,294.84,,,B,Single-ply,M,Masters 45-49,1
Jacob Hill,140,135.17,TN,,231.33,,231.33,,,B,Multi-ply,M,Teenage 16-17,1
Harold Parton,90,85.73,TN,,183.7,,183.7,,,B,Multi-ply,M,Open,1
Harley Timbs,125,120.2,TN,,369.68,,369.68,,,B,Multi-ply,M,Open,1
Wesley Claborn,118,113.4,GA,,,258.55,258.55,,,D,Raw,M,Teenage 16-17,1
Trey Wright,125,120.93,AL,,,235.87,235.87,,,D,Raw,M,Teenage 16-17,2
Tyler MacMahan,82.5,82.1,TN,,,219.99,219.99,,,D,Raw,M,Teenage 18-19,1
Derek Harrison,110,100.06,TN,,,231.33,231.33,,,D,Raw,M,Juniors,1
Barbara Hall,82.5,78.47,TN,,,124.74,124.74,,,D,Raw,F,Masters 45-49,1
Nathan Awad,110,108.41,TN,,,294.84,294.84,,,D,Raw,M,Open,1
Jeremy Adams #2,118,117.57,TN,,,238.14,238.14,,,D,Raw,M,Open,1
Tony Harris,82.5,82.1,TN,,,170.1,170.1,,,D,Raw,M,Masters 40-44,1
John Robinson,118,117.03,TN,,,217.72,217.72,,,D,Single-ply,M,Masters 60-64,1
Mark Ferris,110,108.86,NC,,,308.44,308.44,,,D,Multi-ply,M,Open,1
Mark Ferris,110,108.86,NC,,,308.44,308.44,,,D,Multi-ply,M,Masters 45-49,1
