{
    "$id": "https://registry.hzdr.de/crp/picongpu/schema/picongpu.pypicongpu.output.plugin.Plugin",
    "type": "object",
    "description": "any output. consists of (1) the type of the plugin instance and (2) the data of the plugin instance",
    "required": ["typeID", "data"],
    "unevaluatedProperties": false,
    "properties": {
        "typeID": {
            "description": "Enum-equivalent of selected type. Note that only one entry should be marked as true, and all others as false, but that is not enforced by the schema.",
            "type": "object",
            "required": ["auto", "phasespace"],
            "unevaluatedProperties": false,
            "properties": {
                "auto": { "type": "boolean" },
                "phasespace": { "type": "boolean" }
            }
        },
        "data": {
            "description": "configuration data of plugin",
                "anyOf":[
                    {"$ref":"https://registry.hzdr.de/crp/picongpu/schema/picongpu.pypicongpu.output.phase_space.PhaseSpace"},
                    {"$ref": "https://registry.hzdr.de/crp/picongpu/schema/picongpu.pypicongpu.output.auto.Auto"}
                ]
                }
        }
    }
