module gitlab.com/hypolas/vacansosoleil/go-types

go 1.23.4

require google.golang.org/api v0.214.0

require (
	cloud.google.com/go/auth v0.13.0 // indirect
	cloud.google.com/go/auth/oauth2adapt v0.2.6 // indirect
	cloud.google.com/go/compute/metadata v0.6.0 // indirect
	github.com/felixge/httpsnoop v1.0.4 // indirect
	github.com/go-logr/logr v1.4.2 // indirect
	github.com/go-logr/stdr v1.2.2 // indirect
	github.com/google/s2a-go v0.1.8 // indirect
	github.com/google/uuid v1.6.0 // indirect
	github.com/googleapis/enterprise-certificate-proxy v0.3.4 // indirect
	github.com/googleapis/gax-go/v2 v2.14.1 // indirect
	go.opentelemetry.io/auto/sdk v1.1.0 // indirect
	go.opentelemetry.io/contrib/instrumentation/net/http/otelhttp v0.58.0 // indirect
	go.opentelemetry.io/otel v1.33.0 // indirect
	go.opentelemetry.io/otel/metric v1.33.0 // indirect
	go.opentelemetry.io/otel/trace v1.33.0 // indirect
	golang.org/x/crypto v0.31.0 // indirect
	golang.org/x/net v0.33.0 // indirect
	golang.org/x/oauth2 v0.24.0 // indirect
	golang.org/x/sys v0.28.0 // indirect
	golang.org/x/text v0.21.0 // indirect
	google.golang.org/genproto/googleapis/rpc v0.0.0-20241223144023-3abc09e42ca8 // indirect
	google.golang.org/grpc v1.69.2 // indirect
	google.golang.org/protobuf v1.36.1 // indirect
)
