module cgit

go 1.22.1

require (
	github.com/charmbracelet/lipgloss v0.13.0
	github.com/gookit/slog v0.5.6
	github.com/pterm/pterm v0.12.79
	gitlab.com/hypolas/tools/bubbles v0.20.2
	gitlab.com/hypolas/tools/bubbletea v1.2.28
	gopkg.in/yaml.v3 v3.0.1
)

require (
	atomicgo.dev/cursor v0.2.0 // indirect
	atomicgo.dev/keyboard v0.2.9 // indirect
	atomicgo.dev/schedule v0.1.0 // indirect
	github.com/atotto/clipboard v0.1.4 // indirect
	github.com/aymanbagabas/go-osc52/v2 v2.0.1 // indirect
	github.com/charmbracelet/x/ansi v0.2.3 // indirect
	github.com/charmbracelet/x/term v0.2.0 // indirect
	github.com/containerd/console v1.0.4 // indirect
	github.com/erikgeiser/coninput v0.0.0-20211004153227-1c3628e74d0f // indirect
	github.com/gookit/color v1.5.4 // indirect
	github.com/gookit/goutil v0.6.16 // indirect
	github.com/gookit/gsr v0.1.0 // indirect
	github.com/lithammer/fuzzysearch v1.1.8 // indirect
	github.com/lucasb-eyer/go-colorful v1.2.0 // indirect
	github.com/mattn/go-isatty v0.0.20 // indirect
	github.com/mattn/go-localereader v0.0.1 // indirect
	github.com/mattn/go-runewidth v0.0.16 // indirect
	github.com/muesli/ansi v0.0.0-20230316100256-276c6243b2f6 // indirect
	github.com/muesli/cancelreader v0.2.2 // indirect
	github.com/muesli/termenv v0.15.2 // indirect
	github.com/rivo/uniseg v0.4.7 // indirect
	github.com/valyala/bytebufferpool v1.0.0 // indirect
	github.com/xo/terminfo v0.0.0-20220910002029-abceb7e1c41e // indirect
	golang.org/x/sync v0.8.0 // indirect
	golang.org/x/sys v0.25.0 // indirect
	golang.org/x/term v0.24.0 // indirect
	golang.org/x/text v0.18.0 // indirect
)
