<svg width="17" height="20" viewBox="0 0 17 20" fill="none" xmlns="http://www.w3.org/2000/svg">
<path fill-rule="evenodd" clip-rule="evenodd" d="M8.84797 13.3462C4.98035 13.3462 1.67749 13.931 1.67749 16.2729C1.67749 18.6148 4.95939 19.2205 8.84797 19.2205C12.7156 19.2205 16.0175 18.6348 16.0175 16.2938C16.0175 13.9529 12.7365 13.3462 8.84797 13.3462Z" stroke="#97A2B0" stroke-width="1.5" stroke-linecap="round" stroke-linejoin="round"/>
<path fill-rule="evenodd" clip-rule="evenodd" d="M8.84793 10.0059C11.386 10.0059 13.4432 7.94781 13.4432 5.40971C13.4432 2.87162 11.386 0.814476 8.84793 0.814476C6.30983 0.814476 4.25174 2.87162 4.25174 5.40971C4.24316 7.93924 6.28697 9.99733 8.81555 10.0059H8.84793Z" stroke="#97A2B0" stroke-width="1.42857" stroke-linecap="round" stroke-linejoin="round"/>
</svg>
