<svg width="108" height="25" viewBox="0 0 108 25" fill="none" xmlns="http://www.w3.org/2000/svg">
<path d="M16.6506 0.927558C15.8948 0.195059 14.4634 0.160723 13.6617 0.927558C13.2495 1.29381 13.0548 1.78595 13.0548 2.35822V10.0723C12.5738 9.6832 12.0356 9.36274 11.4516 9.09949C9.10402 8.03508 6.13805 8.17243 3.9279 9.46574C2.71403 10.1754 1.71774 11.194 1.04209 12.4415C0.343548 13.6891 0 15.0968 0 16.6419C0 18.1871 0.389354 19.5948 1.1108 20.8424C1.86661 22.0899 2.9087 23.1085 4.23709 23.8181C5.54257 24.5277 7.03128 24.9054 8.62305 24.9054C10.2148 24.9054 11.6806 24.5392 12.9861 23.8181C14.2916 23.1085 15.3337 22.0899 16.0895 20.8424C16.8453 19.5948 17.2346 18.1642 17.2346 16.6419V2.35822C17.2346 1.78595 17.04 1.29381 16.6506 0.927558H16.6277H16.6506ZM13.1579 16.6076C13.1579 17.4889 12.9632 18.2901 12.5509 18.9882C12.1616 19.6749 11.6005 20.2358 10.9248 20.6249C9.56208 21.4032 7.64966 21.4032 6.28692 20.6249C5.61128 20.2358 5.05015 19.6749 4.63789 18.9653C4.22564 18.2786 4.03096 17.466 4.03096 16.5847C4.03096 15.7034 4.22564 14.9251 4.63789 14.2041C5.02725 13.5174 5.58838 12.9566 6.28692 12.5674C6.96257 12.1783 7.76418 11.9723 8.6116 11.9723C9.45901 11.9723 10.2377 12.1783 10.9363 12.5674C11.6348 12.9566 12.173 13.5174 12.5624 14.2041C12.9517 14.9023 13.1693 15.7034 13.1693 16.5847L13.1464 16.6076H13.1579Z" fill="black"/>
<path d="M34.0456 9.43136C31.4231 8.02359 27.7586 8.02359 25.1706 9.43136C23.8651 10.1181 22.823 11.1138 22.0901 12.3842C21.3572 13.6318 21.0022 15.0624 21.0022 16.6533C21.0022 18.2442 21.3686 19.652 22.0901 20.8995C22.823 22.1471 23.8651 23.1428 25.1706 23.8524C26.4761 24.5506 27.9877 24.9168 29.6367 24.9168C31.2857 24.9168 32.7859 24.5735 34.0799 23.8524C35.3854 23.1428 36.4046 22.1471 37.1375 20.8995C37.8704 19.652 38.2254 18.2213 38.2254 16.6533C38.2254 15.0853 37.8589 13.6318 37.1146 12.3842C36.3588 11.1367 35.3396 10.141 34.0341 9.43136H34.057H34.0456ZM31.9843 20.6706C30.6215 21.4604 28.6404 21.4604 27.2777 20.6706C26.602 20.2815 26.0409 19.7436 25.6515 19.0568C25.2622 18.3701 25.0446 17.5575 25.0446 16.6533C25.0446 15.7492 25.2393 14.948 25.6515 14.2269C26.0409 13.5173 26.5791 12.9794 27.2777 12.5903C27.9762 12.2011 28.7549 12.018 29.6252 12.018C30.4956 12.018 31.2972 12.2011 31.9728 12.5903C32.6485 12.9794 33.2096 13.5402 33.576 14.204C33.9654 14.9137 34.1601 15.7263 34.1601 16.6304C34.1601 17.5346 33.9654 18.3358 33.576 19.034C33.1867 19.7207 32.6599 20.2586 31.9728 20.6477V20.6706H31.9843Z" fill="black"/>
<path d="M54.1428 9.24836C52.1502 8.20684 49.482 8.04661 47.2833 8.88212C46.7221 9.08813 46.2183 9.36282 45.7602 9.67184C45.6686 9.44293 45.5197 9.23692 45.325 9.04235C44.5463 8.33274 43.1607 8.30985 42.3362 9.04235C41.9239 9.4086 41.7292 9.90075 41.7292 10.473V22.8225C41.7292 23.3719 41.9239 23.864 42.3362 24.2302C43.1378 24.9971 44.5692 24.9742 45.348 24.2302C45.7373 23.864 45.932 23.3719 45.932 22.8225V15.0168C45.932 14.4674 46.0809 13.9753 46.39 13.5403C46.7107 13.0825 47.1458 12.7277 47.7299 12.453C48.3139 12.1784 48.9667 12.041 49.6996 12.041C50.9363 12.041 51.9097 12.3615 52.6312 13.0368C53.3641 13.712 53.6962 14.6734 53.6962 16.0125V22.8225C53.6962 23.3719 53.8908 23.864 54.3031 24.2302C54.6924 24.5965 55.1963 24.8025 55.8033 24.8025C56.4102 24.8025 56.8912 24.5965 57.2805 24.2302C57.6928 23.8411 57.8874 23.3719 57.8874 22.8225V16.0125C57.8874 14.4216 57.5439 13.0368 56.9141 11.9037C56.2613 10.7477 55.3337 9.85496 54.1771 9.24836H54.1542H54.1428Z" fill="black"/>
<path d="M74.08 9.43139C72.7745 8.73322 71.2858 8.36697 69.6596 8.36697C68.0335 8.36697 66.5105 8.71033 65.1935 9.43139C63.888 10.1295 62.846 11.1138 62.113 12.3843C61.3801 13.6318 61.0251 15.0625 61.0251 16.6534C61.0251 18.2443 61.3916 19.652 62.113 20.8996C62.846 22.1471 63.888 23.1428 65.1935 23.8525C66.499 24.5506 68.0106 24.9169 69.6596 24.9169C71.3087 24.9169 72.8088 24.5735 74.1029 23.8525C75.4083 23.1428 76.4504 22.1471 77.1833 20.8996C77.9162 19.652 78.2712 18.2214 78.2712 16.6534C78.2712 15.0854 77.9048 13.6318 77.1604 12.3843C76.4046 11.1367 75.3854 10.141 74.08 9.43139ZM72.0187 20.6707C70.6559 21.4604 68.6977 21.4604 67.3121 20.6707C66.6364 20.2815 66.0753 19.7436 65.6859 19.0569C65.2966 18.3702 65.079 17.5575 65.079 16.6534C65.079 15.7492 65.2737 14.948 65.6859 14.227C66.0753 13.5174 66.6021 12.9794 67.3121 12.5903C68.0106 12.2011 68.7893 12.018 69.6596 12.018C70.53 12.018 71.3316 12.2011 72.0072 12.5903C72.6829 12.9794 73.244 13.5402 73.6104 14.2041C73.9998 14.9137 74.1945 15.7263 74.1945 16.6305C74.1945 17.5347 73.9998 18.3358 73.6104 19.034C73.2211 19.7207 72.6829 20.2586 72.0072 20.6478V20.6707H72.0187Z" fill="black"/>
<path d="M91.7956 21.4262C91.4291 21.06 90.9711 20.854 90.4557 20.854H88.3143C87.8791 20.854 87.5127 20.6937 87.2264 20.3275C86.8828 19.9383 86.7225 19.4462 86.7225 18.8281V12.579H88.5891C89.1503 12.579 89.6312 12.4188 89.9977 12.0983C90.3641 11.7778 90.5588 11.3315 90.5588 10.8508C90.5588 10.3243 90.3641 9.87793 89.9748 9.53457C89.6083 9.2141 89.1274 9.05387 88.5662 9.05387H86.6996V3.48001C86.6996 2.93064 86.5049 2.43849 86.1156 2.07224C85.3369 1.3283 83.9283 1.3283 83.1611 2.07224C82.7717 2.43849 82.577 2.93064 82.577 3.48001V9.04242H81.8441C81.283 9.04242 80.802 9.20265 80.4356 9.52312C80.0462 9.84359 79.8516 10.3014 79.8516 10.8393C79.8516 11.32 80.0462 11.7664 80.4356 12.0869C80.802 12.4073 81.2601 12.5676 81.8441 12.5676H82.577V18.8167C82.577 19.9269 82.8175 20.9341 83.3099 21.8154C83.8138 22.7195 84.5009 23.4291 85.3712 23.9671C86.2415 24.4936 87.2378 24.7568 88.3028 24.7568H89.9862C90.639 24.7568 91.1772 24.5737 91.6123 24.2303C92.0704 23.8641 92.3109 23.3719 92.3109 22.7997C92.3109 22.2274 92.1391 21.781 91.807 21.4148V21.4377L91.7956 21.4262Z" fill="black"/>
<path d="M106.431 16.5386C105.458 15.7603 103.912 15.1537 101.656 14.7188C100.66 14.5357 99.9038 14.3297 99.3999 14.1236C98.8159 13.8947 98.6212 13.7116 98.5525 13.6201C98.4265 13.4598 98.3807 13.2767 98.3807 13.0478C98.3807 12.8418 98.4494 12.59 98.9189 12.3611C99.3999 12.1322 100.03 11.9948 100.831 11.9948C101.53 11.9948 102.137 12.0635 102.606 12.2237C103.064 12.384 103.522 12.6358 103.946 13.002C104.839 13.7688 106.076 13.9062 106.935 13.3225C107.519 12.8647 107.668 12.3496 107.668 12.0063C107.668 11.5713 107.496 11.1479 107.164 10.7587C106.511 9.9919 105.641 9.39674 104.542 8.98471C102.606 8.21788 99.9839 8.10342 97.7967 8.87026C96.7775 9.21362 95.953 9.75154 95.3231 10.4612C94.6704 11.1937 94.3268 12.0978 94.3268 13.1393C94.3268 15.6802 96.3652 17.3398 100.419 18.0837C101.782 18.3355 102.721 18.6102 103.259 18.965C103.82 19.3084 103.889 19.6746 103.889 19.915C103.889 20.1668 103.82 20.5101 103.259 20.842C102.755 21.1396 101.976 21.277 101.003 21.277C100.247 21.277 99.5259 21.1396 98.8731 20.8878C98.2204 20.636 97.728 20.3613 97.4188 20.0065C96.5942 19.2282 95.5751 19.0795 94.5101 19.8463C93.9718 20.2354 93.6855 20.7734 93.6855 21.3914C93.6855 21.8721 93.8802 22.3185 94.2467 22.6618C94.9796 23.36 95.9644 23.9094 97.2012 24.3214C98.4151 24.7334 99.7434 24.9394 101.129 24.9394C102.515 24.9394 103.751 24.7334 104.771 24.2871C105.813 23.8521 106.614 23.2227 107.176 22.4444C107.737 21.6661 108 20.7848 108 19.812C108 18.4957 107.496 17.4084 106.477 16.5844V16.5615L106.431 16.5386Z" fill="black"/>
</svg>
