<svg width="41" height="14" viewBox="0 0 41 14" fill="none" xmlns="http://www.w3.org/2000/svg">
    <rect width="41" height="14" rx="3" fill="#ECA548"/>
    <path d="M3.4 7.81V8.88H11.79V7.81H3.4ZM6.9 8.5V11.9H8.22V8.5H6.9ZM7.57 2.94C5.6 2.94 4.23 3.76 4.23 5.03C4.23 6.29 5.6 7.1 7.57 7.1C9.55 7.1 10.92 6.29 10.92 5.03C10.92 3.76 9.55 2.94 7.57 2.94ZM7.57 4C8.79 4 9.55 4.36 9.55 5.03C9.55 5.69 8.79 6.05 7.57 6.05C6.36 6.05 5.59 5.69 5.59 5.03C5.59 4.36 6.36 4 7.57 4ZM18.3792 2.62V11.91H19.7092V2.62H18.3792ZM12.4992 8.67V9.75H13.3192C15.0092 9.75 16.3692 9.7 17.8692 9.43L17.7392 8.36C16.2692 8.61 14.9592 8.67 13.3192 8.67H12.4992ZM12.4892 3.41V4.47H15.4992V5.94H12.4992V9.07H13.8492V6.99H16.8592V3.41H12.4892ZM23.0784 3.27C21.6684 3.27 20.6484 4.55 20.6484 6.57C20.6484 8.61 21.6684 9.89 23.0784 9.89C24.4884 9.89 25.5084 8.61 25.5084 6.57C25.5084 4.55 24.4884 3.27 23.0784 3.27ZM23.0784 4.48C23.7684 4.48 24.2384 5.21 24.2384 6.57C24.2384 7.95 23.7684 8.69 23.0784 8.69C22.3884 8.69 21.9284 7.95 21.9284 6.57C21.9284 5.21 22.3884 4.48 23.0784 4.48ZM26.5184 2.63V11.89H27.8584V2.63H26.5184ZM27.5584 6.12V7.22H29.1984V6.12H27.5584ZM35.5477 2.62V11.91H36.8877V2.62H35.5477ZM31.8977 3.27C30.4977 3.27 29.4677 4.55 29.4677 6.57C29.4677 8.61 30.4977 9.89 31.8977 9.89C33.2977 9.89 34.3277 8.61 34.3277 6.57C34.3277 4.55 33.2977 3.27 31.8977 3.27ZM31.8977 4.48C32.5877 4.48 33.0477 5.21 33.0477 6.57C33.0477 7.95 32.5877 8.69 31.8977 8.69C31.2077 8.69 30.7377 7.95 30.7377 6.57C30.7377 5.21 31.2077 4.48 31.8977 4.48Z" fill="white"/>
</svg>
