<svg width="24" height="24" viewBox="0 0 24 24" fill="none" xmlns="http://www.w3.org/2000/svg">
    <path d="M16.331 9.08319C16.7216 8.69266 16.7216 8.0595 16.331 7.66897C15.9405 7.27845 15.3073 7.27845 14.9168 7.66897L16.331 9.08319ZM7.66897 14.9168C7.27845 15.3073 7.27845 15.9405 7.66897 16.331C8.05949 16.7216 8.69266 16.7216 9.08318 16.331L7.66897 14.9168ZM14.9168 16.331C15.3073 16.7216 15.9405 16.7216 16.331 16.331C16.7216 15.9405 16.7216 15.3073 16.331 14.9168L14.9168 16.331ZM9.08318 7.66897C8.69266 7.27845 8.05949 7.27845 7.66897 7.66897C7.27845 8.05949 7.27845 8.69266 7.66897 9.08318L9.08318 7.66897ZM21.25 12C21.25 17.1086 17.1086 21.25 12 21.25V23.25C18.2132 23.25 23.25 18.2132 23.25 12H21.25ZM12 21.25C6.89137 21.25 2.75 17.1086 2.75 12H0.75C0.75 18.2132 5.7868 23.25 12 23.25V21.25ZM2.75 12C2.75 6.89137 6.89137 2.75 12 2.75V0.75C5.7868 0.75 0.75 5.7868 0.75 12H2.75ZM12 2.75C17.1086 2.75 21.25 6.89137 21.25 12H23.25C23.25 5.7868 18.2132 0.75 12 0.75V2.75ZM14.9168 7.66897L11.2929 11.2929L12.7071 12.7071L16.331 9.08319L14.9168 7.66897ZM11.2929 11.2929L7.66897 14.9168L9.08318 16.331L12.7071 12.7071L11.2929 11.2929ZM16.331 14.9168L12.7071 11.2929L11.2929 12.7071L14.9168 16.331L16.331 14.9168ZM12.7071 11.2929L9.08318 7.66897L7.66897 9.08318L11.2929 12.7071L12.7071 11.2929Z" fill="#222222"/>
</svg>
