<svg width="24" height="24" viewBox="0 0 24 24" fill="none" xmlns="http://www.w3.org/2000/svg">
    <path d="M8.71453 2.26594L2.26572 8.71475C1.56668 9.41379 1.56668 10.5472 2.26572 11.2462L11.946 20.9265C12.6451 21.6255 13.7784 21.6255 14.4775 20.9265L20.9263 14.4777C21.6253 13.7786 21.6253 12.6453 20.9263 11.9462L11.246 2.26594C10.5469 1.5669 9.41357 1.5669 8.71453 2.26594Z" fill="#73DF78"/>
    <path fill-rule="evenodd" clip-rule="evenodd" d="M4.73822 13.7168L7.19822 11.2568C7.55822 10.8968 7.55822 10.3068 7.19822 9.94676C6.83822 9.58676 6.24823 9.58676 5.88823 9.94676L3.42822 12.4068L4.73822 13.7168V13.7168Z" fill="white"/>
    <path fill-rule="evenodd" clip-rule="evenodd" d="M7.98822 16.9668L12.6182 12.3368C12.9782 11.9768 12.9782 11.3868 12.6182 11.0268C12.2582 10.6668 11.6682 10.6668 11.3082 11.0268L6.67822 15.6568L7.98822 16.9668V16.9668Z" fill="white"/>
    <path fill-rule="evenodd" clip-rule="evenodd" d="M11.228 20.2065L13.688 17.7465C14.048 17.3865 14.048 16.7965 13.688 16.4365C13.328 16.0765 12.738 16.0765 12.378 16.4365L9.91797 18.8965L11.228 20.2065V20.2065Z" fill="white"/>
</svg>
