<svg width="87" height="32" viewBox="0 0 87 32" fill="none" xmlns="http://www.w3.org/2000/svg">
    <rect width="87" height="32" rx="8" fill="#EFFAEC"/>
    <path d="M18.008 15.98C16.37 16.302 14.942 16.4 12.464 16.4V12.494H16.874V11.57H11.316V17.338H12.296C14.928 17.338 16.412 17.254 18.134 16.904L18.008 15.98ZM13.822 18.654H12.674V22.756H21.046V21.818H13.822V18.654ZM20.486 14.202V10.478H19.338V19.564H20.486V15.154H22.348V14.202H20.486ZM27.6949 16.204H24.9929V14.174H27.6949V16.204ZM28.7729 11.29H27.6949V13.264H24.9929V11.29H23.9009V17.128H28.7729V11.29ZM25.4969 19.704H32.7909V23.036H33.9389V18.78H25.4969V19.704ZM32.8329 10.492V13.754H31.2369V10.716H30.1449V17.954H31.2369V14.692H32.8329V18.01H33.9389V10.492H32.8329ZM46.2298 10.492H45.0818V17.002H46.2298V10.492ZM43.6258 15.854C41.7638 15.308 40.4618 13.866 40.4618 12.256V12.116H43.3038V11.192H36.4158V12.116H39.2858V12.256C39.2858 13.964 37.9978 15.504 36.1078 16.106L36.6538 17.016C38.1798 16.498 39.3558 15.406 39.8878 14.02C40.4618 15.308 41.6238 16.302 43.0938 16.75L43.6258 15.854ZM39.2718 21.986V20.614H46.2438V17.604H38.1098V18.5H45.1098V19.76H38.1378V22.896H46.6638V21.986H39.2718ZM58.6136 14.51H55.4916V11.878H58.6136V14.51ZM54.3436 14.51H52.4956V15.434H61.6096V14.51H59.7616V11.878H61.6656V10.94H52.4536V11.878H54.3436V14.51ZM60.1956 20.88C60.1956 21.692 59.0336 22.154 57.0736 22.154C55.0856 22.154 53.9236 21.692 53.9236 20.88C53.9236 20.068 55.0856 19.606 57.0736 19.606C59.0336 19.606 60.1956 20.068 60.1956 20.88ZM62.7436 17.534V16.596H51.3896V17.534H56.4996V18.752C54.1476 18.85 52.7616 19.578 52.7616 20.88C52.7616 22.266 54.3576 23.022 57.0736 23.022C59.7476 23.022 61.3576 22.266 61.3576 20.88C61.3576 19.592 59.9856 18.864 57.6476 18.752V17.534H62.7436ZM72.7805 15.476H66.5505V13.628H72.7805V15.476ZM73.9285 10.982H72.7805V12.704H66.5505V10.982H65.4165V16.414H73.9285V10.982ZM75.3705 17.926H63.9745V18.85H69.0705V23.05H70.2185V18.85H75.3705V17.926Z" fill="#3D6A4A"/>
</svg>
