<svg width="80" height="80" viewBox="0 0 80 80" fill="none" xmlns="http://www.w3.org/2000/svg">
    <g opacity="0.8">
        <circle cx="40" cy="40" r="40" fill="#E7FFF5"/>
    </g>
    <circle cx="40.0004" cy="40" r="21.641" stroke="#86D6B4" stroke-width="8"/>
</svg>
