<svg width="64" height="26" viewBox="0 0 64 26" fill="none" xmlns="http://www.w3.org/2000/svg">
    <rect width="64" height="26" fill="white"/>
    <rect width="64" height="26" rx="8" fill="#FFF8E8"/>
    <path d="M18.484 8.1V14.292H19.492V8.1H18.484ZM12.484 14.88V18.792H19.492V14.88H12.484ZM18.508 15.672V17.988H13.456V15.672H18.508ZM13.672 8.664C12.028 8.664 10.84 9.696 10.84 11.196C10.84 12.696 12.028 13.728 13.672 13.728C15.316 13.728 16.492 12.696 16.492 11.196C16.492 9.696 15.316 8.664 13.672 8.664ZM13.672 9.492C14.752 9.492 15.532 10.188 15.532 11.196C15.532 12.204 14.752 12.888 13.672 12.888C12.592 12.888 11.812 12.204 11.812 11.196C11.812 10.188 12.592 9.492 13.672 9.492ZM24.2551 9.024V10.968C24.2551 13.02 22.9471 15.096 21.3391 15.864L21.9511 16.68C23.7271 15.78 25.0711 13.464 25.0711 10.968V9.024H24.2551ZM24.4231 9.024V10.968C24.4231 13.38 25.7791 15.612 27.5431 16.476L28.1431 15.684C26.5351 14.94 25.2391 12.948 25.2391 10.968V9.024H24.4231ZM29.2711 8.076V18.948H30.2671V8.076H29.2711ZM40.1301 8.076V18.948H41.1141V8.076H40.1301ZM37.7901 12.036V12.852H40.4181V12.036H37.7901ZM34.9461 9.636V11.256C34.9461 13.188 33.6621 15.24 32.1021 16.008L32.6901 16.8C34.4061 15.912 35.7501 13.596 35.7501 11.256V9.636H34.9461ZM35.1501 9.636V11.256C35.1501 13.488 36.4701 15.72 38.1861 16.572L38.7741 15.792C37.2021 15.048 35.9421 13.068 35.9421 11.256V9.636H35.1501ZM32.4981 9.192V10.02H38.4021V9.192H32.4981ZM45.6612 9.252V10.128C45.6612 11.676 44.5812 13.08 42.9492 13.656L43.4532 14.448C45.2772 13.788 46.4772 12.12 46.4772 10.128V9.252H45.6612ZM45.8412 9.252V10.116C45.8412 11.964 46.9932 13.512 48.8052 14.112L49.2852 13.332C47.6892 12.804 46.6572 11.532 46.6572 10.116V9.252H45.8412ZM43.2492 8.892V9.708H49.0452V8.892H43.2492ZM50.4132 8.088V14.628H51.4092V8.088H50.4132ZM51.1332 10.836V11.676H53.0172V10.836H51.1332ZM47.9532 14.916C45.7452 14.916 44.3892 15.648 44.3892 16.908C44.3892 18.18 45.7452 18.912 47.9532 18.912C50.1612 18.912 51.5172 18.18 51.5172 16.908C51.5172 15.648 50.1612 14.916 47.9532 14.916ZM47.9532 15.72C49.5612 15.72 50.5452 16.152 50.5452 16.908C50.5452 17.676 49.5612 18.132 47.9532 18.132C46.3452 18.132 45.3612 17.676 45.3612 16.908C45.3612 16.152 46.3452 15.72 47.9532 15.72Z" fill="#DB7C00"/>
</svg>
