<svg width="187" height="258" viewBox="0 0 187 258" fill="none" xmlns="http://www.w3.org/2000/svg">
    <g filter="url(#filter0_ddd_672_7475)">
        <rect x="52" y="117" width="12" height="12" rx="6" fill="#3DA0A7"/>
    </g>
    <rect x="56.8428" y="119.526" width="2.31579" height="6.94737" rx="1.15789" fill="white"/>
    <rect x="61.4736" y="121.842" width="2.31579" height="6.94737" rx="1.15789" transform="rotate(90 61.4736 121.842)" fill="white"/>
    <defs>
        <filter id="filter0_ddd_672_7475" x="-71" y="0" width="258" height="258" filterUnits="userSpaceOnUse" color-interpolation-filters="sRGB">
            <feFlood flood-opacity="0" result="BackgroundImageFix"/>
            <feColorMatrix in="SourceAlpha" type="matrix" values="0 0 0 0 0 0 0 0 0 0 0 0 0 0 0 0 0 0 127 0" result="hardAlpha"/>
            <feOffset dy="1.41914"/>
            <feGaussianBlur stdDeviation="10.0257"/>
            <feColorMatrix type="matrix" values="0 0 0 0 0.682353 0 0 0 0 0.682353 0 0 0 0 0.682353 0 0 0 0.0392421 0"/>
            <feBlend mode="normal" in2="BackgroundImageFix" result="effect1_dropShadow_672_7475"/>
            <feColorMatrix in="SourceAlpha" type="matrix" values="0 0 0 0 0 0 0 0 0 0 0 0 0 0 0 0 0 0 127 0" result="hardAlpha"/>
            <feOffset dy="2.54258"/>
            <feGaussianBlur stdDeviation="27.0029"/>
            <feColorMatrix type="matrix" values="0 0 0 0 0.682353 0 0 0 0 0.682353 0 0 0 0 0.682353 0 0 0 0.0625716 0"/>
            <feBlend mode="normal" in2="effect1_dropShadow_672_7475" result="effect2_dropShadow_672_7475"/>
            <feColorMatrix in="SourceAlpha" type="matrix" values="0 0 0 0 0 0 0 0 0 0 0 0 0 0 0 0 0 0 127 0" result="hardAlpha"/>
            <feOffset dy="6"/>
            <feGaussianBlur stdDeviation="61.5"/>
            <feColorMatrix type="matrix" values="0 0 0 0 0.682353 0 0 0 0 0.682353 0 0 0 0 0.682353 0 0 0 0.11 0"/>
            <feBlend mode="normal" in2="effect2_dropShadow_672_7475" result="effect3_dropShadow_672_7475"/>
            <feBlend mode="normal" in="SourceGraphic" in2="effect3_dropShadow_672_7475" result="shape"/>
        </filter>
    </defs>
</svg>
