<svg width="80" height="80" viewBox="0 0 80 80" fill="none" xmlns="http://www.w3.org/2000/svg">
    <g opacity="0.8">
        <circle cx="40" cy="40" r="40" fill="#FFECBB"/>
        <path d="M19.8291 41.6107L32.2355 54.0171L59.5859 26.6667" stroke="#FFBE3F" stroke-width="8" stroke-linecap="round"/>
    </g>
</svg>
