{
	"name": "UsingData",
	"version": "2.0.0-hydra",
	"author": "foxlit",
	"descriptionmsg": "usingdata-description",
	"license-name": "GPL-2.0-or-later",
	"type": "parserhook",
	"requires": {
		"MediaWiki": ">= 1.29.0"
	},
	"MessagesDirs": {
		"UsingData": [
			"i18n"
		]
	},
	"ExtensionMessagesFiles": {
		"UsingDataMagic": "UsingData.i18n.magic.php"
	},
	"AutoloadClasses": {
		"Foxlit\\UsingData": "UsingData.hooks.php",
		"Foxlit\\UsingDataPPFrame_DOM": "classes/UsingDataPPFrame_DOM.php"
	},
	"Hooks": {
		"BeforeParserFetchTemplateAndtitle": "Foxlit\\UsingData::onBeforeParserFetchTemplateAndtitle",
		"MagicWordwgVariableIDs": "Foxlit\\UsingData::onMagicWordwgVariableIDs",
		"ParserFirstCallInit": "Foxlit\\UsingData::onParserFirstCallInit",
		"ParserGetVariableValueSwitch": "Foxlit\\UsingData::ancestorNameVar"
	},
	"manifest_version": 1
}
