{
	"name": "Category Intersection",
	"version": "1.0.0",
	"author": "foxlit",
	"descriptionmsg": "catisect-description",
	"license-name": "GPL-2.0-or-later",
	"type": "other",
	"MessagesDirs": {
		"Catisect": [
			"i18n"
		]
	},
	"AutoloadClasses": {
		"CatisectHooks": "Catisect.hooks.php",
		"IntersectionPage": "classes/IntersectionPage.php"
	},
	"callback": "CatisectHooks::onRegistration",
	"Hooks": {
		"ArticleFromTitle": "IntersectionPage::onArticleFromTitle",
		"LinkBegin": "IntersectionPage::onLinkBegin",
		"SkinTemplateNavigation": "IntersectionPage::onSkinTemplateNavigation",
		"userCan": "IntersectionPage::onUserCan",
		"ParserBeforeInternalParse": "IntersectionPage::onParserBeforeInternalParse"
	},
	"manifest_version": 1
}
