{
  "auth": {
    "scarylandfront": {
      "service": "Cognito",
      "providerPlugin": "awscloudformation",
      "dependsOn": [],
      "customAuth": false,
      "frontendAuthConfig": {
        "socialProviders": [],
        "usernameAttributes": [],
        "signupAttributes": ["NICKNAME"],
        "passwordProtectionSettings": {
          "passwordPolicyMinLength": 8,
          "passwordPolicyCharacters": []
        },
        "mfaConfiguration": "OFF",
        "mfaTypes": ["SMS"],
        "verificationMechanisms": ["PHONE_NUMBER"]
      }
    },
    "userPoolGroups": {
      "service": "Cognito-UserPool-Groups",
      "providerPlugin": "awscloudformation",
      "dependsOn": [
        {
          "category": "auth",
          "resourceName": "scarylandfront",
          "attributes": ["UserPoolId", "AppClientIDWeb", "AppClientID"]
        }
      ]
    }
  }
}
