{
  "LANGUAGE":"nl",
  "TITLE":"Bankieren",
  "PROGRESS_DETAILS":"Details",
  "PROGRESS_AMOUNT":"Hoeveelheid",
  "PROGRESS_REVIEW":"Beoordeling",
  "PROGRESS_TRANSACT":"Transactie",
  "COMPLETE_MESSAGE":"Uw banktransactie wordt nu gestart. Wacht totdat deze volledig is voorbereid voor activering.",
  "BUTTON_DONE":"Klaar",
  "AMOUNT":"Hoeveelheid",
  "BANK_ACCOUNT":"bankrekening",
  "DESCRIPTION":"Beschrijving",
  "VOUCHER":"voucher",
  "SEND_DEPOSIT":"Stuur uw aanbetaling",
  "SEND_DEPOSIT_TEXT":"Stuur uw storting via uw bank naar de volgende bankrekening. Kom daarna hier terug en klik op de knop <i>Oké</i>.",
  "BUTTON_USER_DONE":"Oké, gedaan!",
  "DEPOSIT_SUBMITTED":"Aanbetaling ingediend.",
  "TRANSFER_PENDING":"De overdracht op afstand van uw bankaanvraag is in behandeling. Controleer uw e-mail om de voortgang van de overdracht te volgen",
  "WITHDRAWAL":"Opname",
  "TRANSFER":"Overdracht",
  "SUBMITTED":"ingediend.",
  "YOUR_TXID":"Uw transactie-ID is",
  "FAILED_TX":"Kan transactie niet verzenden!",
  "AMOUNT_UNAVAILABLE":"Het vereiste bedrag om dit verzoek te voltooien lijkt niet beschikbaar. Sluit dit venster en probeer het opnieuw.",
  "SENDING_TX":"Transactie verzenden...",
  "GETTING_PROPOSAL":"Voorstel ophalen...",
  "REQUEST_PROPOSAL":"Voorstel aanvragen..."
}
