<?xml version="1.0" encoding="UTF-8"?>
<svg width="22px" height="21px" viewBox="0 0 22 21" version="1.1" xmlns="http://www.w3.org/2000/svg" xmlns:xlink="http://www.w3.org/1999/xlink">
    <g stroke="none" stroke-width="1" fill="none" fill-rule="evenodd">
        <g transform="translate(-362.000000, -271.000000)">
            <rect x="0" y="0" width="416" height="737"></rect>
            <g transform="translate(362.000000, 271.000000)" fill="#3fa4af" fill-rule="nonzero">
                <path d="M21.6680108,4.785375 C21.9987805,5.277125 22.09099,5.92025 21.9057251,6.549375 L18.2706421,18.935875 C17.9398724,20.097875 16.7766797,21 15.6405577,21 L3.44014647,21 C2.09168888,21 0.651021823,19.89225 0.162057902,18.470375 C-0.0494316827,17.85525 -0.0494316827,17.25325 0.135833194,16.734375 C0.162057902,16.4605 0.215353278,16.1875 0.228042653,15.859375 C0.241577986,15.640625 0.12229786,15.463 0.148522569,15.2985 C0.201817944,14.970375 0.47929228,14.737625 0.690781865,14.36925 C1.08753633,13.685875 1.53674021,12.578125 1.68224504,11.867625 C1.74822979,11.60775 1.61626029,11.30675 1.68224504,11.074875 C1.74822979,10.815 1.99947942,10.623375 2.13144892,10.3775 C2.48844334,9.748375 2.95118255,8.532125 3.0171673,7.889 C3.04339201,7.602 2.91142251,7.287 2.99094259,7.06825 C3.08315205,6.754125 3.37416172,6.61675 3.57296193,6.34375 C3.89019631,5.89225 4.41892027,4.59375 4.49844036,3.86925 C4.52466506,3.6365 4.39269556,3.404625 4.43245561,3.15875 C4.48575098,2.898875 4.80298536,2.625875 5.01447494,2.310875 C5.56942362,1.463 5.67516841,-0.4095 7.35439571,0.08225 L7.34086038,0.123375 C7.5658853,0.06825 7.79006426,0 8.01508918,0 L18.0743798,0 C18.6953132,0 19.2511079,0.287 19.5810316,0.765625 C19.9244907,1.257375 20.0040108,1.9005 19.8187459,2.54275 L16.1971982,14.92925 C15.5762648,17.0345 15.2319598,17.5 13.5535784,17.5 L2.06715609,17.5 C1.89542654,17.5 1.68393696,17.541125 1.56465683,17.70475 C1.45891204,17.868375 1.44537671,17.99175 1.5511215,18.29275 C1.81590646,19.0855 2.72784955,19.25 3.45452776,19.25 L15.654939,19.25 C16.1439029,19.25 16.7123869,18.963 16.8578917,18.470375 L20.8237444,4.976125 C20.9032645,4.71625 20.9032645,4.44325 20.8897292,4.1965 C21.1934282,4.319875 21.4717485,4.510625 21.6697028,4.7845 L21.6680108,4.785375 Z M7.60395342,4.8125 C7.52443334,5.058375 7.6572488,5.25 7.89496309,5.25 L15.9315673,5.25 C16.1565922,5.25 16.4069959,5.058375 16.486516,4.8125 L16.7639903,3.9375 C16.8435104,3.691625 16.710695,3.5 16.4729807,3.5 L8.43637643,3.5 C8.21135151,3.5 7.96094784,3.691625 7.88142776,3.9375 L7.60395342,4.8125 Z M6.50759142,8.3125 C6.42807133,8.558375 6.56088679,8.75 6.79860108,8.75 L14.8352053,8.75 C15.0602302,8.75 15.3106339,8.558375 15.390154,8.3125 L15.6676283,7.4375 C15.7471484,7.191625 15.614333,7 15.3766187,7 L7.34001442,7 C7.1149895,7 6.86458583,7.191625 6.78506575,7.4375 L6.50759142,8.3125 Z"></path>
            </g>
        </g>
    </g>
</svg>
