<?xml version="1.0" encoding="UTF-8" standalone="no"?>
<!-- Generator: Adobe Illustrator 22.0.1, SVG Export Plug-In . SVG Version: 6.00 Build 0)  -->

<svg
   version="1.1"
   id="Layer_1"
   x="0px"
   y="0px"
   viewBox="0 0 16 16"
   style="enable-background:new 0 0 16 16;"
   xml:space="preserve"
   sodipodi:docname="fuel-red.svg"
   inkscape:version="1.1.2 (0a00cf5339, 2022-02-04)"
   xmlns:inkscape="http://www.inkscape.org/namespaces/inkscape"
   xmlns:sodipodi="http://sodipodi.sourceforge.net/DTD/sodipodi-0.dtd"
   xmlns="http://www.w3.org/2000/svg"
   xmlns:svg="http://www.w3.org/2000/svg"
   xmlns:rdf="http://www.w3.org/1999/02/22-rdf-syntax-ns#"
   xmlns:cc="http://creativecommons.org/ns#"
   xmlns:dc="http://purl.org/dc/elements/1.1/"><metadata
   id="metadata11"><rdf:RDF><cc:Work
       rdf:about=""><dc:format>image/svg+xml</dc:format><dc:type
         rdf:resource="http://purl.org/dc/dcmitype/StillImage" /></cc:Work></rdf:RDF></metadata><defs
   id="defs9" /><sodipodi:namedview
   pagecolor="#ffffff"
   bordercolor="#666666"
   borderopacity="1"
   objecttolerance="10"
   gridtolerance="10"
   guidetolerance="10"
   inkscape:pageopacity="0"
   inkscape:pageshadow="2"
   inkscape:window-width="1920"
   inkscape:window-height="1044"
   id="namedview7"
   showgrid="false"
   inkscape:zoom="14.75"
   inkscape:cx="-16"
   inkscape:cy="8"
   inkscape:window-x="1151"
   inkscape:window-y="0"
   inkscape:window-maximized="1"
   inkscape:current-layer="g852"
   inkscape:pagecheckerboard="0" />
<style
   type="text/css"
   id="style2">
	.st0{fill:#d44c5f;}
</style>

<g
   id="g852"
   transform="matrix(0.12768736,0,0,0.12768736,-3.2836109,-1.6951186)"><path
     sodipodi:nodetypes="scccsscscccsssccscscssssssssssccscssscssssscc"
     inkscape:connector-curvature="0"
     id="path837"
     d="m 85.084214,120.45729 c 0,-0.13803 -0.254104,-0.25235 -0.564675,-0.25404 -0.746605,-0.004 -4.250302,-1.54395 -5.531505,-2.43113 -1.595529,-1.10485 -3.39508,-2.80502 -4.186475,-3.95527 -0.914013,-1.32847 -7.253793,-14.013094 -15.966568,-31.945864 -1.290981,-2.657116 -2.465179,-4.831132 -2.609319,-4.831132 -0.388427,0 -5.390609,2.544221 -7.94348,4.040239 -2.988621,1.751356 -7.260835,4.67706 -9.944643,6.810279 -1.274117,1.012727 -2.349979,1.690981 -2.556552,1.611711 -0.429271,-0.164733 -6.765982,-7.375931 -6.840044,-7.784011 -0.06061,-0.333678 1.917084,-2.008571 5.89471,-4.992298 2.985491,-2.239493 8.491082,-5.605264 13.419031,-8.203532 1.621879,-0.855137 2.948868,-1.65487 2.948868,-1.777175 0,-0.231311 -1.735069,-3.86917 -6.521136,-13.672632 -1.549914,-3.174744 -3.043048,-6.336939 -3.318077,-7.027106 -0.71555,-1.795614 -0.857528,-4.633019 -0.332207,-6.639513 0.562645,-2.149087 0.958433,-2.864429 2.467948,-4.460518 4.139656,-4.377075 9.912488,-5.019653 14.800949,-1.647528 1.000767,0.690338 3.442469,3.886424 8.971802,11.743691 11.149219,15.843214 10.222846,14.67042 11.47194,14.523653 2.663491,-0.312952 10.609171,-0.484353 14.348211,-0.309509 16.549838,0.773895 32.884168,6.399685 46.702208,16.084959 5.55624,3.894448 8.84149,6.71865 7.81546,6.71865 -0.11853,0 -1.70813,1.694035 -3.53244,3.764517 -1.82431,2.070482 -3.41556,3.764518 -3.53611,3.764518 -0.12055,0 -1.34574,-0.897499 -2.72264,-1.994429 -7.79276,-6.208231 -16.1565,-10.694141 -25.69633,-13.782293 -5.21516,-1.688201 -11.53625,-2.879501 -18.756987,-3.535037 -4.417635,-0.401052 -8.030965,-0.288014 -8.030965,0.251249 0,0.109083 1.546101,2.381253 3.435782,5.049258 8.837043,12.476894 13.68738,19.553484 14.50582,21.16383 2.41591,4.753523 2.03219,11.657773 -0.90006,16.194533 -1.24112,1.92024 -3.446642,4.07746 -5.340136,5.22316 -1.690535,1.0229 -4.097882,2.03378 -4.862538,2.04184 -0.310571,0.003 -0.564675,0.1189 -0.564675,0.25693 0,0.15444 -1.254842,0.25096 -3.262579,0.25096 -2.007745,0 -3.262588,-0.0965 -3.262588,-0.25096 z m 6.117504,-11.63845 c 2.054081,-1.20377 3.411935,-4.37913 2.654991,-6.20877 C 93.234998,101.10729 90.403246,96.964199 76.894379,77.792758 75.095028,75.239165 69.331671,67.051341 64.086933,59.597592 52.329374,42.887953 51.7055,42.018247 51.7055,42.337487 c 0,0.360739 4.389141,9.311227 24.775174,50.52238 4.040381,8.167793 7.366047,14.584253 7.837139,15.120793 1.531124,1.74385 4.683529,2.12769 6.883905,0.83818 z"
     style="fill:#d44c5f;stroke:#ffffff;stroke-width:5.87372156;stroke-miterlimit:4;stroke-dasharray:none;stroke-opacity:1" /></g></svg>
