{
  "LANGUAGE":"nl",
  "TITLE":"Bankieren",
  "PROGRESS_DETAILS":"Details",
  "PROGRESS_AMOUNT":"Hoeveelheid",
  "PROGRESS_REVIEW":"Beoordeling",
  "PROGRESS_TRANSACT":"Transactie",
  "SELECT_METHOD_A":"Selecteer de gewenste valuta die u wilt ",
  "SELECT_METHOD_B":" en kies vervolgens uw bankmethode.",
  "ACTION_DEPOSIT":"storten",
  "ACTION_WITHDRAW":"opnemen",
  "ACTION_TRANSFER":"overmaken",
  "BUTTON_BACK":"Terug",
  "BUTTON_NEXT":"Volgende",
  "BANK_ACCOUNT":"bankrekening"
}
