<?xml version="1.0" encoding="UTF-8" standalone="no"?>
<svg
   width="64"
   height="64"
   viewBox="0 0 64 64"
   version="1.1"
   id="svg10"
   sodipodi:docname="app-banking.svg"
   inkscape:version="1.1.2 (0a00cf5339, 2022-02-04)"
   xmlns:inkscape="http://www.inkscape.org/namespaces/inkscape"
   xmlns:sodipodi="http://sodipodi.sourceforge.net/DTD/sodipodi-0.dtd"
   xmlns="http://www.w3.org/2000/svg"
   xmlns:svg="http://www.w3.org/2000/svg"
   xmlns:rdf="http://www.w3.org/1999/02/22-rdf-syntax-ns#"
   xmlns:cc="http://creativecommons.org/ns#"
   xmlns:dc="http://purl.org/dc/elements/1.1/">
  <metadata
     id="metadata16">
    <rdf:RDF>
      <cc:Work
         rdf:about="">
        <dc:format>image/svg+xml</dc:format>
        <dc:type
           rdf:resource="http://purl.org/dc/dcmitype/StillImage" />
      </cc:Work>
    </rdf:RDF>
  </metadata>
  <defs
     id="defs14" />
  <sodipodi:namedview
     pagecolor="#ffffff"
     bordercolor="#666666"
     borderopacity="1"
     objecttolerance="10"
     gridtolerance="10"
     guidetolerance="10"
     inkscape:pageopacity="0"
     inkscape:pageshadow="2"
     inkscape:window-width="1920"
     inkscape:window-height="1044"
     id="namedview12"
     showgrid="false"
     inkscape:zoom="5.6568542"
     inkscape:cx="44.724504"
     inkscape:cy="10.429825"
     inkscape:window-x="1151"
     inkscape:window-y="0"
     inkscape:window-maximized="1"
     inkscape:current-layer="g826"
     inkscape:pagecheckerboard="0" />
  <g
     id="g826"
     transform="matrix(0.12413231,0,0,0.12413231,30.191667,29.174933)">
    <circle
       style="fill:#ecdf78;stroke-width:114.465;fill-opacity:1"
       id="path1430"
       cx="14.567786"
       cy="22.758514"
       r="255.50157" />
    <path
       style="fill:#af6e3f;fill-opacity:1;stroke-width:0.709241"
       d="m -138.21452,176.48216 c -3.27814,-3.1904 -3.93411,-6.67506 -3.44249,-18.28739 0.27073,-6.39455 0.56359,-7.86381 1.944,-9.75044 3.40301,-4.65114 -9.26322,-4.29953 154.787874,-4.29666 146.545336,0.002 149.072186,0.0257 151.335346,1.36836 3.98016,2.36186 4.5282,4.31311 4.5282,16.12106 0,11.80797 -0.54786,13.75922 -4.5282,16.12108 -2.26332,1.34303 -4.79624,1.3658 -152.103211,1.36836 l -149.801599,0.002 z m 28.77057,-51.00207 c -0.59325,-0.22243 -1.80631,-1.0492 -2.69601,-1.83692 l -1.61758,-1.43235 V 58.723717 -4.7634292 l 2.26062,-1.851258 2.26062,-1.8512569 14.338426,0.2147506 14.338416,0.2147515 1.733659,1.9631426 1.733659,1.9631631 V 58.783443 121.67706 l -1.733599,1.96314 -1.73364,1.96314 -13.903094,0.14115 c -7.646687,0.0771 -14.388347,-0.0416 -14.981477,-0.26398 z m 54.279171,-0.31258 c -3.352387,-1.83634 -3.235208,0.57272 -3.235208,-66.517752 0,-62.3318443 0.02728,-63.5637935 1.419527,-64.919154 2.120339,-2.0635807 3.604446,-2.2255351 18.204817,-1.9865357 12.846443,0.210273 13.478693,0.286442 15.045719,1.8132533 l 1.635771,1.5936833 V 58.783443 122.4159 l -1.635851,1.59369 c -1.578134,1.53739 -2.137022,1.59994 -15.816451,1.76963 -9.498535,0.11706 -14.655257,-0.0834 -15.618383,-0.61171 z M -0.24718315,124.904 C -1.2800485,124.35776 -2.4986389,123.03216 -2.9552967,121.95837 -3.566981,120.52023 -3.734888,103.56119 -3.5940762,57.578369 l 0.1917175,-62.4276028 1.6358496,-1.5935443 c 1.56692685,-1.5264931 2.19975286,-1.6028413 15.0457391,-1.8130731 14.600388,-0.2389602 16.084477,-0.077044 18.204816,1.9865146 1.39259,1.3552216 1.419526,2.5861549 1.419526,64.6458126 0,34.795344 -0.200636,63.773944 -0.446326,64.396894 -1.047776,2.65756 -3.982786,3.18107 -17.670696,3.15191 -9.9578999,-0.0209 -13.6126756,-0.26943 -15.03397207,-1.02129 z m 55.69469715,0.3554 c -4.039764,-1.58663 -3.851331,1.67148 -3.851331,-66.5926 V -4.1101363 l 1.733559,-1.9631429 1.733541,-1.9631427 13.491952,-0.2195692 C 83.450267,-8.4983152 84.69,-8.3555332 86.80377,-6.1468606 c 1.4423,1.506605 1.457869,2.2011475 1.457869,65.0000216 v 63.477169 l -2.211978,1.8114 c -2.211739,1.81126 -2.213112,1.8114 -15.636679,1.7671 -7.383611,-0.0242 -14.11805,-0.31661 -14.965409,-0.64939 z m 55.357486,0.0209 c -4.04199,-1.64315 -3.85124,1.65999 -3.85124,-66.706655 V -4.2960927 l 2.1015,-2.0452251 2.10149,-2.0452249 h 14.12964 14.12976 l 2.1015,2.0452249 2.10148,2.0452251 V 58.690378 121.67681 l -1.7336,1.96317 -1.73363,1.96316 -13.90315,0.1523 c -7.64664,0.0834 -14.59638,-0.12981 -15.44375,-0.47459 z M -136.54864,-27.949096 c -1.26587,-0.751223 -2.86993,-2.403019 -3.5645,-3.670724 -1.71647,-3.132757 -1.75261,-10.124832 -0.0657,-12.631114 1.99447,-2.962443 104.380681,-86.026576 108.218315,-87.795606 l 3.395669,-1.56529 h 43.495235 43.495136 l 3.381495,1.56529 c 2.953204,1.36704 104.97138,83.735218 107.75644,87.001163 0.62322,0.730696 1.09796,3.240065 1.23091,6.504916 0.17937,4.403968 -0.0416,5.712544 -1.27342,7.63149 -2.99332,4.652284 8.51293,4.331201 -155.106765,4.328314 -146.176345,-0.002 -148.700105,-0.02568 -150.963265,-1.36852 z M 98.326565,-54.06852 c 2.221005,-1.089624 2.692125,-3.659255 1.003822,-5.474857 -2.627508,-2.825653 -55.098126,-44.417773 -57.935604,-45.924133 -2.903971,-1.54162 -3.45183,-1.57421 -26.397384,-1.57039 -13.0915541,0.002 -24.5422815,0.30637 -25.94809,0.68934 -2.775643,0.75615 -58.832375,45.885497 -59.943002,48.258074 -0.842959,1.800671 -0.121839,3.417449 1.873515,4.197179 0.949609,0.371112 35.949952,0.652736 83.591419,0.672466 64.549635,0.02728 82.339746,-0.153892 83.755288,-0.847758 z"
       id="path823"
       inkscape:connector-curvature="0" />
  </g>
  <style
     type="text/css"
     id="style4199">
	.st0{fill:#ADACAC;}
</style>
</svg>
