<?xml version="1.0" encoding="UTF-8" standalone="no"?>
<svg
   width="20px"
   height="20px"
   viewBox="0 0 20 20"
   version="1.1"
   id="svg10"
   sodipodi:docname="makepass.svg"
   inkscape:version="1.1.2 (0a00cf5339, 2022-02-04)"
   xmlns:inkscape="http://www.inkscape.org/namespaces/inkscape"
   xmlns:sodipodi="http://sodipodi.sourceforge.net/DTD/sodipodi-0.dtd"
   xmlns="http://www.w3.org/2000/svg"
   xmlns:svg="http://www.w3.org/2000/svg"
   xmlns:rdf="http://www.w3.org/1999/02/22-rdf-syntax-ns#"
   xmlns:cc="http://creativecommons.org/ns#"
   xmlns:dc="http://purl.org/dc/elements/1.1/">
  <metadata
     id="metadata16">
    <rdf:RDF>
      <cc:Work
         rdf:about="">
        <dc:format>image/svg+xml</dc:format>
        <dc:type
           rdf:resource="http://purl.org/dc/dcmitype/StillImage" />
      </cc:Work>
    </rdf:RDF>
  </metadata>
  <defs
     id="defs14" />
  <sodipodi:namedview
     pagecolor="#ffffff"
     bordercolor="#666666"
     borderopacity="1"
     objecttolerance="10"
     gridtolerance="10"
     guidetolerance="10"
     inkscape:pageopacity="0"
     inkscape:pageshadow="2"
     inkscape:window-width="1152"
     inkscape:window-height="684"
     id="namedview12"
     showgrid="false"
     inkscape:zoom="11.313709"
     inkscape:cx="9.0598056"
     inkscape:cy="7.2478444"
     inkscape:window-x="0"
     inkscape:window-y="0"
     inkscape:window-maximized="1"
     inkscape:current-layer="svg10"
     inkscape:pagecheckerboard="0" />
  <g
     id="g2701"
     transform="matrix(1.0767102,0,0,1.0767102,-28.771441,-37.202653)">
    <path
       id="rect1756"
       style="opacity:1;fill:#000000;stroke:#020202;stroke-width:0.0410328;stroke-opacity:1"
       d="m 102.44336,143.46484 c -0.79047,0 -1.42774,0.63727 -1.42774,1.42774 v 41.60351 c 1e-5,0.79048 0.63727,1.42579 1.42774,1.42579 h 67.30859 c 0.79047,-10e-6 1.42774,-0.63531 1.42774,-1.42579 v -41.60351 c 0,-0.79047 -0.63727,-1.42774 -1.42774,-1.42774 z m 39.94531,5.29493 h 22.68555 c 0.79047,0 1.42578,0.63531 1.42578,1.42578 V 153 c 0,0.79047 -0.63531,1.42773 -1.42578,1.42773 h -22.68555 c -0.79047,0 -1.42773,-0.63726 -1.42773,-1.42773 v -2.81445 c 0,-0.79047 0.63726,-1.42578 1.42773,-1.42578 z m -34.94922,0.0293 h 27.74219 c 0.68733,0 1.24024,0.55291 1.24024,1.24024 v 31.32812 c 0,0.68733 -0.55291,1.24024 -1.24024,1.24024 h -27.74219 c -0.68732,0 -1.24023,-0.55291 -1.24023,-1.24024 V 150.0293 c 0,-0.68733 0.55291,-1.24024 1.24023,-1.24024 z m 34.66407,12.24414 h 22.68554 c 0.79047,0 1.42774,0.63532 1.42774,1.42578 v 2.81446 c 0,0.79047 -0.63727,1.42773 -1.42774,1.42773 h -22.68554 c -0.79047,0 -1.42579,-0.63726 -1.42579,-1.42773 v -2.81446 c 0,-0.79046 0.63532,-1.42578 1.42579,-1.42578 z m 0,8 h 22.68554 c 0.79047,0 1.42774,0.63532 1.42774,1.42578 v 2.81446 c 0,0.79047 -0.63727,1.42773 -1.42774,1.42773 h -22.68554 c -0.79047,0 -1.42579,-0.63726 -1.42579,-1.42773 v -2.81446 c 0,-0.79046 0.63532,-1.42578 1.42579,-1.42578 z m 0,8 h 22.68554 c 0.79047,0 1.42774,0.63532 1.42774,1.42578 v 2.81446 c 0,0.79047 -0.63727,1.42773 -1.42774,1.42773 h -22.68554 c -0.79047,0 -1.42579,-0.63726 -1.42579,-1.42773 v -2.81446 c 0,-0.79046 0.63532,-1.42578 1.42579,-1.42578 z"
       transform="scale(0.26458333)" />
    <path
       style="fill:#000000;stroke-width:0.0809521"
       d="m 28.657662,46.084775 v -1.133334 h 1.133334 1.133333 v 1.133334 1.133333 h -1.133333 -1.133334 z m 1.942857,0 v -0.809524 h -0.809523 -0.809524 v 0.809524 0.809524 h 0.809524 0.809523 z m -1.295239,0 v -0.485714 h 0.485716 0.485714 v 0.485714 0.485715 H 29.790996 29.30528 Z m 1.942858,0.971428 c 0,-0.107935 0.05397,-0.161904 0.161905,-0.161904 0.107937,0 0.161905,0.05397 0.161905,0.161904 0,0.107937 -0.05396,0.161905 -0.161905,0.161905 -0.107936,0 -0.161905,-0.05396 -0.161905,-0.161905 z m 0.971428,0 c 0,-0.107935 -0.05396,-0.161904 -0.161905,-0.161904 -0.13492,0 -0.161904,-0.05396 -0.161904,-0.323809 0,-0.269843 -0.02698,-0.32381 -0.161904,-0.32381 -0.107938,0 -0.161905,0.05397 -0.161905,0.161905 0,0.107936 -0.05396,0.161905 -0.161905,0.161905 -0.148413,0 -0.161905,-0.05397 -0.161905,-0.64762 0,-0.593651 0.01349,-0.647619 0.161905,-0.647619 0.107937,0 0.161905,-0.05396 0.161905,-0.161905 0,-0.107936 -0.05396,-0.161905 -0.161905,-0.161905 -0.107936,0 -0.161905,-0.05397 -0.161905,-0.161903 0,-0.134922 -0.05398,-0.161906 -0.323809,-0.161906 -0.269841,0 -0.32381,-0.02698 -0.32381,-0.161904 0,-0.107937 -0.05396,-0.161906 -0.161905,-0.161906 -0.107936,0 -0.161904,0.05398 -0.161904,0.161906 0,0.13492 -0.05397,0.161904 -0.32381,0.161904 -0.269842,0 -0.323809,-0.02698 -0.323809,-0.161904 0,-0.107937 -0.05397,-0.161906 -0.161905,-0.161906 -0.107936,0 -0.161906,-0.05396 -0.161906,-0.161905 0,-0.107935 0.05397,-0.161905 0.161906,-0.161905 0.107936,0 0.161905,0.05398 0.161905,0.161905 0,0.107937 0.05397,0.161905 0.161905,0.161905 0.13492,0 0.161904,-0.05396 0.161904,-0.32381 0,-0.269841 0.02699,-0.323809 0.161906,-0.323809 0.107936,0 0.161904,-0.05397 0.161904,-0.161904 0,-0.143917 -0.05397,-0.161905 -0.485714,-0.161905 -0.431746,0 -0.485716,-0.01799 -0.485716,-0.161905 0,-0.151111 0.05397,-0.161905 0.809526,-0.161905 0.755554,0 0.809523,0.0108 0.809523,0.161905 0,0.107937 -0.05397,0.161905 -0.161905,0.161905 -0.107936,0 -0.161905,0.05396 -0.161905,0.161905 0,0.134921 0.05398,0.161904 0.32381,0.161904 0.269841,0 0.323809,-0.02698 0.323809,-0.161904 0,-0.107938 0.05397,-0.161905 0.161905,-0.161905 0.134921,0 0.161905,0.05396 0.161905,0.323809 v 0.323809 h 0.323809 c 0.269841,0 0.323809,-0.02698 0.323809,-0.161905 0,-0.107936 -0.05396,-0.161904 -0.161905,-0.161904 -0.107936,0 -0.161904,-0.05397 -0.161904,-0.161904 0,-0.107938 0.05397,-0.161905 0.161904,-0.161905 0.107937,0 0.161905,0.05396 0.161905,0.161905 0,0.107936 0.05397,0.161904 0.161905,0.161904 0.134921,0 0.161905,-0.05397 0.161905,-0.323809 0,-0.269841 -0.02698,-0.32381 -0.161905,-0.32381 -0.107935,0 -0.161905,-0.05398 -0.161905,-0.161903 0,-0.107938 -0.05396,-0.161906 -0.161905,-0.161906 -0.143914,0 -0.161904,-0.05397 -0.161904,-0.485715 0,-0.431746 -0.01799,-0.485714 -0.161904,-0.485714 -0.148414,0 -0.161905,0.05396 -0.161905,0.647619 0,0.593651 -0.01349,0.647619 -0.161905,0.647619 -0.15291,0 -0.161905,-0.05398 -0.161905,-0.971428 v -0.97143 h 0.32381 0.323809 v -0.323808 c 0,-0.269842 0.02698,-0.32381 0.161904,-0.32381 0.134922,0 0.161905,0.05397 0.161905,0.32381 v 0.323808 h 0.32381 c 0.269841,0 0.32381,0.02699 0.32381,0.161906 0,0.107936 -0.05397,0.161905 -0.161904,0.161905 -0.107937,0 -0.161906,0.05397 -0.161906,0.161905 0,0.107935 0.05398,0.161904 0.161906,0.161904 0.152909,0 0.161904,0.05396 0.161904,0.971429 0,0.91746 0.009,0.971428 0.161906,0.971428 0.107936,0 0.161903,0.05397 0.161903,0.161904 0,0.107937 -0.05396,0.161905 -0.161903,0.161905 -0.107938,0 -0.161906,-0.05397 -0.161906,-0.161905 0,-0.107936 -0.05397,-0.161904 -0.161904,-0.161904 -0.107937,0 -0.161906,0.05397 -0.161906,0.161904 0,0.107937 -0.05397,0.161905 -0.161905,0.161905 -0.107935,0 -0.161905,0.05398 -0.161905,0.161905 0,0.107937 0.05397,0.161905 0.161905,0.161905 0.107937,0 0.161905,0.05398 0.161905,0.161906 0,0.107935 0.05398,0.161904 0.161906,0.161904 0.107935,0 0.161904,-0.05398 0.161904,-0.161904 0,-0.107937 0.05397,-0.161906 0.161906,-0.161906 0.107936,0 0.161903,0.05398 0.161903,0.161906 0,0.107935 0.05397,0.161904 0.161905,0.161904 0.107937,0 0.161905,0.05396 0.161905,0.161906 0,0.107936 0.05396,0.161903 0.161905,0.161903 0.107936,0 0.161905,0.05397 0.161905,0.161905 0,0.107937 -0.05397,0.161905 -0.161905,0.161905 -0.107937,0 -0.161905,0.05397 -0.161905,0.161905 0,0.107936 0.05396,0.161905 0.161905,0.161905 0.13492,0 0.161905,0.05398 0.161905,0.323809 0,0.269841 0.02698,0.32381 0.161903,0.32381 0.107938,0 0.161906,-0.05398 0.161906,-0.161905 0,-0.107936 0.05397,-0.161905 0.161905,-0.161905 0.134921,0 0.161905,0.05397 0.161905,0.32381 0,0.269841 0.02698,0.32381 0.161905,0.32381 0.107936,0 0.161905,0.05396 0.161905,0.161903 0,0.107938 0.05397,0.161906 0.161903,0.161906 0.107938,0 0.161906,0.05397 0.161906,0.161904 0,0.134921 -0.05397,0.161905 -0.323809,0.161905 h -0.32381 v -0.323809 c 0,-0.269841 -0.02698,-0.323809 -0.161905,-0.323809 -0.13492,0 -0.161905,0.05396 -0.161905,0.323809 0,0.269841 -0.02698,0.323809 -0.161906,0.323809 -0.107935,0 -0.161903,-0.05396 -0.161903,-0.161905 0,-0.107935 -0.05397,-0.161904 -0.161905,-0.161904 -0.107937,0 -0.161905,-0.05396 -0.161905,-0.161906 0,-0.107935 0.05396,-0.161903 0.161905,-0.161903 0.107936,0 0.161905,-0.05397 0.161905,-0.161905 0,-0.107938 -0.05397,-0.161905 -0.161905,-0.161905 -0.134921,0 -0.161905,-0.05398 -0.161905,-0.32381 v -0.323809 h -0.32381 -0.323809 v 0.323809 c 0,0.269841 0.02699,0.32381 0.161906,0.32381 0.107936,0 0.161903,0.05397 0.161903,0.161905 0,0.107936 -0.05396,0.161905 -0.161903,0.161905 -0.107938,0 -0.161906,-0.05397 -0.161906,-0.161905 0,-0.107938 -0.05397,-0.161905 -0.161904,-0.161905 -0.107937,0 -0.161906,0.05397 -0.161906,0.161905 0,0.107936 -0.05397,0.161905 -0.161905,0.161905 -0.107935,0 -0.161905,0.05396 -0.161905,0.161903 0,0.107938 0.05397,0.161906 0.161905,0.161906 0.107937,0 0.161905,0.05397 0.161905,0.161904 0,0.107937 -0.05397,0.161905 -0.161905,0.161905 -0.107935,0 -0.161905,-0.05396 -0.161905,-0.161905 z m 0.32381,-1.133333 v -0.323809 h -0.485715 c -0.431746,0 -0.485713,0.01799 -0.485713,0.161903 0,0.107938 0.05397,0.161906 0.161905,0.161906 0.107936,0 0.161904,0.05397 0.161904,0.161905 0,0.134921 0.05397,0.161905 0.323809,0.161905 h 0.32381 z m 0,-0.809524 c 0,-0.107936 -0.05397,-0.161905 -0.161905,-0.161905 -0.107935,0 -0.161905,0.05397 -0.161905,0.161905 0,0.107937 0.05397,0.161905 0.161905,0.161905 0.107937,0 0.161905,-0.05396 0.161905,-0.161905 z m 0.647619,0 c 0,-0.107936 -0.05396,-0.161905 -0.161903,-0.161905 -0.107938,0 -0.161906,0.05397 -0.161906,0.161905 0,0.107937 0.05397,0.161905 0.161906,0.161905 0.107936,0 0.161903,-0.05396 0.161903,-0.161905 z m -1.619047,-0.647618 c 0,-0.107937 -0.05396,-0.161906 -0.161905,-0.161906 -0.107936,0 -0.161905,-0.05396 -0.161905,-0.161905 0,-0.13492 -0.05398,-0.161905 -0.323809,-0.161905 -0.269841,0 -0.32381,-0.02698 -0.32381,-0.161905 0,-0.107936 -0.05396,-0.161904 -0.161905,-0.161904 -0.107936,0 -0.161904,0.05397 -0.161904,0.161904 0,0.107937 0.05397,0.161905 0.161904,0.161905 0.107938,0 0.161905,0.05398 0.161905,0.161905 0,0.134921 0.05398,0.161905 0.32381,0.161905 0.269841,0 0.323809,0.02699 0.323809,0.161906 0,0.107935 0.05397,0.161904 0.161905,0.161904 0.107937,0 0.161905,-0.05398 0.161905,-0.161904 z m 0.647618,0 c 0,-0.107937 -0.05396,-0.161906 -0.161905,-0.161906 -0.107936,0 -0.161904,0.05398 -0.161904,0.161906 0,0.107935 0.05397,0.161904 0.161904,0.161904 0.107937,0 0.161905,-0.05398 0.161905,-0.161904 z m 0.32381,-2.104763 c 0,-0.269841 -0.02698,-0.323809 -0.161905,-0.323809 -0.13492,0 -0.161905,0.05397 -0.161905,0.323809 0,0.269841 0.02699,0.32381 0.161905,0.32381 0.134921,0 0.161905,-0.05397 0.161905,-0.32381 z m -0.32381,-0.971428 c 0,-0.269841 -0.02698,-0.323811 -0.161905,-0.323811 -0.13492,0 -0.161904,0.05398 -0.161904,0.323811 0,0.26984 0.02698,0.323809 0.161904,0.323809 0.134922,0 0.161905,-0.05398 0.161905,-0.323809 z m 0.64762,5.666666 c 0,-0.107935 0.05397,-0.161904 0.161906,-0.161904 0.107936,0 0.161903,0.05397 0.161903,0.161904 0,0.107937 -0.05396,0.161905 -0.161903,0.161905 -0.107938,0 -0.161906,-0.05396 -0.161906,-0.161905 z m 1.942858,-1.295239 c 0,-0.13492 -0.05397,-0.161903 -0.32381,-0.161903 h -0.32381 v -0.485715 c 0,-0.431746 -0.01799,-0.485714 -0.161906,-0.485714 -0.107935,0 -0.161903,-0.05398 -0.161903,-0.161904 0,-0.107937 -0.05397,-0.161906 -0.161905,-0.161906 -0.107937,0 -0.161905,-0.05396 -0.161905,-0.161905 0,-0.107935 0.05396,-0.161905 0.161905,-0.161905 0.107936,0 0.161905,-0.05397 0.161905,-0.161905 0,-0.107936 -0.05397,-0.161904 -0.161905,-0.161904 -0.107937,0 -0.161905,-0.05397 -0.161905,-0.161904 0,-0.107938 -0.05397,-0.161905 -0.161905,-0.161905 -0.107936,0 -0.161905,-0.05396 -0.161905,-0.161905 0,-0.151111 0.05397,-0.161905 0.809523,-0.161905 0.755557,0 0.809526,0.0108 0.809526,0.161905 0,0.107937 -0.05397,0.161905 -0.161905,0.161905 -0.134921,0 -0.161905,0.05396 -0.161905,0.323809 0,0.269841 0.02698,0.323809 0.161905,0.323809 0.107936,0 0.161905,-0.05397 0.161905,-0.161905 0,-0.107936 0.05397,-0.161904 0.161903,-0.161904 0.107938,0 0.161906,-0.05397 0.161906,-0.161904 0,-0.107938 0.05397,-0.161905 0.161904,-0.161905 0.107937,0 0.161905,0.05396 0.161905,0.161905 0,0.107936 -0.05396,0.161904 -0.161905,0.161904 -0.107935,0 -0.161904,0.05397 -0.161904,0.161904 0,0.107937 -0.05397,0.161905 -0.161906,0.161905 -0.107935,0 -0.161903,0.05398 -0.161903,0.161905 0,0.134921 0.05397,0.161905 0.323809,0.161905 h 0.323809 v 0.32381 c 0,0.269842 -0.02698,0.323809 -0.161905,0.323809 -0.107935,0 -0.161904,0.05397 -0.161904,0.161905 0,0.107937 -0.05397,0.161905 -0.161906,0.161905 -0.107935,0 -0.161903,0.05397 -0.161903,0.161905 0,0.107936 0.05397,0.161905 0.161903,0.161905 0.107938,0 0.161906,0.05398 0.161906,0.161903 0,0.107938 -0.05397,0.161906 -0.161906,0.161906 -0.107935,0 -0.161903,-0.05398 -0.161903,-0.161906 z m 0,-0.647618 c 0,-0.107936 0.05397,-0.161905 0.161903,-0.161905 0.107938,0 0.161906,-0.05397 0.161906,-0.161903 0,-0.107938 -0.05397,-0.161906 -0.161906,-0.161906 -0.107935,0 -0.161903,-0.05398 -0.161903,-0.161904 0,-0.134921 -0.05397,-0.161906 -0.32381,-0.161906 -0.269841,0 -0.32381,0.02699 -0.32381,0.161906 0,0.13492 0.05397,0.161904 0.32381,0.161904 0.269841,0 0.32381,0.02698 0.32381,0.161906 0,0.107936 -0.05397,0.161903 -0.161905,0.161903 -0.107938,0 -0.161905,0.05397 -0.161905,0.161905 0,0.107937 0.05396,0.161905 0.161905,0.161905 0.107936,0 0.161905,-0.05396 0.161905,-0.161905 z m -0.64762,-1.619047 c 0,-0.107938 -0.05398,-0.161905 -0.161906,-0.161905 -0.107935,0 -0.161903,0.05396 -0.161903,0.161905 0,0.107936 0.05398,0.161904 0.161903,0.161904 0.107938,0 0.161906,-0.05397 0.161906,-0.161904 z m -5.504762,-0.161905 c 0,-0.269841 0.02698,-0.32381 0.161905,-0.32381 0.134921,0 0.161905,0.05397 0.161905,0.32381 0,0.269841 -0.02698,0.323809 -0.161905,0.323809 -0.134921,0 -0.161905,-0.05397 -0.161905,-0.323809 z m 0,-1.780952 v -1.133334 h 1.133334 1.133333 v 1.133334 1.133333 h -1.133333 -1.133334 z m 1.942857,0 v -0.809524 h -0.809523 -0.809524 v 0.809524 0.809523 h 0.809524 0.809523 z m -1.295239,0 v -0.485716 h 0.485716 0.485714 v 0.485716 0.485714 H 29.790996 29.30528 Z m 3.885715,0 v -1.133334 h 1.133334 1.133333 v 1.133334 1.133333 h -1.133333 -1.133334 z m 1.942858,0 v -0.809524 h -0.809524 -0.809524 v 0.809524 0.809523 h 0.809524 0.809524 z m -1.295238,0 v -0.485716 h 0.485714 0.485715 v 0.485716 0.485714 h -0.485715 -0.485714 z m -1.295239,-0.971429 c 0,-0.107937 0.05398,-0.161905 0.161906,-0.161905 0.107935,0 0.161904,0.05397 0.161904,0.161905 0,0.107936 -0.05397,0.161905 -0.161904,0.161905 -0.107937,0 -0.161906,-0.05397 -0.161906,-0.161905 z"
       id="path2800" />
  </g>
</svg>
