{
  "LANGUAGE":"nl",
  "CREATE_NEW":"Maak een nieuwe portemonnee",
  "INSTRUCTIONS":"Om uw portemonnee te beveiligen, genereren we willekeurige getallen op basis van uw bewegingen. Veeg eenvoudig in elke richting of beweeg uw muis binnen dit scherm totdat u 100% bereikt. U zult stippen zien verschijnen terwijl u beweegt.",
  "TEXTBOX_INPUT":"Gevorderde gebruikers: tekstvakinvoer",
  "FAILURE_TITLE":"Mislukking",
  "FAILURE_TEXT":"Kan geen nieuwe wallet aanmaken!"
}
