<?xml version="1.0" encoding="utf-8"?>
<!-- Generator: Adobe Adobe Illustrator 24.2.0, SVG Export Plug-In . SVG Version: 6.00 Build 0)  -->
<svg version="1.1" id="Layer_1" xmlns="http://www.w3.org/2000/svg" xmlns:xlink="http://www.w3.org/1999/xlink" x="0px" y="0px"
	 viewBox="0 0 841.89 595.28" style="enable-background:new 0 0 841.89 595.28;" xml:space="preserve">
<style type="text/css">
	.st0{fill:#ADACAC;}
</style>
<g>
	<path class="st0" d="M497.71,107.58L289.67,3.56c-7.31-3.66-15.95-3.66-23.26,0L58.37,107.58C49.56,112,44,120.99,44,130.84v260.05
		c0,9.85,5.56,18.84,14.37,23.26l208.04,104.02c3.66,1.83,7.64,2.74,11.63,2.74c3.99,0,7.97-0.91,11.63-2.74l208.04-104.02
		c8.81-4.42,14.37-13.41,14.37-23.26V130.84C512.08,120.99,506.52,112,497.71,107.58z M252.04,452.83L96.01,374.81V172.92
		l156.03,78.01V452.83z M278.04,205.78l-149.88-74.94L278.04,55.9l149.88,74.94L278.04,205.78z"/>
</g>
<path class="st0" d="M819.88,525.96L414.58,297.87c-2.18-1.23-4.94-0.45-6.17,1.73l-33.78,60.03c-1.23,2.18-0.45,4.94,1.73,6.17
	l405.29,228.09c2.18,1.23,4.94,0.45,6.17-1.73l33.78-60.03C822.83,529.94,822.06,527.18,819.88,525.96z"/>
</svg>
