<?xml version="1.0" encoding="UTF-8"?>
<svg width="20px" height="20px" viewBox="0 0 20 20" version="1.1" xmlns="http://www.w3.org/2000/svg" xmlns:xlink="http://www.w3.org/1999/xlink">
    <g stroke="none" stroke-width="1" fill="none" fill-rule="evenodd">
        <g transform="translate(-329.000000, -213.000000)" fill-rule="nonzero" fill="#63bbbb">
            <g transform="translate(329.000000, 213.000000)">
                <path d="M15.0400385,11.0015769 L15.0400385,9.02942147 L11.0025785,9.02942147 L11.0025785,4.99196154 L9.03042308,4.99196154 L9.03042308,9.02942147 L4.99296314,9.02942147 L4.99296314,11.0015769 L9.03042308,11.0015769 L9.03042308,15.0390369 L11.0025785,15.0390369 L11.0025785,11.0015769 L15.0400385,11.0015769 Z M10.016,0.016 C15.5558638,0.016 20.016,4.47613622 20.016,10.016 C20.016,15.5558638 15.5558638,20.016 10.016,20.016 C4.47613622,20.016 0.016,15.5558638 0.016,10.016 C0.016,4.47613622 4.47613622,0.016 10.016,0.016 Z"></path>
            </g>
        </g>
    </g>
</svg>
