<svg xmlns="http://www.w3.org/2000/svg" width="40.617" height="40.617" viewBox="0 0 40.617 40.617">
  <g id="Icon_feather-search" data-name="Icon feather-search" transform="translate(1.25 1.25)">
    <path id="Path_1" data-name="Path 1" d="M37.921,21.211A16.711,16.711,0,1,1,21.211,4.5,16.711,16.711,0,0,1,37.921,21.211Z" transform="translate(-4.5 -4.5)" fill="none" stroke="#0c3c66" stroke-linecap="round" stroke-linejoin="round" stroke-width="2.5"/>
    <path id="Path_2" data-name="Path 2" d="M34.061,34.061l-9.086-9.086" transform="translate(3.538 3.537)" fill="none" stroke="#0c3c66" stroke-linecap="round" stroke-linejoin="round" stroke-width="2.5"/>
  </g>
</svg>
