// Jest Snapshot v1, https://goo.gl/fbAQLP

exports[`Strip component should render Strip component with success 1`] = `
"<Strip>
  <styled.div>
    <div className=\\"sc-bdvvtL ijkJSC\\" />
  </styled.div>
</Strip>"
`;
