// Jest Snapshot v1, https://goo.gl/fbAQLP

exports[`Drawer component should be able to render Drawer component with success 1`] = `
"<BrowserRouter>
  <Router history={{...}}>
    <Drawer>
      <Header>
        <styled.div>
          <div className=\\"sc-eCImPb cYWSfH\\">
            <div>
              <HeaderImage>
                <styled.div>
                  <div className=\\"sc-gKclnd bIWEPW\\" />
                </styled.div>
              </HeaderImage>
            </div>
            <styled.div page={[undefined]}>
              <div className=\\"sc-jRQBWg fcejaI\\">
                <ButtonNav active={false} name=\\"Home\\">
                  <styled.div active={false}>
                    <div className=\\"sc-iCfMLu hZrAJv\\">
                      <styled.button active={false} type=\\"button\\" data-testid=\\"button-nav\\" onClick={[Function: onClick]}>
                        <button type=\\"button\\" data-testid=\\"button-nav\\" onClick={[Function: onClick]} className=\\"sc-furwcr ifqecf\\">
                          Home
                        </button>
                      </styled.button>
                    </div>
                  </styled.div>
                </ButtonNav>
                <ButtonNav active={false} name=\\"Usuários\\">
                  <styled.div active={false}>
                    <div className=\\"sc-iCfMLu hZrAJv\\">
                      <styled.button active={false} type=\\"button\\" data-testid=\\"button-nav\\" onClick={[Function: onClick]}>
                        <button type=\\"button\\" data-testid=\\"button-nav\\" onClick={[Function: onClick]} className=\\"sc-furwcr ifqecf\\">
                          Usuários
                        </button>
                      </styled.button>
                    </div>
                  </styled.div>
                </ButtonNav>
              </div>
            </styled.div>
            <div>
              <p>
                Bem vindo,
              </p>
              <p>
                Administrador
              </p>
            </div>
          </div>
        </styled.div>
      </Header>
      <Strip>
        <styled.div>
          <div className=\\"sc-pVTFL htYQek\\" />
        </styled.div>
      </Strip>
      <styled.div>
        <div className=\\"sc-gsDKAQ ijBjYI\\">
          <Row style={{...}}>
            <div className=\\"ant-row\\" style={{...}}>
              <Col>
                <div style={{...}} className=\\"ant-col\\">
                  <styled.div>
                    <div className=\\"sc-bdvvtL eNkUAe\\">
                      <DrawerOption name=\\"Home\\" icon={{...}} page=\\"/\\" active={false}>
                        <Link to=\\"/\\">
                          <LinkAnchor href=\\"/\\" navigate={[Function: navigate]}>
                            <a href=\\"/\\" onClick={[Function: onClick]}>
                              <styled.button onClick={[Function: onClick]} active={false}>
                                <button onClick={[Function: onClick]} className=\\"sc-hKwDye hqcTCs\\">
                                  <p>
                                    <IoHomeOutline>
                                      <IconBase attr={{...}}>
                                        <svg stroke=\\"currentColor\\" fill=\\"currentColor\\" strokeWidth=\\"0\\" viewBox=\\"0 0 512 512\\" className={[undefined]} style={{...}} height=\\"1em\\" width=\\"1em\\" xmlns=\\"http://www.w3.org/2000/svg\\">
                                          <path fill=\\"none\\" strokeLinecap=\\"round\\" strokeLinejoin=\\"round\\" strokeWidth=\\"32\\" d=\\"M80 212v236a16 16 0 0016 16h96V328a24 24 0 0124-24h80a24 24 0 0124 24v136h96a16 16 0 0016-16V212\\" />
                                          <path fill=\\"none\\" strokeLinecap=\\"round\\" strokeLinejoin=\\"round\\" strokeWidth=\\"32\\" d=\\"M480 256L266.89 52c-5-5.28-16.69-5.34-21.78 0L32 256m368-77V64h-48v69\\" />
                                        </svg>
                                      </IconBase>
                                    </IoHomeOutline>
                                  </p>
                                  <p>
                                    Home
                                  </p>
                                </button>
                              </styled.button>
                            </a>
                          </LinkAnchor>
                        </Link>
                      </DrawerOption>
                      <DrawerOption name=\\"Usuários\\" icon={{...}} page=\\"/users\\" active={false}>
                        <Link to=\\"/users\\">
                          <LinkAnchor href=\\"/users\\" navigate={[Function: navigate]}>
                            <a href=\\"/users\\" onClick={[Function: onClick]}>
                              <styled.button onClick={[Function: onClick]} active={false}>
                                <button onClick={[Function: onClick]} className=\\"sc-hKwDye hqcTCs\\">
                                  <p>
                                    <IoPersonOutline>
                                      <IconBase attr={{...}}>
                                        <svg stroke=\\"currentColor\\" fill=\\"currentColor\\" strokeWidth=\\"0\\" viewBox=\\"0 0 512 512\\" className={[undefined]} style={{...}} height=\\"1em\\" width=\\"1em\\" xmlns=\\"http://www.w3.org/2000/svg\\">
                                          <path fill=\\"none\\" strokeLinecap=\\"round\\" strokeLinejoin=\\"round\\" strokeWidth=\\"32\\" d=\\"M344 144c-3.92 52.87-44 96-88 96s-84.15-43.12-88-96c-4-55 35-96 88-96s92 42 88 96z\\" />
                                          <path fill=\\"none\\" strokeMiterlimit=\\"10\\" strokeWidth=\\"32\\" d=\\"M256 304c-87 0-175.3 48-191.64 138.6C62.39 453.52 68.57 464 80 464h352c11.44 0 17.62-10.48 15.65-21.4C431.3 352 343 304 256 304z\\" />
                                        </svg>
                                      </IconBase>
                                    </IoPersonOutline>
                                  </p>
                                  <p>
                                    Usuários
                                  </p>
                                </button>
                              </styled.button>
                            </a>
                          </LinkAnchor>
                        </Link>
                      </DrawerOption>
                    </div>
                  </styled.div>
                </div>
              </Col>
              <Col xl={19} xs={17} md={18} xxl={20}>
                <div style={{...}} className=\\"ant-col ant-col-xs-17 ant-col-md-18 ant-col-xl-19 ant-col-xxl-20\\" />
              </Col>
            </div>
          </Row>
        </div>
      </styled.div>
      <styled.div>
        <div className=\\"sc-dkPtRN dfWXnY\\" />
      </styled.div>
    </Drawer>
  </Router>
</BrowserRouter>"
`;
