<svg class="figure"
   xmlns:dc="http://purl.org/dc/elements/1.1/"
   xmlns:cc="http://creativecommons.org/ns#"
   xmlns:rdf="http://www.w3.org/1999/02/22-rdf-syntax-ns#"
   xmlns:svg="http://www.w3.org/2000/svg"
   xmlns="http://www.w3.org/2000/svg"
   xmlns:xlink="http://www.w3.org/1999/xlink"
   viewBox="0 0 921 396"
   id="2-interrupts-plain"
   version="1.1">
  <title>I/O with Interrupts</title>
  <defs
     id="plain-irq-defs-irq">
    <marker
       style="overflow:visible"
       id="plain-irq-irq-Arrow1Mend"
       refX="0"
       refY="0"
       orient="auto">
      <path
         transform="matrix(-0.4,0,0,-0.4,-4,0)"
         style="fill-rule:evenodd;stroke:#000000;stroke-width:1pt"
         d="M 0,0 5,-5 -12.5,0 5,5 0,0 z"
         id="plain-irq-path3782" />
    </marker>
    <marker
       style="overflow:visible"
       id="plain-irq-irq-Arrow1Lend"
       refX="0"
       refY="0"
       orient="auto">
      <path
         transform="matrix(-0.8,0,0,-0.8,-10,0)"
         style="fill-rule:evenodd;stroke:#000000;stroke-width:1pt"
         d="M 0,0 5,-5 -12.5,0 5,5 0,0 z"
         id="plain-irq-path3776" />
    </marker>
    <marker
       style="overflow:visible"
       id="plain-irq-irq-Arrow1Mendl"
       refX="0"
       refY="0"
       orient="auto">
      <path
         transform="matrix(-0.4,0,0,-0.4,-4,0)"
         style="fill:#008000;fill-rule:evenodd;stroke:#008000;stroke-width:1pt"
         d="M 0,0 5,-5 -12.5,0 5,5 0,0 z"
         id="plain-irq-path5350" />
    </marker>
    <marker
       style="overflow:visible"
       id="plain-irq-irq-Arrow1Mendz"
       refX="0"
       refY="0"
       orient="auto">
      <path
         transform="matrix(-0.4,0,0,-0.4,-4,0)"
         style="fill:#000080;fill-rule:evenodd;stroke:#000080;stroke-width:1pt"
         d="M 0,0 5,-5 -12.5,0 5,5 0,0 z"
         id="plain-irq-path5775" />
    </marker>
    <marker
       style="overflow:visible"
       id="plain-irq-irq-Arrow1Mends"
       refX="0"
       refY="0"
       orient="auto">
      <path
         transform="matrix(-0.4,0,0,-0.4,-4,0)"
         style="fill:#ff0000;fill-rule:evenodd;stroke:#ff0000;stroke-width:1pt"
         d="M 0,0 5,-5 -12.5,0 5,5 0,0 z"
         id="plain-irq-path6495" />
    </marker>
    <marker
       style="overflow:visible"
       id="plain-irq-irq-Arrow1Mendg"
       refX="0"
       refY="0"
       orient="auto">
      <path
         transform="matrix(-0.4,0,0,-0.4,-4,0)"
         style="fill:#800000;fill-rule:evenodd;stroke:#800000;stroke-width:1pt"
         d="M 0,0 5,-5 -12.5,0 5,5 0,0 z"
         id="plain-irq-path6783" />
    </marker>
    <marker
       style="overflow:visible"
       id="plain-irq-irq-Arrow1MendE"
       refX="0"
       refY="0"
       orient="auto">
      <path
         transform="matrix(-0.4,0,0,-0.4,-4,0)"
         style="fill:#ff0000;fill-rule:evenodd;stroke:#ff0000;stroke-width:1pt"
         d="M 0,0 5,-5 -12.5,0 5,5 0,0 z"
         id="plain-irq-path7133" />
    </marker>
    <marker
       style="overflow:visible"
       id="plain-irq-irq-Arrow1Mend-7"
       refX="0"
       refY="0"
       orient="auto">
      <path
         transform="matrix(-0.4,0,0,-0.4,-4,0)"
         style="fill-rule:evenodd;stroke:#000000;stroke-width:1pt"
         d="M 0,0 5,-5 -12.5,0 5,5 0,0 z"
         id="plain-irq-path3782-5" />
    </marker>
    <marker
       style="overflow:visible"
       id="plain-irq-irq-Arrow1Mendl-3"
       refX="0"
       refY="0"
       orient="auto">
      <path
         transform="matrix(-0.4,0,0,-0.4,-4,0)"
         style="fill:#008000;fill-rule:evenodd;stroke:#008000;stroke-width:1pt"
         d="M 0,0 5,-5 -12.5,0 5,5 0,0 z"
         id="plain-irq-path5350-5" />
    </marker>
    <marker
       style="overflow:visible"
       id="plain-irq-irq-Arrow1Mendl-7"
       refX="0"
       refY="0"
       orient="auto">
      <path
         transform="matrix(-0.4,0,0,-0.4,-4,0)"
         style="fill:#008000;fill-rule:evenodd;stroke:#008000;stroke-width:1pt"
         d="M 0,0 5,-5 -12.5,0 5,5 0,0 z"
         id="plain-irq-path5350-53" />
    </marker>
    <marker
       style="overflow:visible"
       id="plain-irq-irq-Arrow1Mendl-6"
       refX="0"
       refY="0"
       orient="auto">
      <path
         transform="matrix(-0.4,0,0,-0.4,-4,0)"
         style="fill:#008000;fill-rule:evenodd;stroke:#008000;stroke-width:1pt"
         d="M 0,0 5,-5 -12.5,0 5,5 0,0 z"
         id="plain-irq-path5350-2" />
    </marker>
    <marker
       style="overflow:visible"
       id="plain-irq-irq-Arrow1MendlY"
       refX="0"
       refY="0"
       orient="auto">
      <path
         transform="matrix(-0.4,0,0,-0.4,-4,0)"
         style="fill:#800080;fill-rule:evenodd;stroke:#800080;stroke-width:1pt"
         d="M 0,0 5,-5 -12.5,0 5,5 0,0 z"
         id="plain-irq-path5020" />
    </marker>
    <marker
       style="overflow:visible"
       id="plain-irq-irq-Arrow1Mend-1"
       refX="0"
       refY="0"
       orient="auto">
      <path
         transform="matrix(-0.4,0,0,-0.4,-4,0)"
         style="fill-rule:evenodd;stroke:#000000;stroke-width:1pt"
         d="M 0,0 5,-5 -12.5,0 5,5 0,0 z"
         id="plain-irq-path3782-2" />
    </marker>
    <marker
       style="overflow:visible"
       id="plain-irq-irq-Arrow1Mendz-0"
       refX="0"
       refY="0"
       orient="auto">
      <path
         transform="matrix(-0.4,0,0,-0.4,-4,0)"
         style="fill:#000080;fill-rule:evenodd;stroke:#000080;stroke-width:1pt"
         d="M 0,0 5,-5 -12.5,0 5,5 0,0 z"
         id="plain-irq-path5775-9" />
    </marker>
    <marker
       style="overflow:visible"
       id="plain-irq-irq-Arrow1MendgG"
       refX="0"
       refY="0"
       orient="auto">
      <path
         transform="matrix(-0.4,0,0,-0.4,-4,0)"
         style="fill:#800000;fill-rule:evenodd;stroke:#800000;stroke-width:1pt"
         d="M 0,0 5,-5 -12.5,0 5,5 0,0 z"
         id="plain-irq-path5533" />
    </marker>
    <marker
       style="overflow:visible"
       id="plain-irq-irq-Arrow1Mend-0"
       refX="0"
       refY="0"
       orient="auto">
      <path
         transform="matrix(-0.4,0,0,-0.4,-4,0)"
         style="fill-rule:evenodd;stroke:#000000;stroke-width:1pt"
         d="M 0,0 5,-5 -12.5,0 5,5 0,0 z"
         id="plain-irq-path3782-6" />
    </marker>
    <marker
       style="overflow:visible"
       id="plain-irq-irq-Arrow1Mend-71"
       refX="0"
       refY="0"
       orient="auto">
      <path
         transform="matrix(-0.4,0,0,-0.4,-4,0)"
         style="fill:#ff0000;fill-rule:evenodd;stroke:#ff0000;stroke-width:1pt"
         d="M 0,0 5,-5 -12.5,0 5,5 0,0 z"
         id="plain-irq-path3200" />
    </marker>
    <marker
       style="overflow:visible"
       id="plain-irq-irq-Arrow1MendgGB"
       refX="0"
       refY="0"
       orient="auto">
      <path
         transform="matrix(-0.4,0,0,-0.4,-4,0)"
         style="stroke-width:1pt;stroke:#ff0000;fill-rule:evenodd;fill:#ff0000"
         d="M 0,0 5,-5 -12.5,0 5,5 0,0 z"
         id="plain-irq-path4037" />
    </marker>
  </defs>
  <metadata>
    <rdf:RDF>
      <cc:Work
         rdf:about="">
        <dc:format>image/svg+xml</dc:format>
        <dc:type
           rdf:resource="http://purl.org/dc/dcmitype/StillImage" />
        <dc:title>I/O with Interrupts</dc:title>
        <dc:creator>
          <cc:Agent>
            <dc:title>Jens Lechtenbörger</dc:title>
          </cc:Agent>
        </dc:creator>
        <cc:license
           rdf:resource="https://creativecommons.org/licenses/by-sa/4.0/" />
        <dc:date>Summer 2017, 2018</dc:date>
      </cc:Work>
      <cc:License
         rdf:about="https://creativecommons.org/licenses/by-sa/4.0/">
        <cc:permits
           rdf:resource="http://creativecommons.org/ns#Reproduction" />
        <cc:permits
           rdf:resource="http://creativecommons.org/ns#Distribution" />
        <cc:requires
           rdf:resource="http://creativecommons.org/ns#Notice" />
        <cc:requires
           rdf:resource="http://creativecommons.org/ns#Attribution" />
        <cc:permits
           rdf:resource="http://creativecommons.org/ns#DerivativeWorks" />
        <cc:requires
           rdf:resource="http://creativecommons.org/ns#ShareAlike" />
      </cc:License>
    </rdf:RDF>
  </metadata>
  <g
     id="plain-irq-layer1">
    <text
	xml:space="preserve"
	style="font-size:40px;font-style:normal;font-weight:normal;line-height:125%;letter-spacing:0px;word-spacing:0px;fill:#000000;fill-opacity:1;stroke:none;font-family:Sans"
	x="739.82812"
	y="15.195312"
	id="plain-irq-text4949"><tspan
          id="plain-irq-tspan4951"
	  x="739.82812"
	  y="15.195312"
	  style="font-size:20px">time</tspan></text>
    <text
       xml:space="preserve"
       style="font-size:40px;font-style:normal;font-weight:normal;line-height:125%;letter-spacing:0px;word-spacing:0px;fill:#000000;fill-opacity:1;stroke:none;font-family:Sans"
       x="-0.171875"
       y="85.195312"
       id="plain-irq-text2985"><tspan
         id="plain-irq-tspan2987"
         x="-0.171875"
         y="85.195312"
         style="font-size:22px;fill:#008000">Application</tspan></text>
    <text
       xml:space="preserve"
       style="font-size:40px;font-style:normal;font-weight:normal;line-height:125%;letter-spacing:0px;word-spacing:0px;fill:#000000;fill-opacity:1;stroke:none;font-family:Sans"
       x="-0.171875"
       y="145.19531"
       id="plain-irq-text2989"><tspan
         id="plain-irq-tspan2991"
         x="-0.171875"
         y="145.19531"
         style="font-size:22px;fill:#0000ff">OS</tspan></text>
    <text
       xml:space="preserve"
       style="font-size:40px;font-style:normal;font-weight:normal;line-height:125%;letter-spacing:0px;word-spacing:0px;fill:#000000;fill-opacity:1;stroke:none;font-family:Sans"
       x="1.9407997"
       y="320.68829"
       id="plain-irq-text2993"><tspan
         id="plain-irq-tspan2995"
         x="-0.171875"
         y="320.68829"
         style="font-size:22px;fill:#800000">I/O Device</tspan></text>
    <path
       style="fill:none;stroke:#000000;stroke-width:2;stroke-linecap:butt;stroke-linejoin:miter;stroke-miterlimit:4;stroke-opacity:1;stroke-dasharray:4, 2;stroke-dashoffset:0;marker-mid:none;marker-end:url(#plain-irq-irq-Arrow1Lend)"
       d="m 149.82812,25.19531 680.17188,0"
       id="plain-irq-path4583" />
    <text
       xml:space="preserve"
       style="font-size:40px;font-style:normal;font-weight:normal;line-height:125%;letter-spacing:0px;word-spacing:0px;fill:#000000;fill-opacity:1;stroke:none;font-family:Sans"
       x="2.1126862"
       y="226"
       id="plain-irq-text2993-3"><tspan
         id="plain-irq-tspan2995-6"
         x="0"
         y="226"
         style="font-size:22px;fill:#800080">Interrupt Handler</tspan></text>
  </g>
  <g
     id="plain-irq-layer2">
    <path
       style="fill:none;stroke:#008000;stroke-width:3;stroke-linecap:butt;stroke-linejoin:miter;stroke-miterlimit:4;stroke-opacity:1;stroke-dasharray:none;marker-end:url(#plain-irq-irq-Arrow1Mendl)"
       d="m 149.82812,75.19531 70,0 0,0"
       id="plain-irq-path4973" />
    <path
       id="plain-irq-path5388"
       d="m 219.82812,75.19531 0,60"
       style="fill:none;stroke:#000000;stroke-width:2;stroke-linecap:butt;stroke-linejoin:miter;stroke-miterlimit:4;stroke-opacity:1;stroke-dasharray:6, 2;stroke-dashoffset:0;marker-end:url(#plain-irq-irq-Arrow1Mend)" />
    <path
       style="fill:none;stroke:#000000;stroke-width:2;stroke-linecap:butt;stroke-linejoin:miter;stroke-miterlimit:4;stroke-opacity:1;stroke-dasharray:6, 2;stroke-dashoffset:0;marker-end:url(#plain-irq-irq-Arrow1Mend)"
       d="m 219.82812,135.19531 10,180"
       id="plain-irq-path5817" />
    <path
       xlink:href="#rect6234"
       style="fill:none;stroke:none"
       id="plain-irq-path6264"
       d="m 267.14062,172.50708 0,105.375 265.375,0 0,-105.375 -265.375,0 z" />
    <rect
       style="fill:none;stroke:#ff0000;stroke-width:1;stroke-linecap:butt;stroke-miterlimit:4;stroke-opacity:1;stroke-dasharray:none;stroke-dashoffset:0"
       id="plain-irq-rect6234"
       width="280"
       height="120"
       x="260"
       y="176" />
    <text
       id="plain-irq-text3071"
       y="204.44205"
       x="267.14062"
       style="font-size:20px;font-style:normal;font-weight:normal;line-height:125%;letter-spacing:0px;word-spacing:0px;fill:#000000;fill-opacity:1;stroke:none;font-family:Sans"
       xml:space="preserve"><tspan
         id="plain-irq-tspan3073"
         y="204.44205"
         x="267.14062"><tspan
           id="plain-irq-tspan3075"
           y="204.44205"
           x="267.14062">• </tspan><tspan
           id="plain-irq-tspan3077"
           style="fill:#008000">Application</tspan><tspan
           id="plain-irq-tspan3079"> invokes</tspan></tspan><tspan
         id="plain-irq-tspan3083"
         y="229.44205"
         x="267.14062"><tspan
           id="plain-irq-tspan3085"
           style="visibility:hidden"
           y="229.44205"
           x="267.14062">•</tspan><tspan
           id="plain-irq-tspan3087"
           style="fill:#000080"> system call</tspan><tspan
           id="plain-irq-tspan3089"> for I/O</tspan></tspan><tspan
         id="plain-irq-tspan3093"
         y="254.44205"
         x="267.14062"><tspan
           id="plain-irq-tspan3095"
           y="254.44205"
           x="267.14062">• </tspan><tspan
           id="plain-irq-tspan3097"
           style="fill:#000080">OS</tspan><tspan
           id="plain-irq-tspan3099"> starts </tspan><tspan
           id="plain-irq-tspan3101"
           style="fill:#800000">I/O operation</tspan></tspan><tspan
         id="plain-irq-tspan3105"
         y="279.44205"
         x="267.14062"><tspan
           id="plain-irq-tspan3107"
           style="visibility:hidden"
           y="279.44205"
           x="267.14062">•</tspan><tspan
           id="plain-irq-tspan3109"> on behalf of application</tspan></tspan></text>
    <path
       style="fill:none;stroke:#ff0000;stroke-width:1;stroke-linecap:butt;stroke-linejoin:miter;stroke-miterlimit:4;stroke-opacity:1;stroke-dasharray:none;marker-end:url(#plain-irq-irq-Arrow1Mends)"
       d="m 259.82812,205.19531 -40,-110"
       id="plain-irq-path6292" />
  </g>
  <g
     id="plain-irq-layer3">
    <path
       id="plain-irq-path6576"
       d="m 229.82812,315.19531 370.17188,0"
       style="fill:none;stroke:#800000;stroke-width:3;stroke-linecap:butt;stroke-linejoin:miter;stroke-miterlimit:4;stroke-opacity:1;stroke-dasharray:none;marker-end:url(#plain-irq-irq-Arrow1Mendg)" />
    <path
       id="plain-irq-path5576"
       d="m 219.82812,135.19531 50.17188,0"
       style="fill:none;stroke:#000080;stroke-width:3;stroke-linecap:butt;stroke-linejoin:miter;stroke-miterlimit:4;stroke-opacity:1;stroke-dasharray:none;marker-end:url(#plain-irq-irq-Arrow1Mendz)" />
    <text
       id="plain-irq-text3129"
       y="357.81708"
       x="113.23438"
       style="font-size:20px;font-style:normal;font-variant:normal;font-weight:normal;font-stretch:normal;text-align:start;line-height:125%;letter-spacing:0px;word-spacing:0px;writing-mode:lr-tb;text-anchor:start;fill:#000000;fill-opacity:1;stroke:none;font-family:Sans"
       xml:space="preserve"><tspan
         id="plain-irq-tspan3131"
         y="357.81708"
         x="113.23438"><tspan
           id="plain-irq-tspan3133"
           y="357.81708"
           x="113.23438">• </tspan><tspan
           id="plain-irq-tspan3135"
           style="fill:#800000"
           y="357.81708"
           x="131.39844">I/O operation</tspan><tspan
           id="plain-irq-tspan3137"
           y="357.81708"
           x="262.21875"> proceeds,</tspan></tspan><tspan
         id="plain-irq-tspan3141"
         y="382.81708"
         x="113.23438"><tspan
           id="plain-irq-tspan3143"
           style="visibility:hidden"
           y="382.81708"
           x="113.23438">•</tspan><tspan
           id="plain-irq-tspan3145"
           y="382.81708"
           x="125.03125"> asynchronously to CPU</tspan></tspan></text>
    <rect
       style="fill:none;stroke:#ff0000;stroke-width:1;stroke-linecap:butt;stroke-miterlimit:4;stroke-opacity:1;stroke-dasharray:none;stroke-dashoffset:0"
       id="plain-irq-rect6920"
       width="260"
       height="60"
       x="111.82812"
       y="335.19531" />
    <path
       style="fill:none;stroke:#ff0000;stroke-width:1px;stroke-linecap:butt;stroke-linejoin:miter;stroke-opacity:1;marker-end:url(#plain-irq-irq-Arrow1MendE)"
       d="m 371.82812,365.19531 50,-50"
       id="plain-irq-path6922" />
  </g>
  <g
     id="plain-irq-layer4">
    <text
       id="plain-irq-text3112"
       y="108.80469"
       x="300"
       style="font-size:40px;font-style:normal;font-weight:normal;line-height:125%;letter-spacing:0px;word-spacing:0px;fill:#000000;fill-opacity:1;stroke:none;font-family:Sans"
       xml:space="preserve"><tspan
         style="font-size:20.00000078px"
         id="plain-irq-tspan3115"
         y="108.80469"
         x="300"><tspan
           id="plain-irq-tspan3117"
           style="font-size:20.00000078px"
           y="108.80469"
           x="300">Whether same or different</tspan></tspan><tspan
         style="font-size:20.00000078px"
         id="plain-irq-tspan3121"
         y="133.80469"
         x="300"><tspan
           id="plain-irq-tspan3123"
           style="fill:#008000;font-size:20.00000078px"
           y="133.80469"
           x="300">application continues</tspan><tspan
           id="plain-irq-tspan3125"
           style="font-size:20.00000078px"
           y="133.80469"
           x="514.17969">, </tspan></tspan><tspan
         style="font-size:20.00000078px"
         id="plain-irq-tspan3127"
         y="158.80469"
         x="300"><tspan
           id="plain-irq-tspan3129"
           style="font-size:20.00000078px"
           y="158.80469"
           x="300">depends on type of I/O</tspan></tspan></text>
    <path
       style="fill:none;stroke:#008000;stroke-width:3;stroke-linecap:butt;stroke-linejoin:miter;stroke-miterlimit:4;stroke-opacity:1;stroke-dasharray:none;marker-end:url(#plain-irq-irq-Arrow1Mendl)"
       d="m 270,76 330,0 0,0"
       id="plain-irq-path4973-5" />
    <rect
       style="fill:none;stroke:#ff0000;stroke-width:1;stroke-linecap:butt;stroke-miterlimit:4;stroke-opacity:1;stroke-dasharray:none;stroke-dashoffset:0"
       id="plain-irq-rect6234-6"
       width="280"
       height="80"
       x="290"
       y="86" />
    <path
       id="plain-irq-path5280"
       d="M 290,126 270,96"
       style="stroke-linejoin:miter;marker-end:url(#plain-irq-irq-Arrow1MendgGB);stroke-opacity:1;stroke:#ff0000;stroke-linecap:butt;stroke-miterlimit:4;stroke-dasharray:none;stroke-width:1;fill:none" />
    <path
       style="fill:none;stroke:#000000;stroke-width:2;stroke-linecap:butt;stroke-linejoin:miter;stroke-miterlimit:4;stroke-opacity:1;stroke-dasharray:6, 2;stroke-dashoffset:0;marker-end:url(#plain-irq-irq-Arrow1Mend)"
       d="m 270,136 0,-60"
       id="plain-irq-path4201" />
  </g>
  <g
     id="plain-irq-layer5">
    <path
       id="plain-irq-path5388-2"
       d="m 600,76 0,150"
       style="fill:none;stroke:#000000;stroke-width:2;stroke-linecap:butt;stroke-linejoin:miter;stroke-miterlimit:4;stroke-opacity:1;stroke-dasharray:6, 2;stroke-dashoffset:0;marker-end:url(#plain-irq-irq-Arrow1Mend)" />
    <path
       id="plain-irq-path7239"
       d="M 599.82812,315.19531 600,226"
       style="fill:none;stroke:#000000;stroke-width:2;stroke-linecap:butt;stroke-linejoin:miter;stroke-miterlimit:4;stroke-opacity:1;stroke-dasharray:6, 2;stroke-dashoffset:0;marker-end:url(#plain-irq-irq-Arrow1Mend)" />
    <rect
       y="256"
       x="631.82812"
       height="134.1953"
       width="288.17191"
       id="plain-irq-rect7488"
       style="fill:none;stroke:#ff0000;stroke-width:1.01781583;stroke-linecap:butt;stroke-miterlimit:4;stroke-opacity:1;stroke-dasharray:none;stroke-dashoffset:0" />
    <path
       id="plain-irq-path7490"
       d="m 629.82812,345.19531 -30,-30"
       style="fill:none;stroke:#ff0000;stroke-width:1px;stroke-linecap:butt;stroke-linejoin:miter;stroke-opacity:1;marker-end:url(#plain-irq-irq-Arrow1Mend-71)" />
    <path
       style="fill:none;stroke:#800080;stroke-width:3;stroke-linecap:butt;stroke-linejoin:miter;stroke-miterlimit:4;stroke-opacity:1;stroke-dasharray:none;marker-end:url(#plain-irq-irq-Arrow1MendlY)"
       d="m 600,226 40,0 0,0"
       id="plain-irq-path4973-6-9" />
    <text
       id="plain-irq-text3107"
       y="278"
       x="640"
       style="font-size:40px;font-style:normal;font-weight:normal;line-height:125%;letter-spacing:0px;word-spacing:0px;fill:#000000;fill-opacity:1;stroke:none;font-family:Sans"
       xml:space="preserve"><tspan
         style="font-size:20px"
         id="plain-irq-tspan3110"
         y="278"
         x="640"><tspan
           id="plain-irq-tspan3112"
           style="font-size:20px"
           y="278"
           x="640">• </tspan><tspan
           id="plain-irq-tspan3114"
           style="fill:#ff0000;font-size:20px"
           y="278"
           x="658.16406">I/O operation</tspan><tspan
           id="plain-irq-tspan3116"
           style="font-size:20px"
           y="278"
           x="788.98438"> finished</tspan></tspan><tspan
         style="font-size:20px"
         id="plain-irq-tspan3120"
         y="303"
         x="640"><tspan
           id="plain-irq-tspan3122"
           style="font-size:20px"
           y="303"
           x="640">• </tspan><tspan
           id="plain-irq-tspan3124"
           style="fill:#ff0000;font-size:20px"
           y="303"
           x="658.16406">Device triggers</tspan><tspan
           id="plain-irq-tspan3126"
           style="font-size:20px"
           y="303"
           x="810.9375"> interrupt,</tspan></tspan><tspan
         style="font-size:20px"
         id="plain-irq-tspan3130x"
         y="0"
         x="640"><tspan
           id="plain-irq-tspan3085x"
           style="visibility:hidden"
           y="328"
           x="640">• </tspan><tspan
           id="plain-irq-tspan3087x"
           style="fill:#008000">application</tspan><tspan
           id="plain-irq-tspan3089"> interrupted</tspan></tspan><tspan
         style="font-size:20px"
         id="plain-irq-tspan3130"
         y="353"
         x="640"><tspan
           id="plain-irq-tspan3132"
           style="font-size:20px"
           y="353"
           x="640">• </tspan><tspan
           id="plain-irq-tspan3134"
           style="fill:#800080;font-size:20px"
           y="353"
           x="658.16406">Interrupt handled</tspan><tspan
           id="plain-irq-tspan3136"
           style="font-size:20px"
           y="353"
           x="833.55469"> by </tspan><tspan
           id="plain-irq-tspan3138"
           style="fill:#000050;font-size:20px"
           y="353"
           x="870.82031">OS</tspan></tspan><tspan
         style="font-size:20px"
         id="plain-irq-tspan3142"
         y="378"
         x="640"><tspan
           id="plain-irq-tspan3144"
           style="visibility:hidden"
           y="378"
           x="640">• </tspan><tspan
           id="plain-irq-tspan3146"
           style="fill:#000080;font-size:20px"
           y="378"
           x="658.16406">subsequently</tspan></tspan></text>
  </g>
  <g
     id="plain-irq-layer6">
    <path
       style="fill:none;stroke:#000000;stroke-width:2;stroke-linecap:butt;stroke-linejoin:miter;stroke-miterlimit:4;stroke-opacity:1;stroke-dasharray:6, 2;stroke-dashoffset:0;marker-end:url(#plain-irq-irq-Arrow1Mend)"
       d="m 640,226 0,-90"
       id="plain-irq-path4201-7" />
    <path
       id="plain-irq-path5576-3"
       d="M 639.82812,136 690,136"
       style="fill:none;stroke:#000080;stroke-width:3;stroke-linecap:butt;stroke-linejoin:miter;stroke-miterlimit:4;stroke-opacity:1;stroke-dasharray:none;marker-end:url(#plain-irq-irq-Arrow1Mendz)" />
    <path
       id="plain-irq-path7707"
       d="m 690,136 0,-60"
       style="fill:none;stroke:#000000;stroke-width:2;stroke-linecap:butt;stroke-linejoin:miter;stroke-miterlimit:4;stroke-opacity:1;stroke-dasharray:6, 2;stroke-dashoffset:0;marker-end:url(#plain-irq-irq-Arrow1Mend-7)" />
    <path
       style="fill:none;stroke:#008000;stroke-width:3;stroke-linecap:butt;stroke-linejoin:miter;stroke-miterlimit:4;stroke-opacity:1;stroke-dasharray:none;marker-end:url(#plain-irq-irq-Arrow1Mendl)"
       d="m 690,76 70,0 0,0"
       id="plain-irq-path4973-6" />
  </g>
</svg>
