<?xml version="1.0" encoding="UTF-8" standalone="no"?>
<!-- Created with Inkscape (http://www.inkscape.org/) -->

<svg
   xmlns:dc="http://purl.org/dc/elements/1.1/"
   xmlns:cc="http://creativecommons.org/ns#"
   xmlns:rdf="http://www.w3.org/1999/02/22-rdf-syntax-ns#"
   xmlns:svg="http://www.w3.org/2000/svg"
   xmlns="http://www.w3.org/2000/svg"
   version="1.1"
   width="100%"
   height="100%"
   viewBox="0 0 626.56843 479.59265"
   id="Domain-name-space">
  <metadata
     id="metadata244">
    <rdf:RDF>
      <cc:Work
         rdf:about="">
        <dc:format>image/svg+xml</dc:format>
        <dc:type
           rdf:resource="http://purl.org/dc/dcmitype/StillImage" />
        <dc:title></dc:title>
      </cc:Work>
    </rdf:RDF>
  </metadata>
  <defs
     id="defs4">
    <marker
       refX="0"
       refY="0"
       orient="auto"
       id="Arrow1Lstart"
       style="overflow:visible">
      <path
         d="M 0,0 5,-5 -12.5,0 5,5 0,0 z"
         transform="scale(0.8,0.8)"
         id="path4516"
         style="fill-rule:evenodd;stroke:#000000;stroke-width:1pt;marker-start:none" />
    </marker>
  </defs>
  <g
     transform="translate(-24.097371,-30.361578)"
     id="layer1">
    <g
       id="g3824">
      <path
         d="M 168.29141,264.64521 82.024386,427.27977"
         id="path3474"
         style="fill:none;stroke:#000000;stroke-width:1px;stroke-linecap:butt;stroke-linejoin:miter;stroke-opacity:1" />
      <path
         d="m 560.65685,142.34788 0,108"
         id="path1344"
         style="fill:none;stroke:#000000;stroke-width:1px;stroke-linecap:butt;stroke-linejoin:miter;stroke-opacity:1" />
      <path
         d="m 560.65685,142.34788 52,108"
         id="path1342"
         style="fill:none;stroke:#000000;stroke-width:1px;stroke-linecap:butt;stroke-linejoin:miter;stroke-opacity:1" />
      <path
         d="m 321.65685,88.34788 240,55"
         id="path1308"
         style="fill:none;stroke:#000000;stroke-width:1px;stroke-linecap:butt;stroke-linejoin:miter;stroke-opacity:1" />
      <path
         d="m 321.65685,88.34788 125.61522,55"
         id="path1310"
         style="fill:none;stroke:#000000;stroke-width:1px;stroke-linecap:butt;stroke-linejoin:miter;stroke-opacity:1" />
      <path
         d="m 321.65685,88.34788 -3,55"
         id="path1312"
         style="fill:none;stroke:#000000;stroke-width:1px;stroke-linecap:butt;stroke-linejoin:miter;stroke-opacity:1" />
      <path
         d="m 321.65685,88.34788 -122,55 -23,110"
         id="path1322"
         style="fill:none;stroke:#000000;stroke-width:1px;stroke-linecap:butt;stroke-linejoin:miter;stroke-opacity:1" />
      <path
         d="m 321.65685,88.34788 -122,55 19,110"
         id="path1316"
         style="fill:none;stroke:#000000;stroke-width:1px;stroke-linecap:butt;stroke-linejoin:miter;stroke-opacity:1" />
      <path
         d="m 321.65685,88.34788 -214,55 24,111"
         id="path1318"
         style="fill:none;stroke:#000000;stroke-width:1px;stroke-linecap:butt;stroke-linejoin:miter;stroke-opacity:1" />
      <path
         d="m 321.65685,88.34788 -214,55 -2,111"
         id="path1320"
         style="fill:none;stroke:#000000;stroke-width:1px;stroke-linecap:butt;stroke-linejoin:miter;stroke-opacity:1" />
      <path
         d="m 321.65685,88.34788 -214,55 -48.999996,111"
         id="path1306"
         style="fill:none;stroke:#000000;stroke-width:1px;stroke-linecap:butt;stroke-linejoin:miter;stroke-opacity:1" />
      <path
         d="m 317.65685,142.34788 -39,109"
         id="path1330"
         style="fill:none;stroke:#000000;stroke-width:1px;stroke-linecap:butt;stroke-linejoin:miter;stroke-opacity:1" />
      <path
         d="m 317.65685,142.34788 -10,109"
         id="path1332"
         style="fill:none;stroke:#000000;stroke-width:1px;stroke-linecap:butt;stroke-linejoin:miter;stroke-opacity:1" />
      <path
         d="m 317.65685,142.34788 32,109"
         id="path1334"
         style="fill:none;stroke:#000000;stroke-width:1px;stroke-linecap:butt;stroke-linejoin:miter;stroke-opacity:1" />
      <path
         d="m 317.65685,142.34788 57,109"
         id="path1328"
         style="fill:none;stroke:#000000;stroke-width:1px;stroke-linecap:butt;stroke-linejoin:miter;stroke-opacity:1" />
      <path
         d="m 447.65685,143.34788 -16,107"
         id="path1338"
         style="fill:none;stroke:#000000;stroke-width:1px;stroke-linecap:butt;stroke-linejoin:miter;stroke-opacity:1" />
      <path
         d="m 447.65685,143.34788 29,107"
         id="path1340"
         style="fill:none;stroke:#000000;stroke-width:1px;stroke-linecap:butt;stroke-linejoin:miter;stroke-opacity:1" />
      <path
         d="m 447.65685,143.34788 73,107"
         id="path1336"
         style="fill:none;stroke:#000000;stroke-width:1px;stroke-linecap:butt;stroke-linejoin:miter;stroke-opacity:1" />
      <text
         x="190.48772"
         y="48.574749"
         id="text1346"
         xml:space="preserve"
         style="font-size:23.97209167px;font-style:normal;font-weight:normal;fill:#000000;fill-opacity:1;stroke:none;font-family:Bitstream Vera Sans"><tspan
           x="190.48772"
           y="48.574749"
           id="tspan1348">Domain Name Space</tspan></text>
      <g
         transform="matrix(0.555556,0,0,0.555556,27.87907,13.9244)"
         id="g2264">
        <rect
           width="35"
           height="51"
           x="28"
           y="415.36218"
           id="rect2266"
           style="color:#000000;fill:#ffffc2;fill-opacity:1;fill-rule:evenodd;stroke:#000000;stroke-width:1;stroke-linecap:butt;stroke-linejoin:miter;stroke-miterlimit:4;stroke-opacity:1;stroke-dasharray:none;stroke-dashoffset:0;marker:none;visibility:visible;display:inline;overflow:visible" />
        <path
           d="m 33.380539,437.88823 c 2.9242,4.983 9.003461,-4.66151 6.002308,-5.30448 -3.001155,-0.64297 -3.155061,6.26893 -0.384764,6.10819 2.770296,-0.16074 8.233927,-3.37558 8.233927,-3.37558 0,0 1.23124,5.78671 4.3863,3.37558"
           id="path2268"
           style="color:#000000;fill:none;stroke:#000000;stroke-width:1px;stroke-linecap:butt;stroke-linejoin:miter;stroke-miterlimit:4;stroke-opacity:1;stroke-dasharray:none;stroke-dashoffset:0;marker:none;visibility:visible;display:inline;overflow:visible" />
        <path
           d="m 32.457108,423.26072 c 2.770295,-2.57187 6.233162,6.75116 10.157742,3.69706 3.92458,-3.0541 6.38707,-7.71561 8.38784,-3.69706 2.00077,4.01854 4.5402,1.44667 4.5402,1.44667"
           id="path2270"
           style="color:#000000;fill:none;stroke:#000000;stroke-width:1px;stroke-linecap:butt;stroke-linejoin:miter;stroke-miterlimit:4;stroke-opacity:1;stroke-dasharray:none;stroke-dashoffset:0;marker:none;visibility:visible;display:inline;overflow:visible" />
        <path
           d="m 33.303587,448.97942 c 2.847247,-2.08964 3.308963,-2.25038 5.694496,-0.16074 2.385531,2.08965 4.078487,-0.32148 4.078487,-0.32148"
           id="path2272"
           style="color:#000000;fill:none;stroke:#000000;stroke-width:1px;stroke-linecap:butt;stroke-linejoin:miter;stroke-miterlimit:4;stroke-opacity:1;stroke-dasharray:none;stroke-dashoffset:0;marker:none;visibility:visible;display:inline;overflow:visible" />
        <path
           d="m 45.38515,448.33646 c 3.61677,3.05409 3.46286,0.48222 7.4644,0.48222"
           id="path2274"
           style="color:#000000;fill:none;stroke:#000000;stroke-width:1px;stroke-linecap:butt;stroke-linejoin:miter;stroke-miterlimit:4;stroke-opacity:1;stroke-dasharray:none;stroke-dashoffset:0;marker:none;visibility:visible;display:inline;overflow:visible" />
        <path
           d="m 33.534445,457.82023 c 0.769526,-5.14374 3.847631,-1.28593 5.617541,0.96445 1.769912,2.25039 4.001534,-3.53632 8.233934,-1.76816 4.23239,1.76816 4.61715,2.57187 6.69487,0.16074"
           id="path2276"
           style="color:#000000;fill:none;stroke:#000000;stroke-width:1px;stroke-linecap:butt;stroke-linejoin:miter;stroke-miterlimit:4;stroke-opacity:1;stroke-dasharray:none;stroke-dashoffset:0;marker:none;visibility:visible;display:inline;overflow:visible" />
      </g>
      <g
         transform="translate(357.1569,-73.5143)"
         id="g2488">
        <rect
           width="35"
           height="51"
           x="28"
           y="415.36218"
           id="rect2490"
           style="color:#000000;fill:#ffffc2;fill-opacity:1;fill-rule:evenodd;stroke:#000000;stroke-width:1;stroke-linecap:butt;stroke-linejoin:miter;stroke-miterlimit:4;stroke-opacity:1;stroke-dasharray:none;stroke-dashoffset:0;marker:none;visibility:visible;display:inline;overflow:visible" />
        <path
           d="m 33.380539,437.88823 c 2.9242,4.983 9.003461,-4.66151 6.002308,-5.30448 -3.001155,-0.64297 -3.155061,6.26893 -0.384764,6.10819 2.770296,-0.16074 8.233927,-3.37558 8.233927,-3.37558 0,0 1.23124,5.78671 4.3863,3.37558"
           id="path2492"
           style="color:#000000;fill:none;stroke:#000000;stroke-width:1px;stroke-linecap:butt;stroke-linejoin:miter;stroke-miterlimit:4;stroke-opacity:1;stroke-dasharray:none;stroke-dashoffset:0;marker:none;visibility:visible;display:inline;overflow:visible" />
        <path
           d="m 32.457108,423.26072 c 2.770295,-2.57187 6.233162,6.75116 10.157742,3.69706 3.92458,-3.0541 6.38707,-7.71561 8.38784,-3.69706 2.00077,4.01854 4.5402,1.44667 4.5402,1.44667"
           id="path2494"
           style="color:#000000;fill:none;stroke:#000000;stroke-width:1px;stroke-linecap:butt;stroke-linejoin:miter;stroke-miterlimit:4;stroke-opacity:1;stroke-dasharray:none;stroke-dashoffset:0;marker:none;visibility:visible;display:inline;overflow:visible" />
        <path
           d="m 33.303587,448.97942 c 2.847247,-2.08964 3.308963,-2.25038 5.694496,-0.16074 2.385531,2.08965 4.078487,-0.32148 4.078487,-0.32148"
           id="path2496"
           style="color:#000000;fill:none;stroke:#000000;stroke-width:1px;stroke-linecap:butt;stroke-linejoin:miter;stroke-miterlimit:4;stroke-opacity:1;stroke-dasharray:none;stroke-dashoffset:0;marker:none;visibility:visible;display:inline;overflow:visible" />
        <path
           d="m 45.38515,448.33646 c 3.61677,3.05409 3.46286,0.48222 7.4644,0.48222"
           id="path2498"
           style="color:#000000;fill:none;stroke:#000000;stroke-width:1px;stroke-linecap:butt;stroke-linejoin:miter;stroke-miterlimit:4;stroke-opacity:1;stroke-dasharray:none;stroke-dashoffset:0;marker:none;visibility:visible;display:inline;overflow:visible" />
        <path
           d="m 33.534445,457.82023 c 0.769526,-5.14374 3.847631,-1.28593 5.617541,0.96445 1.769912,2.25039 4.001534,-3.53632 8.233934,-1.76816 4.23239,1.76816 4.61715,2.57187 6.69487,0.16074"
           id="path2500"
           style="color:#000000;fill:none;stroke:#000000;stroke-width:1px;stroke-linecap:butt;stroke-linejoin:miter;stroke-miterlimit:4;stroke-opacity:1;stroke-dasharray:none;stroke-dashoffset:0;marker:none;visibility:visible;display:inline;overflow:visible" />
      </g>
      <text
         x="424.17792"
         y="375.94485"
         id="text2502"
         xml:space="preserve"
         style="font-size:32.72175217px;font-style:normal;font-weight:normal;fill:#000000;fill-opacity:1;stroke:none;font-family:Bitstream Vera Sans"><tspan
           x="424.17792"
           y="375.94485"
           id="tspan2506">=</tspan></text>
      <text
         x="455.65686"
         y="360.34787"
         id="text2508"
         xml:space="preserve"
         style="font-size:12px;font-style:normal;font-weight:normal;fill:#000000;fill-opacity:1;stroke:none;font-family:Bitstream Vera Sans"><tspan
           x="455.65686"
           y="360.34787"
           id="tspan2510"
           style="font-weight:bold">resource records</tspan><tspan
           x="455.65686"
           y="375.34787"
           id="tspan2512">associated with name</tspan></text>
      <g
         transform="matrix(0.555556,0,0,0.555556,66.37905,-100.5757)"
         id="g2514">
        <rect
           width="35"
           height="51"
           x="28"
           y="415.36218"
           id="rect2516"
           style="color:#000000;fill:#ffffc2;fill-opacity:1;fill-rule:evenodd;stroke:#000000;stroke-width:1;stroke-linecap:butt;stroke-linejoin:miter;stroke-miterlimit:4;stroke-opacity:1;stroke-dasharray:none;stroke-dashoffset:0;marker:none;visibility:visible;display:inline;overflow:visible" />
        <path
           d="m 33.380539,437.88823 c 2.9242,4.983 9.003461,-4.66151 6.002308,-5.30448 -3.001155,-0.64297 -3.155061,6.26893 -0.384764,6.10819 2.770296,-0.16074 8.233927,-3.37558 8.233927,-3.37558 0,0 1.23124,5.78671 4.3863,3.37558"
           id="path2518"
           style="color:#000000;fill:none;stroke:#000000;stroke-width:1px;stroke-linecap:butt;stroke-linejoin:miter;stroke-miterlimit:4;stroke-opacity:1;stroke-dasharray:none;stroke-dashoffset:0;marker:none;visibility:visible;display:inline;overflow:visible" />
        <path
           d="m 32.457108,423.26072 c 2.770295,-2.57187 6.233162,6.75116 10.157742,3.69706 3.92458,-3.0541 6.38707,-7.71561 8.38784,-3.69706 2.00077,4.01854 4.5402,1.44667 4.5402,1.44667"
           id="path2520"
           style="color:#000000;fill:none;stroke:#000000;stroke-width:1px;stroke-linecap:butt;stroke-linejoin:miter;stroke-miterlimit:4;stroke-opacity:1;stroke-dasharray:none;stroke-dashoffset:0;marker:none;visibility:visible;display:inline;overflow:visible" />
        <path
           d="m 33.303587,448.97942 c 2.847247,-2.08964 3.308963,-2.25038 5.694496,-0.16074 2.385531,2.08965 4.078487,-0.32148 4.078487,-0.32148"
           id="path2522"
           style="color:#000000;fill:none;stroke:#000000;stroke-width:1px;stroke-linecap:butt;stroke-linejoin:miter;stroke-miterlimit:4;stroke-opacity:1;stroke-dasharray:none;stroke-dashoffset:0;marker:none;visibility:visible;display:inline;overflow:visible" />
        <path
           d="m 45.38515,448.33646 c 3.61677,3.05409 3.46286,0.48222 7.4644,0.48222"
           id="path2524"
           style="color:#000000;fill:none;stroke:#000000;stroke-width:1px;stroke-linecap:butt;stroke-linejoin:miter;stroke-miterlimit:4;stroke-opacity:1;stroke-dasharray:none;stroke-dashoffset:0;marker:none;visibility:visible;display:inline;overflow:visible" />
        <path
           d="m 33.534445,457.82023 c 0.769526,-5.14374 3.847631,-1.28593 5.617541,0.96445 1.769912,2.25039 4.001534,-3.53632 8.233934,-1.76816 4.23239,1.76816 4.61715,2.57187 6.69487,0.16074"
           id="path2526"
           style="color:#000000;fill:none;stroke:#000000;stroke-width:1px;stroke-linecap:butt;stroke-linejoin:miter;stroke-miterlimit:4;stroke-opacity:1;stroke-dasharray:none;stroke-dashoffset:0;marker:none;visibility:visible;display:inline;overflow:visible" />
      </g>
      <g
         transform="matrix(0.555556,0,0,0.555556,160.3791,-95.5757)"
         id="g2528">
        <rect
           width="35"
           height="51"
           x="28"
           y="415.36218"
           id="rect2530"
           style="color:#000000;fill:#ffffc2;fill-opacity:1;fill-rule:evenodd;stroke:#000000;stroke-width:1;stroke-linecap:butt;stroke-linejoin:miter;stroke-miterlimit:4;stroke-opacity:1;stroke-dasharray:none;stroke-dashoffset:0;marker:none;visibility:visible;display:inline;overflow:visible" />
        <path
           d="m 33.380539,437.88823 c 2.9242,4.983 9.003461,-4.66151 6.002308,-5.30448 -3.001155,-0.64297 -3.155061,6.26893 -0.384764,6.10819 2.770296,-0.16074 8.233927,-3.37558 8.233927,-3.37558 0,0 1.23124,5.78671 4.3863,3.37558"
           id="path2532"
           style="color:#000000;fill:none;stroke:#000000;stroke-width:1px;stroke-linecap:butt;stroke-linejoin:miter;stroke-miterlimit:4;stroke-opacity:1;stroke-dasharray:none;stroke-dashoffset:0;marker:none;visibility:visible;display:inline;overflow:visible" />
        <path
           d="m 32.457108,423.26072 c 2.770295,-2.57187 6.233162,6.75116 10.157742,3.69706 3.92458,-3.0541 6.38707,-7.71561 8.38784,-3.69706 2.00077,4.01854 4.5402,1.44667 4.5402,1.44667"
           id="path2534"
           style="color:#000000;fill:none;stroke:#000000;stroke-width:1px;stroke-linecap:butt;stroke-linejoin:miter;stroke-miterlimit:4;stroke-opacity:1;stroke-dasharray:none;stroke-dashoffset:0;marker:none;visibility:visible;display:inline;overflow:visible" />
        <path
           d="m 33.303587,448.97942 c 2.847247,-2.08964 3.308963,-2.25038 5.694496,-0.16074 2.385531,2.08965 4.078487,-0.32148 4.078487,-0.32148"
           id="path2536"
           style="color:#000000;fill:none;stroke:#000000;stroke-width:1px;stroke-linecap:butt;stroke-linejoin:miter;stroke-miterlimit:4;stroke-opacity:1;stroke-dasharray:none;stroke-dashoffset:0;marker:none;visibility:visible;display:inline;overflow:visible" />
        <path
           d="m 45.38515,448.33646 c 3.61677,3.05409 3.46286,0.48222 7.4644,0.48222"
           id="path2538"
           style="color:#000000;fill:none;stroke:#000000;stroke-width:1px;stroke-linecap:butt;stroke-linejoin:miter;stroke-miterlimit:4;stroke-opacity:1;stroke-dasharray:none;stroke-dashoffset:0;marker:none;visibility:visible;display:inline;overflow:visible" />
        <path
           d="m 33.534445,457.82023 c 0.769526,-5.14374 3.847631,-1.28593 5.617541,0.96445 1.769912,2.25039 4.001534,-3.53632 8.233934,-1.76816 4.23239,1.76816 4.61715,2.57187 6.69487,0.16074"
           id="path2540"
           style="color:#000000;fill:none;stroke:#000000;stroke-width:1px;stroke-linecap:butt;stroke-linejoin:miter;stroke-miterlimit:4;stroke-opacity:1;stroke-dasharray:none;stroke-dashoffset:0;marker:none;visibility:visible;display:inline;overflow:visible" />
      </g>
      <g
         transform="matrix(0.555556,0,0,0.555556,282.3791,-94.5757)"
         id="g2556">
        <rect
           width="35"
           height="51"
           x="28"
           y="415.36218"
           id="rect2558"
           style="color:#000000;fill:#ffffc2;fill-opacity:1;fill-rule:evenodd;stroke:#000000;stroke-width:1;stroke-linecap:butt;stroke-linejoin:miter;stroke-miterlimit:4;stroke-opacity:1;stroke-dasharray:none;stroke-dashoffset:0;marker:none;visibility:visible;display:inline;overflow:visible" />
        <path
           d="m 33.380539,437.88823 c 2.9242,4.983 9.003461,-4.66151 6.002308,-5.30448 -3.001155,-0.64297 -3.155061,6.26893 -0.384764,6.10819 2.770296,-0.16074 8.233927,-3.37558 8.233927,-3.37558 0,0 1.23124,5.78671 4.3863,3.37558"
           id="path2560"
           style="color:#000000;fill:none;stroke:#000000;stroke-width:1px;stroke-linecap:butt;stroke-linejoin:miter;stroke-miterlimit:4;stroke-opacity:1;stroke-dasharray:none;stroke-dashoffset:0;marker:none;visibility:visible;display:inline;overflow:visible" />
        <path
           d="m 32.457108,423.26072 c 2.770295,-2.57187 6.233162,6.75116 10.157742,3.69706 3.92458,-3.0541 6.38707,-7.71561 8.38784,-3.69706 2.00077,4.01854 4.5402,1.44667 4.5402,1.44667"
           id="path2562"
           style="color:#000000;fill:none;stroke:#000000;stroke-width:1px;stroke-linecap:butt;stroke-linejoin:miter;stroke-miterlimit:4;stroke-opacity:1;stroke-dasharray:none;stroke-dashoffset:0;marker:none;visibility:visible;display:inline;overflow:visible" />
        <path
           d="m 33.303587,448.97942 c 2.847247,-2.08964 3.308963,-2.25038 5.694496,-0.16074 2.385531,2.08965 4.078487,-0.32148 4.078487,-0.32148"
           id="path2564"
           style="color:#000000;fill:none;stroke:#000000;stroke-width:1px;stroke-linecap:butt;stroke-linejoin:miter;stroke-miterlimit:4;stroke-opacity:1;stroke-dasharray:none;stroke-dashoffset:0;marker:none;visibility:visible;display:inline;overflow:visible" />
        <path
           d="m 45.38515,448.33646 c 3.61677,3.05409 3.46286,0.48222 7.4644,0.48222"
           id="path2566"
           style="color:#000000;fill:none;stroke:#000000;stroke-width:1px;stroke-linecap:butt;stroke-linejoin:miter;stroke-miterlimit:4;stroke-opacity:1;stroke-dasharray:none;stroke-dashoffset:0;marker:none;visibility:visible;display:inline;overflow:visible" />
        <path
           d="m 33.534445,457.82023 c 0.769526,-5.14374 3.847631,-1.28593 5.617541,0.96445 1.769912,2.25039 4.001534,-3.53632 8.233934,-1.76816 4.23239,1.76816 4.61715,2.57187 6.69487,0.16074"
           id="path2568"
           style="color:#000000;fill:none;stroke:#000000;stroke-width:1px;stroke-linecap:butt;stroke-linejoin:miter;stroke-miterlimit:4;stroke-opacity:1;stroke-dasharray:none;stroke-dashoffset:0;marker:none;visibility:visible;display:inline;overflow:visible" />
      </g>
      <g
         transform="matrix(0.555556,0,0,0.555556,406.2075,-101.5757)"
         id="g2570">
        <rect
           width="35"
           height="51"
           x="28"
           y="415.36218"
           id="rect2572"
           style="color:#000000;fill:#ffffc2;fill-opacity:1;fill-rule:evenodd;stroke:#000000;stroke-width:1;stroke-linecap:butt;stroke-linejoin:miter;stroke-miterlimit:4;stroke-opacity:1;stroke-dasharray:none;stroke-dashoffset:0;marker:none;visibility:visible;display:inline;overflow:visible" />
        <path
           d="m 33.380539,437.88823 c 2.9242,4.983 9.003461,-4.66151 6.002308,-5.30448 -3.001155,-0.64297 -3.155061,6.26893 -0.384764,6.10819 2.770296,-0.16074 8.233927,-3.37558 8.233927,-3.37558 0,0 1.23124,5.78671 4.3863,3.37558"
           id="path2574"
           style="color:#000000;fill:none;stroke:#000000;stroke-width:1px;stroke-linecap:butt;stroke-linejoin:miter;stroke-miterlimit:4;stroke-opacity:1;stroke-dasharray:none;stroke-dashoffset:0;marker:none;visibility:visible;display:inline;overflow:visible" />
        <path
           d="m 32.457108,423.26072 c 2.770295,-2.57187 6.233162,6.75116 10.157742,3.69706 3.92458,-3.0541 6.38707,-7.71561 8.38784,-3.69706 2.00077,4.01854 4.5402,1.44667 4.5402,1.44667"
           id="path2576"
           style="color:#000000;fill:none;stroke:#000000;stroke-width:1px;stroke-linecap:butt;stroke-linejoin:miter;stroke-miterlimit:4;stroke-opacity:1;stroke-dasharray:none;stroke-dashoffset:0;marker:none;visibility:visible;display:inline;overflow:visible" />
        <path
           d="m 33.303587,448.97942 c 2.847247,-2.08964 3.308963,-2.25038 5.694496,-0.16074 2.385531,2.08965 4.078487,-0.32148 4.078487,-0.32148"
           id="path2578"
           style="color:#000000;fill:none;stroke:#000000;stroke-width:1px;stroke-linecap:butt;stroke-linejoin:miter;stroke-miterlimit:4;stroke-opacity:1;stroke-dasharray:none;stroke-dashoffset:0;marker:none;visibility:visible;display:inline;overflow:visible" />
        <path
           d="m 45.38515,448.33646 c 3.61677,3.05409 3.46286,0.48222 7.4644,0.48222"
           id="path2580"
           style="color:#000000;fill:none;stroke:#000000;stroke-width:1px;stroke-linecap:butt;stroke-linejoin:miter;stroke-miterlimit:4;stroke-opacity:1;stroke-dasharray:none;stroke-dashoffset:0;marker:none;visibility:visible;display:inline;overflow:visible" />
        <path
           d="m 33.534445,457.82023 c 0.769526,-5.14374 3.847631,-1.28593 5.617541,0.96445 1.769912,2.25039 4.001534,-3.53632 8.233934,-1.76816 4.23239,1.76816 4.61715,2.57187 6.69487,0.16074"
           id="path2582"
           style="color:#000000;fill:none;stroke:#000000;stroke-width:1px;stroke-linecap:butt;stroke-linejoin:miter;stroke-miterlimit:4;stroke-opacity:1;stroke-dasharray:none;stroke-dashoffset:0;marker:none;visibility:visible;display:inline;overflow:visible" />
      </g>
      <g
         transform="matrix(0.555556,0,0,0.555556,514.3497,-101.1615)"
         id="g2584">
        <rect
           width="35"
           height="51"
           x="28"
           y="415.36218"
           id="rect2586"
           style="color:#000000;fill:#ffffc2;fill-opacity:1;fill-rule:evenodd;stroke:#000000;stroke-width:1;stroke-linecap:butt;stroke-linejoin:miter;stroke-miterlimit:4;stroke-opacity:1;stroke-dasharray:none;stroke-dashoffset:0;marker:none;visibility:visible;display:inline;overflow:visible" />
        <path
           d="m 33.380539,437.88823 c 2.9242,4.983 9.003461,-4.66151 6.002308,-5.30448 -3.001155,-0.64297 -3.155061,6.26893 -0.384764,6.10819 2.770296,-0.16074 8.233927,-3.37558 8.233927,-3.37558 0,0 1.23124,5.78671 4.3863,3.37558"
           id="path2588"
           style="color:#000000;fill:none;stroke:#000000;stroke-width:1px;stroke-linecap:butt;stroke-linejoin:miter;stroke-miterlimit:4;stroke-opacity:1;stroke-dasharray:none;stroke-dashoffset:0;marker:none;visibility:visible;display:inline;overflow:visible" />
        <path
           d="m 32.457108,423.26072 c 2.770295,-2.57187 6.233162,6.75116 10.157742,3.69706 3.92458,-3.0541 6.38707,-7.71561 8.38784,-3.69706 2.00077,4.01854 4.5402,1.44667 4.5402,1.44667"
           id="path2590"
           style="color:#000000;fill:none;stroke:#000000;stroke-width:1px;stroke-linecap:butt;stroke-linejoin:miter;stroke-miterlimit:4;stroke-opacity:1;stroke-dasharray:none;stroke-dashoffset:0;marker:none;visibility:visible;display:inline;overflow:visible" />
        <path
           d="m 33.303587,448.97942 c 2.847247,-2.08964 3.308963,-2.25038 5.694496,-0.16074 2.385531,2.08965 4.078487,-0.32148 4.078487,-0.32148"
           id="path2592"
           style="color:#000000;fill:none;stroke:#000000;stroke-width:1px;stroke-linecap:butt;stroke-linejoin:miter;stroke-miterlimit:4;stroke-opacity:1;stroke-dasharray:none;stroke-dashoffset:0;marker:none;visibility:visible;display:inline;overflow:visible" />
        <path
           d="m 45.38515,448.33646 c 3.61677,3.05409 3.46286,0.48222 7.4644,0.48222"
           id="path2594"
           style="color:#000000;fill:none;stroke:#000000;stroke-width:1px;stroke-linecap:butt;stroke-linejoin:miter;stroke-miterlimit:4;stroke-opacity:1;stroke-dasharray:none;stroke-dashoffset:0;marker:none;visibility:visible;display:inline;overflow:visible" />
        <path
           d="m 33.534445,457.82023 c 0.769526,-5.14374 3.847631,-1.28593 5.617541,0.96445 1.769912,2.25039 4.001534,-3.53632 8.233934,-1.76816 4.23239,1.76816 4.61715,2.57187 6.69487,0.16074"
           id="path2596"
           style="color:#000000;fill:none;stroke:#000000;stroke-width:1px;stroke-linecap:butt;stroke-linejoin:miter;stroke-miterlimit:4;stroke-opacity:1;stroke-dasharray:none;stroke-dashoffset:0;marker:none;visibility:visible;display:inline;overflow:visible" />
      </g>
      <g
         transform="matrix(0.555556,0,0,0.555556,281.3791,-152.5757)"
         id="g2598">
        <rect
           width="35"
           height="51"
           x="28"
           y="415.36218"
           id="rect2600"
           style="color:#000000;fill:#ffffc2;fill-opacity:1;fill-rule:evenodd;stroke:#000000;stroke-width:1;stroke-linecap:butt;stroke-linejoin:miter;stroke-miterlimit:4;stroke-opacity:1;stroke-dasharray:none;stroke-dashoffset:0;marker:none;visibility:visible;display:inline;overflow:visible" />
        <path
           d="m 33.380539,437.88823 c 2.9242,4.983 9.003461,-4.66151 6.002308,-5.30448 -3.001155,-0.64297 -3.155061,6.26893 -0.384764,6.10819 2.770296,-0.16074 8.233927,-3.37558 8.233927,-3.37558 0,0 1.23124,5.78671 4.3863,3.37558"
           id="path2602"
           style="color:#000000;fill:none;stroke:#000000;stroke-width:1px;stroke-linecap:butt;stroke-linejoin:miter;stroke-miterlimit:4;stroke-opacity:1;stroke-dasharray:none;stroke-dashoffset:0;marker:none;visibility:visible;display:inline;overflow:visible" />
        <path
           d="m 32.457108,423.26072 c 2.770295,-2.57187 6.233162,6.75116 10.157742,3.69706 3.92458,-3.0541 6.38707,-7.71561 8.38784,-3.69706 2.00077,4.01854 4.5402,1.44667 4.5402,1.44667"
           id="path2604"
           style="color:#000000;fill:none;stroke:#000000;stroke-width:1px;stroke-linecap:butt;stroke-linejoin:miter;stroke-miterlimit:4;stroke-opacity:1;stroke-dasharray:none;stroke-dashoffset:0;marker:none;visibility:visible;display:inline;overflow:visible" />
        <path
           d="m 33.303587,448.97942 c 2.847247,-2.08964 3.308963,-2.25038 5.694496,-0.16074 2.385531,2.08965 4.078487,-0.32148 4.078487,-0.32148"
           id="path2606"
           style="color:#000000;fill:none;stroke:#000000;stroke-width:1px;stroke-linecap:butt;stroke-linejoin:miter;stroke-miterlimit:4;stroke-opacity:1;stroke-dasharray:none;stroke-dashoffset:0;marker:none;visibility:visible;display:inline;overflow:visible" />
        <path
           d="m 45.38515,448.33646 c 3.61677,3.05409 3.46286,0.48222 7.4644,0.48222"
           id="path2608"
           style="color:#000000;fill:none;stroke:#000000;stroke-width:1px;stroke-linecap:butt;stroke-linejoin:miter;stroke-miterlimit:4;stroke-opacity:1;stroke-dasharray:none;stroke-dashoffset:0;marker:none;visibility:visible;display:inline;overflow:visible" />
        <path
           d="m 33.534445,457.82023 c 0.769526,-5.14374 3.847631,-1.28593 5.617541,0.96445 1.769912,2.25039 4.001534,-3.53632 8.233934,-1.76816 4.23239,1.76816 4.61715,2.57187 6.69487,0.16074"
           id="path2610"
           style="color:#000000;fill:none;stroke:#000000;stroke-width:1px;stroke-linecap:butt;stroke-linejoin:miter;stroke-miterlimit:4;stroke-opacity:1;stroke-dasharray:none;stroke-dashoffset:0;marker:none;visibility:visible;display:inline;overflow:visible" />
      </g>
      <g
         transform="matrix(0.555556,0,0,0.555556,75.37905,19.4243)"
         id="g2612">
        <rect
           width="35"
           height="51"
           x="28"
           y="415.36218"
           id="rect2614"
           style="color:#000000;fill:#ffffc2;fill-opacity:1;fill-rule:evenodd;stroke:#000000;stroke-width:1;stroke-linecap:butt;stroke-linejoin:miter;stroke-miterlimit:4;stroke-opacity:1;stroke-dasharray:none;stroke-dashoffset:0;marker:none;visibility:visible;display:inline;overflow:visible" />
        <path
           d="m 33.380539,437.88823 c 2.9242,4.983 9.003461,-4.66151 6.002308,-5.30448 -3.001155,-0.64297 -3.155061,6.26893 -0.384764,6.10819 2.770296,-0.16074 8.233927,-3.37558 8.233927,-3.37558 0,0 1.23124,5.78671 4.3863,3.37558"
           id="path2616"
           style="color:#000000;fill:none;stroke:#000000;stroke-width:1px;stroke-linecap:butt;stroke-linejoin:miter;stroke-miterlimit:4;stroke-opacity:1;stroke-dasharray:none;stroke-dashoffset:0;marker:none;visibility:visible;display:inline;overflow:visible" />
        <path
           d="m 32.457108,423.26072 c 2.770295,-2.57187 6.233162,6.75116 10.157742,3.69706 3.92458,-3.0541 6.38707,-7.71561 8.38784,-3.69706 2.00077,4.01854 4.5402,1.44667 4.5402,1.44667"
           id="path2618"
           style="color:#000000;fill:none;stroke:#000000;stroke-width:1px;stroke-linecap:butt;stroke-linejoin:miter;stroke-miterlimit:4;stroke-opacity:1;stroke-dasharray:none;stroke-dashoffset:0;marker:none;visibility:visible;display:inline;overflow:visible" />
        <path
           d="m 33.303587,448.97942 c 2.847247,-2.08964 3.308963,-2.25038 5.694496,-0.16074 2.385531,2.08965 4.078487,-0.32148 4.078487,-0.32148"
           id="path2620"
           style="color:#000000;fill:none;stroke:#000000;stroke-width:1px;stroke-linecap:butt;stroke-linejoin:miter;stroke-miterlimit:4;stroke-opacity:1;stroke-dasharray:none;stroke-dashoffset:0;marker:none;visibility:visible;display:inline;overflow:visible" />
        <path
           d="m 45.38515,448.33646 c 3.61677,3.05409 3.46286,0.48222 7.4644,0.48222"
           id="path2622"
           style="color:#000000;fill:none;stroke:#000000;stroke-width:1px;stroke-linecap:butt;stroke-linejoin:miter;stroke-miterlimit:4;stroke-opacity:1;stroke-dasharray:none;stroke-dashoffset:0;marker:none;visibility:visible;display:inline;overflow:visible" />
        <path
           d="m 33.534445,457.82023 c 0.769526,-5.14374 3.847631,-1.28593 5.617541,0.96445 1.769912,2.25039 4.001534,-3.53632 8.233934,-1.76816 4.23239,1.76816 4.61715,2.57187 6.69487,0.16074"
           id="path2624"
           style="color:#000000;fill:none;stroke:#000000;stroke-width:1px;stroke-linecap:butt;stroke-linejoin:miter;stroke-miterlimit:4;stroke-opacity:1;stroke-dasharray:none;stroke-dashoffset:0;marker:none;visibility:visible;display:inline;overflow:visible" />
      </g>
      <g
         transform="matrix(0.555556,0,0,0.555556,109.3791,13.4243)"
         id="g2626">
        <rect
           width="35"
           height="51"
           x="28"
           y="415.36218"
           id="rect2628"
           style="color:#000000;fill:#ffffc2;fill-opacity:1;fill-rule:evenodd;stroke:#000000;stroke-width:1;stroke-linecap:butt;stroke-linejoin:miter;stroke-miterlimit:4;stroke-opacity:1;stroke-dasharray:none;stroke-dashoffset:0;marker:none;visibility:visible;display:inline;overflow:visible" />
        <path
           d="m 33.380539,437.88823 c 2.9242,4.983 9.003461,-4.66151 6.002308,-5.30448 -3.001155,-0.64297 -3.155061,6.26893 -0.384764,6.10819 2.770296,-0.16074 8.233927,-3.37558 8.233927,-3.37558 0,0 1.23124,5.78671 4.3863,3.37558"
           id="path2630"
           style="color:#000000;fill:none;stroke:#000000;stroke-width:1px;stroke-linecap:butt;stroke-linejoin:miter;stroke-miterlimit:4;stroke-opacity:1;stroke-dasharray:none;stroke-dashoffset:0;marker:none;visibility:visible;display:inline;overflow:visible" />
        <path
           d="m 32.457108,423.26072 c 2.770295,-2.57187 6.233162,6.75116 10.157742,3.69706 3.92458,-3.0541 6.38707,-7.71561 8.38784,-3.69706 2.00077,4.01854 4.5402,1.44667 4.5402,1.44667"
           id="path2632"
           style="color:#000000;fill:none;stroke:#000000;stroke-width:1px;stroke-linecap:butt;stroke-linejoin:miter;stroke-miterlimit:4;stroke-opacity:1;stroke-dasharray:none;stroke-dashoffset:0;marker:none;visibility:visible;display:inline;overflow:visible" />
        <path
           d="m 33.303587,448.97942 c 2.847247,-2.08964 3.308963,-2.25038 5.694496,-0.16074 2.385531,2.08965 4.078487,-0.32148 4.078487,-0.32148"
           id="path2634"
           style="color:#000000;fill:none;stroke:#000000;stroke-width:1px;stroke-linecap:butt;stroke-linejoin:miter;stroke-miterlimit:4;stroke-opacity:1;stroke-dasharray:none;stroke-dashoffset:0;marker:none;visibility:visible;display:inline;overflow:visible" />
        <path
           d="m 45.38515,448.33646 c 3.61677,3.05409 3.46286,0.48222 7.4644,0.48222"
           id="path2636"
           style="color:#000000;fill:none;stroke:#000000;stroke-width:1px;stroke-linecap:butt;stroke-linejoin:miter;stroke-miterlimit:4;stroke-opacity:1;stroke-dasharray:none;stroke-dashoffset:0;marker:none;visibility:visible;display:inline;overflow:visible" />
        <path
           d="m 33.534445,457.82023 c 0.769526,-5.14374 3.847631,-1.28593 5.617541,0.96445 1.769912,2.25039 4.001534,-3.53632 8.233934,-1.76816 4.23239,1.76816 4.61715,2.57187 6.69487,0.16074"
           id="path2638"
           style="color:#000000;fill:none;stroke:#000000;stroke-width:1px;stroke-linecap:butt;stroke-linejoin:miter;stroke-miterlimit:4;stroke-opacity:1;stroke-dasharray:none;stroke-dashoffset:0;marker:none;visibility:visible;display:inline;overflow:visible" />
      </g>
      <g
         transform="matrix(0.555556,0,0,0.555556,146.3791,13.4243)"
         id="g2640">
        <rect
           width="35"
           height="51"
           x="28"
           y="415.36218"
           id="rect2642"
           style="color:#000000;fill:#ffffc2;fill-opacity:1;fill-rule:evenodd;stroke:#000000;stroke-width:1;stroke-linecap:butt;stroke-linejoin:miter;stroke-miterlimit:4;stroke-opacity:1;stroke-dasharray:none;stroke-dashoffset:0;marker:none;visibility:visible;display:inline;overflow:visible" />
        <path
           d="m 33.380539,437.88823 c 2.9242,4.983 9.003461,-4.66151 6.002308,-5.30448 -3.001155,-0.64297 -3.155061,6.26893 -0.384764,6.10819 2.770296,-0.16074 8.233927,-3.37558 8.233927,-3.37558 0,0 1.23124,5.78671 4.3863,3.37558"
           id="path2644"
           style="color:#000000;fill:none;stroke:#000000;stroke-width:1px;stroke-linecap:butt;stroke-linejoin:miter;stroke-miterlimit:4;stroke-opacity:1;stroke-dasharray:none;stroke-dashoffset:0;marker:none;visibility:visible;display:inline;overflow:visible" />
        <path
           d="m 32.457108,423.26072 c 2.770295,-2.57187 6.233162,6.75116 10.157742,3.69706 3.92458,-3.0541 6.38707,-7.71561 8.38784,-3.69706 2.00077,4.01854 4.5402,1.44667 4.5402,1.44667"
           id="path2646"
           style="color:#000000;fill:none;stroke:#000000;stroke-width:1px;stroke-linecap:butt;stroke-linejoin:miter;stroke-miterlimit:4;stroke-opacity:1;stroke-dasharray:none;stroke-dashoffset:0;marker:none;visibility:visible;display:inline;overflow:visible" />
        <path
           d="m 33.303587,448.97942 c 2.847247,-2.08964 3.308963,-2.25038 5.694496,-0.16074 2.385531,2.08965 4.078487,-0.32148 4.078487,-0.32148"
           id="path2648"
           style="color:#000000;fill:none;stroke:#000000;stroke-width:1px;stroke-linecap:butt;stroke-linejoin:miter;stroke-miterlimit:4;stroke-opacity:1;stroke-dasharray:none;stroke-dashoffset:0;marker:none;visibility:visible;display:inline;overflow:visible" />
        <path
           d="m 45.38515,448.33646 c 3.61677,3.05409 3.46286,0.48222 7.4644,0.48222"
           id="path2650"
           style="color:#000000;fill:none;stroke:#000000;stroke-width:1px;stroke-linecap:butt;stroke-linejoin:miter;stroke-miterlimit:4;stroke-opacity:1;stroke-dasharray:none;stroke-dashoffset:0;marker:none;visibility:visible;display:inline;overflow:visible" />
        <path
           d="m 33.534445,457.82023 c 0.769526,-5.14374 3.847631,-1.28593 5.617541,0.96445 1.769912,2.25039 4.001534,-3.53632 8.233934,-1.76816 4.23239,1.76816 4.61715,2.57187 6.69487,0.16074"
           id="path2652"
           style="color:#000000;fill:none;stroke:#000000;stroke-width:1px;stroke-linecap:butt;stroke-linejoin:miter;stroke-miterlimit:4;stroke-opacity:1;stroke-dasharray:none;stroke-dashoffset:0;marker:none;visibility:visible;display:inline;overflow:visible" />
      </g>
      <g
         transform="matrix(0.555556,0,0,0.555556,188.3791,18.4243)"
         id="g2654">
        <rect
           width="35"
           height="51"
           x="28"
           y="415.36218"
           id="rect2656"
           style="color:#000000;fill:#ffffc2;fill-opacity:1;fill-rule:evenodd;stroke:#000000;stroke-width:1;stroke-linecap:butt;stroke-linejoin:miter;stroke-miterlimit:4;stroke-opacity:1;stroke-dasharray:none;stroke-dashoffset:0;marker:none;visibility:visible;display:inline;overflow:visible" />
        <path
           d="m 33.380539,437.88823 c 2.9242,4.983 9.003461,-4.66151 6.002308,-5.30448 -3.001155,-0.64297 -3.155061,6.26893 -0.384764,6.10819 2.770296,-0.16074 8.233927,-3.37558 8.233927,-3.37558 0,0 1.23124,5.78671 4.3863,3.37558"
           id="path2658"
           style="color:#000000;fill:none;stroke:#000000;stroke-width:1px;stroke-linecap:butt;stroke-linejoin:miter;stroke-miterlimit:4;stroke-opacity:1;stroke-dasharray:none;stroke-dashoffset:0;marker:none;visibility:visible;display:inline;overflow:visible" />
        <path
           d="m 32.457108,423.26072 c 2.770295,-2.57187 6.233162,6.75116 10.157742,3.69706 3.92458,-3.0541 6.38707,-7.71561 8.38784,-3.69706 2.00077,4.01854 4.5402,1.44667 4.5402,1.44667"
           id="path2660"
           style="color:#000000;fill:none;stroke:#000000;stroke-width:1px;stroke-linecap:butt;stroke-linejoin:miter;stroke-miterlimit:4;stroke-opacity:1;stroke-dasharray:none;stroke-dashoffset:0;marker:none;visibility:visible;display:inline;overflow:visible" />
        <path
           d="m 33.303587,448.97942 c 2.847247,-2.08964 3.308963,-2.25038 5.694496,-0.16074 2.385531,2.08965 4.078487,-0.32148 4.078487,-0.32148"
           id="path2662"
           style="color:#000000;fill:none;stroke:#000000;stroke-width:1px;stroke-linecap:butt;stroke-linejoin:miter;stroke-miterlimit:4;stroke-opacity:1;stroke-dasharray:none;stroke-dashoffset:0;marker:none;visibility:visible;display:inline;overflow:visible" />
        <path
           d="m 45.38515,448.33646 c 3.61677,3.05409 3.46286,0.48222 7.4644,0.48222"
           id="path2664"
           style="color:#000000;fill:none;stroke:#000000;stroke-width:1px;stroke-linecap:butt;stroke-linejoin:miter;stroke-miterlimit:4;stroke-opacity:1;stroke-dasharray:none;stroke-dashoffset:0;marker:none;visibility:visible;display:inline;overflow:visible" />
        <path
           d="m 33.534445,457.82023 c 0.769526,-5.14374 3.847631,-1.28593 5.617541,0.96445 1.769912,2.25039 4.001534,-3.53632 8.233934,-1.76816 4.23239,1.76816 4.61715,2.57187 6.69487,0.16074"
           id="path2666"
           style="color:#000000;fill:none;stroke:#000000;stroke-width:1px;stroke-linecap:butt;stroke-linejoin:miter;stroke-miterlimit:4;stroke-opacity:1;stroke-dasharray:none;stroke-dashoffset:0;marker:none;visibility:visible;display:inline;overflow:visible" />
      </g>
      <g
         transform="matrix(0.555556,0,0,0.555556,250.3791,11.4243)"
         id="g2696">
        <rect
           width="35"
           height="51"
           x="28"
           y="415.36218"
           id="rect2698"
           style="color:#000000;fill:#ffffc2;fill-opacity:1;fill-rule:evenodd;stroke:#000000;stroke-width:1;stroke-linecap:butt;stroke-linejoin:miter;stroke-miterlimit:4;stroke-opacity:1;stroke-dasharray:none;stroke-dashoffset:0;marker:none;visibility:visible;display:inline;overflow:visible" />
        <path
           d="m 33.380539,437.88823 c 2.9242,4.983 9.003461,-4.66151 6.002308,-5.30448 -3.001155,-0.64297 -3.155061,6.26893 -0.384764,6.10819 2.770296,-0.16074 8.233927,-3.37558 8.233927,-3.37558 0,0 1.23124,5.78671 4.3863,3.37558"
           id="path2700"
           style="color:#000000;fill:none;stroke:#000000;stroke-width:1px;stroke-linecap:butt;stroke-linejoin:miter;stroke-miterlimit:4;stroke-opacity:1;stroke-dasharray:none;stroke-dashoffset:0;marker:none;visibility:visible;display:inline;overflow:visible" />
        <path
           d="m 32.457108,423.26072 c 2.770295,-2.57187 6.233162,6.75116 10.157742,3.69706 3.92458,-3.0541 6.38707,-7.71561 8.38784,-3.69706 2.00077,4.01854 4.5402,1.44667 4.5402,1.44667"
           id="path2702"
           style="color:#000000;fill:none;stroke:#000000;stroke-width:1px;stroke-linecap:butt;stroke-linejoin:miter;stroke-miterlimit:4;stroke-opacity:1;stroke-dasharray:none;stroke-dashoffset:0;marker:none;visibility:visible;display:inline;overflow:visible" />
        <path
           d="m 33.303587,448.97942 c 2.847247,-2.08964 3.308963,-2.25038 5.694496,-0.16074 2.385531,2.08965 4.078487,-0.32148 4.078487,-0.32148"
           id="path2704"
           style="color:#000000;fill:none;stroke:#000000;stroke-width:1px;stroke-linecap:butt;stroke-linejoin:miter;stroke-miterlimit:4;stroke-opacity:1;stroke-dasharray:none;stroke-dashoffset:0;marker:none;visibility:visible;display:inline;overflow:visible" />
        <path
           d="m 45.38515,448.33646 c 3.61677,3.05409 3.46286,0.48222 7.4644,0.48222"
           id="path2706"
           style="color:#000000;fill:none;stroke:#000000;stroke-width:1px;stroke-linecap:butt;stroke-linejoin:miter;stroke-miterlimit:4;stroke-opacity:1;stroke-dasharray:none;stroke-dashoffset:0;marker:none;visibility:visible;display:inline;overflow:visible" />
        <path
           d="m 33.534445,457.82023 c 0.769526,-5.14374 3.847631,-1.28593 5.617541,0.96445 1.769912,2.25039 4.001534,-3.53632 8.233934,-1.76816 4.23239,1.76816 4.61715,2.57187 6.69487,0.16074"
           id="path2708"
           style="color:#000000;fill:none;stroke:#000000;stroke-width:1px;stroke-linecap:butt;stroke-linejoin:miter;stroke-miterlimit:4;stroke-opacity:1;stroke-dasharray:none;stroke-dashoffset:0;marker:none;visibility:visible;display:inline;overflow:visible" />
      </g>
      <g
         transform="matrix(0.555556,0,0,0.555556,283.3791,9.4243)"
         id="g2710">
        <rect
           width="35"
           height="51"
           x="28"
           y="415.36218"
           id="rect2712"
           style="color:#000000;fill:#ffffc2;fill-opacity:1;fill-rule:evenodd;stroke:#000000;stroke-width:1;stroke-linecap:butt;stroke-linejoin:miter;stroke-miterlimit:4;stroke-opacity:1;stroke-dasharray:none;stroke-dashoffset:0;marker:none;visibility:visible;display:inline;overflow:visible" />
        <path
           d="m 33.380539,437.88823 c 2.9242,4.983 9.003461,-4.66151 6.002308,-5.30448 -3.001155,-0.64297 -3.155061,6.26893 -0.384764,6.10819 2.770296,-0.16074 8.233927,-3.37558 8.233927,-3.37558 0,0 1.23124,5.78671 4.3863,3.37558"
           id="path2714"
           style="color:#000000;fill:none;stroke:#000000;stroke-width:1px;stroke-linecap:butt;stroke-linejoin:miter;stroke-miterlimit:4;stroke-opacity:1;stroke-dasharray:none;stroke-dashoffset:0;marker:none;visibility:visible;display:inline;overflow:visible" />
        <path
           d="m 32.457108,423.26072 c 2.770295,-2.57187 6.233162,6.75116 10.157742,3.69706 3.92458,-3.0541 6.38707,-7.71561 8.38784,-3.69706 2.00077,4.01854 4.5402,1.44667 4.5402,1.44667"
           id="path2716"
           style="color:#000000;fill:none;stroke:#000000;stroke-width:1px;stroke-linecap:butt;stroke-linejoin:miter;stroke-miterlimit:4;stroke-opacity:1;stroke-dasharray:none;stroke-dashoffset:0;marker:none;visibility:visible;display:inline;overflow:visible" />
        <path
           d="m 33.303587,448.97942 c 2.847247,-2.08964 3.308963,-2.25038 5.694496,-0.16074 2.385531,2.08965 4.078487,-0.32148 4.078487,-0.32148"
           id="path2718"
           style="color:#000000;fill:none;stroke:#000000;stroke-width:1px;stroke-linecap:butt;stroke-linejoin:miter;stroke-miterlimit:4;stroke-opacity:1;stroke-dasharray:none;stroke-dashoffset:0;marker:none;visibility:visible;display:inline;overflow:visible" />
        <path
           d="m 45.38515,448.33646 c 3.61677,3.05409 3.46286,0.48222 7.4644,0.48222"
           id="path2720"
           style="color:#000000;fill:none;stroke:#000000;stroke-width:1px;stroke-linecap:butt;stroke-linejoin:miter;stroke-miterlimit:4;stroke-opacity:1;stroke-dasharray:none;stroke-dashoffset:0;marker:none;visibility:visible;display:inline;overflow:visible" />
        <path
           d="m 33.534445,457.82023 c 0.769526,-5.14374 3.847631,-1.28593 5.617541,0.96445 1.769912,2.25039 4.001534,-3.53632 8.233934,-1.76816 4.23239,1.76816 4.61715,2.57187 6.69487,0.16074"
           id="path2722"
           style="color:#000000;fill:none;stroke:#000000;stroke-width:1px;stroke-linecap:butt;stroke-linejoin:miter;stroke-miterlimit:4;stroke-opacity:1;stroke-dasharray:none;stroke-dashoffset:0;marker:none;visibility:visible;display:inline;overflow:visible" />
      </g>
      <g
         transform="matrix(0.555556,0,0,0.555556,323.3791,12.4243)"
         id="g2724">
        <rect
           width="35"
           height="51"
           x="28"
           y="415.36218"
           id="rect2726"
           style="color:#000000;fill:#ffffc2;fill-opacity:1;fill-rule:evenodd;stroke:#000000;stroke-width:1;stroke-linecap:butt;stroke-linejoin:miter;stroke-miterlimit:4;stroke-opacity:1;stroke-dasharray:none;stroke-dashoffset:0;marker:none;visibility:visible;display:inline;overflow:visible" />
        <path
           d="m 33.380539,437.88823 c 2.9242,4.983 9.003461,-4.66151 6.002308,-5.30448 -3.001155,-0.64297 -3.155061,6.26893 -0.384764,6.10819 2.770296,-0.16074 8.233927,-3.37558 8.233927,-3.37558 0,0 1.23124,5.78671 4.3863,3.37558"
           id="path2728"
           style="color:#000000;fill:none;stroke:#000000;stroke-width:1px;stroke-linecap:butt;stroke-linejoin:miter;stroke-miterlimit:4;stroke-opacity:1;stroke-dasharray:none;stroke-dashoffset:0;marker:none;visibility:visible;display:inline;overflow:visible" />
        <path
           d="m 32.457108,423.26072 c 2.770295,-2.57187 6.233162,6.75116 10.157742,3.69706 3.92458,-3.0541 6.38707,-7.71561 8.38784,-3.69706 2.00077,4.01854 4.5402,1.44667 4.5402,1.44667"
           id="path2730"
           style="color:#000000;fill:none;stroke:#000000;stroke-width:1px;stroke-linecap:butt;stroke-linejoin:miter;stroke-miterlimit:4;stroke-opacity:1;stroke-dasharray:none;stroke-dashoffset:0;marker:none;visibility:visible;display:inline;overflow:visible" />
        <path
           d="m 33.303587,448.97942 c 2.847247,-2.08964 3.308963,-2.25038 5.694496,-0.16074 2.385531,2.08965 4.078487,-0.32148 4.078487,-0.32148"
           id="path2732"
           style="color:#000000;fill:none;stroke:#000000;stroke-width:1px;stroke-linecap:butt;stroke-linejoin:miter;stroke-miterlimit:4;stroke-opacity:1;stroke-dasharray:none;stroke-dashoffset:0;marker:none;visibility:visible;display:inline;overflow:visible" />
        <path
           d="m 45.38515,448.33646 c 3.61677,3.05409 3.46286,0.48222 7.4644,0.48222"
           id="path2734"
           style="color:#000000;fill:none;stroke:#000000;stroke-width:1px;stroke-linecap:butt;stroke-linejoin:miter;stroke-miterlimit:4;stroke-opacity:1;stroke-dasharray:none;stroke-dashoffset:0;marker:none;visibility:visible;display:inline;overflow:visible" />
        <path
           d="m 33.534445,457.82023 c 0.769526,-5.14374 3.847631,-1.28593 5.617541,0.96445 1.769912,2.25039 4.001534,-3.53632 8.233934,-1.76816 4.23239,1.76816 4.61715,2.57187 6.69487,0.16074"
           id="path2736"
           style="color:#000000;fill:none;stroke:#000000;stroke-width:1px;stroke-linecap:butt;stroke-linejoin:miter;stroke-miterlimit:4;stroke-opacity:1;stroke-dasharray:none;stroke-dashoffset:0;marker:none;visibility:visible;display:inline;overflow:visible" />
      </g>
      <g
         transform="matrix(0.555556,0,0,0.555556,349.3791,12.4243)"
         id="g2738">
        <rect
           width="35"
           height="51"
           x="28"
           y="415.36218"
           id="rect2740"
           style="color:#000000;fill:#ffffc2;fill-opacity:1;fill-rule:evenodd;stroke:#000000;stroke-width:1;stroke-linecap:butt;stroke-linejoin:miter;stroke-miterlimit:4;stroke-opacity:1;stroke-dasharray:none;stroke-dashoffset:0;marker:none;visibility:visible;display:inline;overflow:visible" />
        <path
           d="m 33.380539,437.88823 c 2.9242,4.983 9.003461,-4.66151 6.002308,-5.30448 -3.001155,-0.64297 -3.155061,6.26893 -0.384764,6.10819 2.770296,-0.16074 8.233927,-3.37558 8.233927,-3.37558 0,0 1.23124,5.78671 4.3863,3.37558"
           id="path2742"
           style="color:#000000;fill:none;stroke:#000000;stroke-width:1px;stroke-linecap:butt;stroke-linejoin:miter;stroke-miterlimit:4;stroke-opacity:1;stroke-dasharray:none;stroke-dashoffset:0;marker:none;visibility:visible;display:inline;overflow:visible" />
        <path
           d="m 32.457108,423.26072 c 2.770295,-2.57187 6.233162,6.75116 10.157742,3.69706 3.92458,-3.0541 6.38707,-7.71561 8.38784,-3.69706 2.00077,4.01854 4.5402,1.44667 4.5402,1.44667"
           id="path2744"
           style="color:#000000;fill:none;stroke:#000000;stroke-width:1px;stroke-linecap:butt;stroke-linejoin:miter;stroke-miterlimit:4;stroke-opacity:1;stroke-dasharray:none;stroke-dashoffset:0;marker:none;visibility:visible;display:inline;overflow:visible" />
        <path
           d="m 33.303587,448.97942 c 2.847247,-2.08964 3.308963,-2.25038 5.694496,-0.16074 2.385531,2.08965 4.078487,-0.32148 4.078487,-0.32148"
           id="path2746"
           style="color:#000000;fill:none;stroke:#000000;stroke-width:1px;stroke-linecap:butt;stroke-linejoin:miter;stroke-miterlimit:4;stroke-opacity:1;stroke-dasharray:none;stroke-dashoffset:0;marker:none;visibility:visible;display:inline;overflow:visible" />
        <path
           d="m 45.38515,448.33646 c 3.61677,3.05409 3.46286,0.48222 7.4644,0.48222"
           id="path2748"
           style="color:#000000;fill:none;stroke:#000000;stroke-width:1px;stroke-linecap:butt;stroke-linejoin:miter;stroke-miterlimit:4;stroke-opacity:1;stroke-dasharray:none;stroke-dashoffset:0;marker:none;visibility:visible;display:inline;overflow:visible" />
        <path
           d="m 33.534445,457.82023 c 0.769526,-5.14374 3.847631,-1.28593 5.617541,0.96445 1.769912,2.25039 4.001534,-3.53632 8.233934,-1.76816 4.23239,1.76816 4.61715,2.57187 6.69487,0.16074"
           id="path2750"
           style="color:#000000;fill:none;stroke:#000000;stroke-width:1px;stroke-linecap:butt;stroke-linejoin:miter;stroke-miterlimit:4;stroke-opacity:1;stroke-dasharray:none;stroke-dashoffset:0;marker:none;visibility:visible;display:inline;overflow:visible" />
      </g>
      <g
         transform="matrix(0.555556,0,0,0.555556,408.3791,5.4243)"
         id="g2752">
        <rect
           width="35"
           height="51"
           x="28"
           y="415.36218"
           id="rect2754"
           style="color:#000000;fill:#ffffc2;fill-opacity:1;fill-rule:evenodd;stroke:#000000;stroke-width:1;stroke-linecap:butt;stroke-linejoin:miter;stroke-miterlimit:4;stroke-opacity:1;stroke-dasharray:none;stroke-dashoffset:0;marker:none;visibility:visible;display:inline;overflow:visible" />
        <path
           d="m 33.380539,437.88823 c 2.9242,4.983 9.003461,-4.66151 6.002308,-5.30448 -3.001155,-0.64297 -3.155061,6.26893 -0.384764,6.10819 2.770296,-0.16074 8.233927,-3.37558 8.233927,-3.37558 0,0 1.23124,5.78671 4.3863,3.37558"
           id="path2756"
           style="color:#000000;fill:none;stroke:#000000;stroke-width:1px;stroke-linecap:butt;stroke-linejoin:miter;stroke-miterlimit:4;stroke-opacity:1;stroke-dasharray:none;stroke-dashoffset:0;marker:none;visibility:visible;display:inline;overflow:visible" />
        <path
           d="m 32.457108,423.26072 c 2.770295,-2.57187 6.233162,6.75116 10.157742,3.69706 3.92458,-3.0541 6.38707,-7.71561 8.38784,-3.69706 2.00077,4.01854 4.5402,1.44667 4.5402,1.44667"
           id="path2758"
           style="color:#000000;fill:none;stroke:#000000;stroke-width:1px;stroke-linecap:butt;stroke-linejoin:miter;stroke-miterlimit:4;stroke-opacity:1;stroke-dasharray:none;stroke-dashoffset:0;marker:none;visibility:visible;display:inline;overflow:visible" />
        <path
           d="m 33.303587,448.97942 c 2.847247,-2.08964 3.308963,-2.25038 5.694496,-0.16074 2.385531,2.08965 4.078487,-0.32148 4.078487,-0.32148"
           id="path2760"
           style="color:#000000;fill:none;stroke:#000000;stroke-width:1px;stroke-linecap:butt;stroke-linejoin:miter;stroke-miterlimit:4;stroke-opacity:1;stroke-dasharray:none;stroke-dashoffset:0;marker:none;visibility:visible;display:inline;overflow:visible" />
        <path
           d="m 45.38515,448.33646 c 3.61677,3.05409 3.46286,0.48222 7.4644,0.48222"
           id="path2762"
           style="color:#000000;fill:none;stroke:#000000;stroke-width:1px;stroke-linecap:butt;stroke-linejoin:miter;stroke-miterlimit:4;stroke-opacity:1;stroke-dasharray:none;stroke-dashoffset:0;marker:none;visibility:visible;display:inline;overflow:visible" />
        <path
           d="m 33.534445,457.82023 c 0.769526,-5.14374 3.847631,-1.28593 5.617541,0.96445 1.769912,2.25039 4.001534,-3.53632 8.233934,-1.76816 4.23239,1.76816 4.61715,2.57187 6.69487,0.16074"
           id="path2764"
           style="color:#000000;fill:none;stroke:#000000;stroke-width:1px;stroke-linecap:butt;stroke-linejoin:miter;stroke-miterlimit:4;stroke-opacity:1;stroke-dasharray:none;stroke-dashoffset:0;marker:none;visibility:visible;display:inline;overflow:visible" />
      </g>
      <g
         transform="matrix(0.555556,0,0,0.555556,455.3791,15.4243)"
         id="g2766">
        <rect
           width="35"
           height="51"
           x="28"
           y="415.36218"
           id="rect2768"
           style="color:#000000;fill:#ffffc2;fill-opacity:1;fill-rule:evenodd;stroke:#000000;stroke-width:1;stroke-linecap:butt;stroke-linejoin:miter;stroke-miterlimit:4;stroke-opacity:1;stroke-dasharray:none;stroke-dashoffset:0;marker:none;visibility:visible;display:inline;overflow:visible" />
        <path
           d="m 33.380539,437.88823 c 2.9242,4.983 9.003461,-4.66151 6.002308,-5.30448 -3.001155,-0.64297 -3.155061,6.26893 -0.384764,6.10819 2.770296,-0.16074 8.233927,-3.37558 8.233927,-3.37558 0,0 1.23124,5.78671 4.3863,3.37558"
           id="path2770"
           style="color:#000000;fill:none;stroke:#000000;stroke-width:1px;stroke-linecap:butt;stroke-linejoin:miter;stroke-miterlimit:4;stroke-opacity:1;stroke-dasharray:none;stroke-dashoffset:0;marker:none;visibility:visible;display:inline;overflow:visible" />
        <path
           d="m 32.457108,423.26072 c 2.770295,-2.57187 6.233162,6.75116 10.157742,3.69706 3.92458,-3.0541 6.38707,-7.71561 8.38784,-3.69706 2.00077,4.01854 4.5402,1.44667 4.5402,1.44667"
           id="path2772"
           style="color:#000000;fill:none;stroke:#000000;stroke-width:1px;stroke-linecap:butt;stroke-linejoin:miter;stroke-miterlimit:4;stroke-opacity:1;stroke-dasharray:none;stroke-dashoffset:0;marker:none;visibility:visible;display:inline;overflow:visible" />
        <path
           d="m 33.303587,448.97942 c 2.847247,-2.08964 3.308963,-2.25038 5.694496,-0.16074 2.385531,2.08965 4.078487,-0.32148 4.078487,-0.32148"
           id="path2774"
           style="color:#000000;fill:none;stroke:#000000;stroke-width:1px;stroke-linecap:butt;stroke-linejoin:miter;stroke-miterlimit:4;stroke-opacity:1;stroke-dasharray:none;stroke-dashoffset:0;marker:none;visibility:visible;display:inline;overflow:visible" />
        <path
           d="m 45.38515,448.33646 c 3.61677,3.05409 3.46286,0.48222 7.4644,0.48222"
           id="path2776"
           style="color:#000000;fill:none;stroke:#000000;stroke-width:1px;stroke-linecap:butt;stroke-linejoin:miter;stroke-miterlimit:4;stroke-opacity:1;stroke-dasharray:none;stroke-dashoffset:0;marker:none;visibility:visible;display:inline;overflow:visible" />
        <path
           d="m 33.534445,457.82023 c 0.769526,-5.14374 3.847631,-1.28593 5.617541,0.96445 1.769912,2.25039 4.001534,-3.53632 8.233934,-1.76816 4.23239,1.76816 4.61715,2.57187 6.69487,0.16074"
           id="path2778"
           style="color:#000000;fill:none;stroke:#000000;stroke-width:1px;stroke-linecap:butt;stroke-linejoin:miter;stroke-miterlimit:4;stroke-opacity:1;stroke-dasharray:none;stroke-dashoffset:0;marker:none;visibility:visible;display:inline;overflow:visible" />
      </g>
      <g
         transform="matrix(0.555556,0,0,0.555556,493.3791,11.4243)"
         id="g2780">
        <rect
           width="35"
           height="51"
           x="28"
           y="415.36218"
           id="rect2782"
           style="color:#000000;fill:#ffffc2;fill-opacity:1;fill-rule:evenodd;stroke:#000000;stroke-width:1;stroke-linecap:butt;stroke-linejoin:miter;stroke-miterlimit:4;stroke-opacity:1;stroke-dasharray:none;stroke-dashoffset:0;marker:none;visibility:visible;display:inline;overflow:visible" />
        <path
           d="m 33.380539,437.88823 c 2.9242,4.983 9.003461,-4.66151 6.002308,-5.30448 -3.001155,-0.64297 -3.155061,6.26893 -0.384764,6.10819 2.770296,-0.16074 8.233927,-3.37558 8.233927,-3.37558 0,0 1.23124,5.78671 4.3863,3.37558"
           id="path2784"
           style="color:#000000;fill:none;stroke:#000000;stroke-width:1px;stroke-linecap:butt;stroke-linejoin:miter;stroke-miterlimit:4;stroke-opacity:1;stroke-dasharray:none;stroke-dashoffset:0;marker:none;visibility:visible;display:inline;overflow:visible" />
        <path
           d="m 32.457108,423.26072 c 2.770295,-2.57187 6.233162,6.75116 10.157742,3.69706 3.92458,-3.0541 6.38707,-7.71561 8.38784,-3.69706 2.00077,4.01854 4.5402,1.44667 4.5402,1.44667"
           id="path2786"
           style="color:#000000;fill:none;stroke:#000000;stroke-width:1px;stroke-linecap:butt;stroke-linejoin:miter;stroke-miterlimit:4;stroke-opacity:1;stroke-dasharray:none;stroke-dashoffset:0;marker:none;visibility:visible;display:inline;overflow:visible" />
        <path
           d="m 33.303587,448.97942 c 2.847247,-2.08964 3.308963,-2.25038 5.694496,-0.16074 2.385531,2.08965 4.078487,-0.32148 4.078487,-0.32148"
           id="path2788"
           style="color:#000000;fill:none;stroke:#000000;stroke-width:1px;stroke-linecap:butt;stroke-linejoin:miter;stroke-miterlimit:4;stroke-opacity:1;stroke-dasharray:none;stroke-dashoffset:0;marker:none;visibility:visible;display:inline;overflow:visible" />
        <path
           d="m 45.38515,448.33646 c 3.61677,3.05409 3.46286,0.48222 7.4644,0.48222"
           id="path2790"
           style="color:#000000;fill:none;stroke:#000000;stroke-width:1px;stroke-linecap:butt;stroke-linejoin:miter;stroke-miterlimit:4;stroke-opacity:1;stroke-dasharray:none;stroke-dashoffset:0;marker:none;visibility:visible;display:inline;overflow:visible" />
        <path
           d="m 33.534445,457.82023 c 0.769526,-5.14374 3.847631,-1.28593 5.617541,0.96445 1.769912,2.25039 4.001534,-3.53632 8.233934,-1.76816 4.23239,1.76816 4.61715,2.57187 6.69487,0.16074"
           id="path2792"
           style="color:#000000;fill:none;stroke:#000000;stroke-width:1px;stroke-linecap:butt;stroke-linejoin:miter;stroke-miterlimit:4;stroke-opacity:1;stroke-dasharray:none;stroke-dashoffset:0;marker:none;visibility:visible;display:inline;overflow:visible" />
      </g>
      <g
         transform="matrix(0.555556,0,0,0.555556,542.3791,11.4243)"
         id="g2794">
        <rect
           width="35"
           height="51"
           x="28"
           y="415.36218"
           id="rect2796"
           style="color:#000000;fill:#ffffc2;fill-opacity:1;fill-rule:evenodd;stroke:#000000;stroke-width:1;stroke-linecap:butt;stroke-linejoin:miter;stroke-miterlimit:4;stroke-opacity:1;stroke-dasharray:none;stroke-dashoffset:0;marker:none;visibility:visible;display:inline;overflow:visible" />
        <path
           d="m 33.380539,437.88823 c 2.9242,4.983 9.003461,-4.66151 6.002308,-5.30448 -3.001155,-0.64297 -3.155061,6.26893 -0.384764,6.10819 2.770296,-0.16074 8.233927,-3.37558 8.233927,-3.37558 0,0 1.23124,5.78671 4.3863,3.37558"
           id="path2798"
           style="color:#000000;fill:none;stroke:#000000;stroke-width:1px;stroke-linecap:butt;stroke-linejoin:miter;stroke-miterlimit:4;stroke-opacity:1;stroke-dasharray:none;stroke-dashoffset:0;marker:none;visibility:visible;display:inline;overflow:visible" />
        <path
           d="m 32.457108,423.26072 c 2.770295,-2.57187 6.233162,6.75116 10.157742,3.69706 3.92458,-3.0541 6.38707,-7.71561 8.38784,-3.69706 2.00077,4.01854 4.5402,1.44667 4.5402,1.44667"
           id="path2800"
           style="color:#000000;fill:none;stroke:#000000;stroke-width:1px;stroke-linecap:butt;stroke-linejoin:miter;stroke-miterlimit:4;stroke-opacity:1;stroke-dasharray:none;stroke-dashoffset:0;marker:none;visibility:visible;display:inline;overflow:visible" />
        <path
           d="m 33.303587,448.97942 c 2.847247,-2.08964 3.308963,-2.25038 5.694496,-0.16074 2.385531,2.08965 4.078487,-0.32148 4.078487,-0.32148"
           id="path2802"
           style="color:#000000;fill:none;stroke:#000000;stroke-width:1px;stroke-linecap:butt;stroke-linejoin:miter;stroke-miterlimit:4;stroke-opacity:1;stroke-dasharray:none;stroke-dashoffset:0;marker:none;visibility:visible;display:inline;overflow:visible" />
        <path
           d="m 45.38515,448.33646 c 3.61677,3.05409 3.46286,0.48222 7.4644,0.48222"
           id="path2804"
           style="color:#000000;fill:none;stroke:#000000;stroke-width:1px;stroke-linecap:butt;stroke-linejoin:miter;stroke-miterlimit:4;stroke-opacity:1;stroke-dasharray:none;stroke-dashoffset:0;marker:none;visibility:visible;display:inline;overflow:visible" />
        <path
           d="m 33.534445,457.82023 c 0.769526,-5.14374 3.847631,-1.28593 5.617541,0.96445 1.769912,2.25039 4.001534,-3.53632 8.233934,-1.76816 4.23239,1.76816 4.61715,2.57187 6.69487,0.16074"
           id="path2806"
           style="color:#000000;fill:none;stroke:#000000;stroke-width:1px;stroke-linecap:butt;stroke-linejoin:miter;stroke-miterlimit:4;stroke-opacity:1;stroke-dasharray:none;stroke-dashoffset:0;marker:none;visibility:visible;display:inline;overflow:visible" />
      </g>
      <g
         transform="matrix(0.555556,0,0,0.555556,591.3791,6.4243)"
         id="g2808">
        <rect
           width="35"
           height="51"
           x="28"
           y="415.36218"
           id="rect2810"
           style="color:#000000;fill:#ffffc2;fill-opacity:1;fill-rule:evenodd;stroke:#000000;stroke-width:1;stroke-linecap:butt;stroke-linejoin:miter;stroke-miterlimit:4;stroke-opacity:1;stroke-dasharray:none;stroke-dashoffset:0;marker:none;visibility:visible;display:inline;overflow:visible" />
        <path
           d="m 33.380539,437.88823 c 2.9242,4.983 9.003461,-4.66151 6.002308,-5.30448 -3.001155,-0.64297 -3.155061,6.26893 -0.384764,6.10819 2.770296,-0.16074 8.233927,-3.37558 8.233927,-3.37558 0,0 1.23124,5.78671 4.3863,3.37558"
           id="path2812"
           style="color:#000000;fill:none;stroke:#000000;stroke-width:1px;stroke-linecap:butt;stroke-linejoin:miter;stroke-miterlimit:4;stroke-opacity:1;stroke-dasharray:none;stroke-dashoffset:0;marker:none;visibility:visible;display:inline;overflow:visible" />
        <path
           d="m 32.457108,423.26072 c 2.770295,-2.57187 6.233162,6.75116 10.157742,3.69706 3.92458,-3.0541 6.38707,-7.71561 8.38784,-3.69706 2.00077,4.01854 4.5402,1.44667 4.5402,1.44667"
           id="path2814"
           style="color:#000000;fill:none;stroke:#000000;stroke-width:1px;stroke-linecap:butt;stroke-linejoin:miter;stroke-miterlimit:4;stroke-opacity:1;stroke-dasharray:none;stroke-dashoffset:0;marker:none;visibility:visible;display:inline;overflow:visible" />
        <path
           d="m 33.303587,448.97942 c 2.847247,-2.08964 3.308963,-2.25038 5.694496,-0.16074 2.385531,2.08965 4.078487,-0.32148 4.078487,-0.32148"
           id="path2816"
           style="color:#000000;fill:none;stroke:#000000;stroke-width:1px;stroke-linecap:butt;stroke-linejoin:miter;stroke-miterlimit:4;stroke-opacity:1;stroke-dasharray:none;stroke-dashoffset:0;marker:none;visibility:visible;display:inline;overflow:visible" />
        <path
           d="m 45.38515,448.33646 c 3.61677,3.05409 3.46286,0.48222 7.4644,0.48222"
           id="path2818"
           style="color:#000000;fill:none;stroke:#000000;stroke-width:1px;stroke-linecap:butt;stroke-linejoin:miter;stroke-miterlimit:4;stroke-opacity:1;stroke-dasharray:none;stroke-dashoffset:0;marker:none;visibility:visible;display:inline;overflow:visible" />
        <path
           d="m 33.534445,457.82023 c 0.769526,-5.14374 3.847631,-1.28593 5.617541,0.96445 1.769912,2.25039 4.001534,-3.53632 8.233934,-1.76816 4.23239,1.76816 4.61715,2.57187 6.69487,0.16074"
           id="path2820"
           style="color:#000000;fill:none;stroke:#000000;stroke-width:1px;stroke-linecap:butt;stroke-linejoin:miter;stroke-miterlimit:4;stroke-opacity:1;stroke-dasharray:none;stroke-dashoffset:0;marker:none;visibility:visible;display:inline;overflow:visible" />
      </g>
      <path
         d="m 73.656854,121.34788 c -20.619874,22.14604 -37.807174,51.17073 -42.797366,79.80841 -4.697473,26.95784 -12.925403,63.20401 6.830841,85.20036 20.194295,22.48407 54.319171,9.84399 81.485841,11.19893 30.99623,1.54593 32.14483,-38.08085 31.22253,-61.83864 -1.06347,-27.39402 -3.87532,-56.79948 -13.28536,-81.21369 -9.41004,-24.41421 -18.75618,-61.88274 -49.936923,-45.20922 -5.371409,2.8723 -9.398755,7.62804 -13.519563,12.05385 z"
         id="path2826"
         style="fill:none;stroke:#000000;stroke-width:2;stroke-linecap:butt;stroke-linejoin:miter;stroke-miterlimit:4;stroke-opacity:1;stroke-dasharray:8, 2;stroke-dashoffset:0" />
      <path
         d="m 286.51565,70.52742 c -6.42868,4.52855 -9.85125,11.90192 -12.94051,18.87999 -5.3822,7.92445 -1.54163,20.26111 7.38254,23.73769 7.66326,4.8156 17.02204,4.81935 25.75764,5.22532 8.15716,-1.02645 17.05585,-0.55793 24.18908,-5.31319 5.82701,-4.05553 6.75355,-11.97117 5.80138,-18.48666 -1.00592,-8.43314 -3.9741,-16.46399 -7.16514,-24.28117 -2.69779,-3.84179 -7.88678,-3.60666 -12.05883,-3.56654 -10.41927,-0.42902 -21.11669,0.06474 -30.96616,3.80456 z"
         id="path2862"
         style="fill:none;stroke:#000000;stroke-width:2;stroke-linecap:butt;stroke-linejoin:miter;stroke-miterlimit:4;stroke-opacity:1;stroke-dasharray:8, 2;stroke-dashoffset:0" />
      <path
         d="m 169.65685,116.34788 c -13.6799,10.00789 -11.05181,42.34392 -4.20219,51.9429 6.84962,9.59897 34.75666,16.34578 44.68688,6.76616 9.93021,-9.57962 8.94838,-17.43766 9.3022,-27.25144 0.35382,-9.81378 -4.24517,-20.17427 -12.36425,-26.16856 -8.11908,-5.99429 -24.40242,-14.81435 -37.42264,-5.28906 z"
         id="path2864"
         style="fill:none;stroke:#000000;stroke-width:2;stroke-linecap:butt;stroke-linejoin:miter;stroke-miterlimit:4;stroke-opacity:1;stroke-dasharray:8, 2;stroke-dashoffset:0" />
      <path
         d="m 340.65685,144.34788 c -10.0101,-8.26649 -21.22228,-19.34034 -35.42704,-16.69196 -21.27965,3.13379 -36.22446,23.8106 -37.84474,44.41587 -3.69499,20.64751 -2.67236,42.46402 -11.40402,61.96286 -8.86929,35.48633 22.76384,73.99883 59.16074,72.9115 24.09137,2.52644 51.1494,-1.04249 69.04303,-18.8758 11.39764,-11.00768 13.6704,-28.41412 9.94257,-43.23629 -5.57569,-38.60089 -28.91915,-71.40067 -53.47054,-100.48618 z"
         id="path2876"
         style="fill:none;stroke:#000000;stroke-width:2;stroke-linecap:butt;stroke-linejoin:miter;stroke-miterlimit:4;stroke-opacity:1;stroke-dasharray:8, 2;stroke-dashoffset:0" />
      <text
         x="628.00928"
         y="480.67679"
         id="text2882"
         xml:space="preserve"
         style="font-size:12px;font-style:normal;font-weight:normal;text-align:end;line-height:125%;writing-mode:lr-tb;text-anchor:end;fill:#000000;fill-opacity:1;stroke:none;font-family:Bitstream Vera Sans"><tspan
           x="628.00928"
           y="480.67679"
           id="tspan2884">see also: RFC 1034 4.2:</tspan><tspan
           x="628.00928"
           y="495.67679"
           id="tspan4586">How the database is divided into zones.</tspan></text>
      <path
         d="m 476.58996,141.60862 c -9.3513,-10.67404 -24.48341,-17.74783 -40.05724,-20.14314 -17.41088,-2.67786 -38.40476,5.1548 -42.18979,23.74729 -3.98389,19.56929 1.88607,39.31089 9.92408,57.08027 8.07622,17.85387 6.91609,38.4285 13.66398,56.84257 3.39151,9.25498 0.45146,22.37521 9.9104,28.59521 9.49188,6.24166 20.35909,9.67865 30.85736,13.61872 18.3008,6.86841 38.68999,0.49096 57.92169,2.2513 10.2135,0.93488 13.42147,-13.42157 12.15482,-22.9732 -3.0783,-23.21295 3.19391,-48.32165 -6.14756,-70.95303 -10.62311,-25.73641 -28.82324,-48.4165 -46.03774,-68.06599 z"
         id="path2888"
         style="fill:none;stroke:#000000;stroke-width:2;stroke-linecap:butt;stroke-linejoin:miter;stroke-miterlimit:4;stroke-opacity:1;stroke-dasharray:8, 2;stroke-dashoffset:0" />
      <path
         d="m 598.21233,135.95179 c -14.81123,-15.37571 -37.61025,-24.85124 -58.85478,-19.10718 -17.81755,7.77732 -23.14045,31.96199 -14.46537,48.33181 8.41228,23.15356 17.74305,46.4247 19.81659,71.20334 3.62741,17.5152 7.90391,36.77626 21.92264,49.09427 14.47784,10.492 33.92328,9.08902 49.97143,3.43265 12.27753,-1.71395 26.77458,-6.95242 30.58008,-20.10887 6.47275,-20.39331 -0.9668,-41.60199 -7.96258,-60.79785 -9.69161,-25.99341 -23.14655,-50.74206 -41.00801,-72.04817 z"
         id="path2890"
         style="fill:none;stroke:#000000;stroke-width:2;stroke-linecap:butt;stroke-linejoin:miter;stroke-miterlimit:4;stroke-opacity:1;stroke-dasharray:8, 2;stroke-dashoffset:0" />
      <path
         d="m 171.65685,230.34788 c -7.46516,-2.14124 -15.8195,4.58572 -15.44171,12.31392 -1.48094,12.13545 0.10963,24.35443 -0.39807,36.5251 0.46748,4.15615 5.37573,6.86652 9.21453,5.44725 5.9413,-0.3796 12.41423,0.58541 17.74532,-2.68332 6.50995,-3.91788 9.28051,-12.23545 8.02393,-19.501 -0.64203,-7.91726 -1.34587,-15.85456 -2.95444,-23.64473 -2.67685,-6.10467 -9.84217,-8.99327 -16.18956,-8.45722 z"
         id="path3104"
         style="fill:none;stroke:#000000;stroke-width:2;stroke-linecap:butt;stroke-linejoin:miter;stroke-miterlimit:4;stroke-opacity:1;stroke-dasharray:8, 2;stroke-dashoffset:0" />
      <path
         d="m 235.57563,249.8112 c -2.47437,-4.26701 -7.65406,-6.23347 -9.68677,-10.82679 -3.21293,-2.54274 -7.62087,-1.50552 -11.14807,-0.27756 -5.69868,1.74562 -11.12929,4.59654 -15.47332,8.71617 -2.93559,5.48029 -1.93358,11.86916 -2.11048,17.82459 0.2355,5.17524 0.79851,10.3288 1.06225,15.50231 3.0791,2.72422 7.44315,1.76644 11.1862,2.13267 7.11868,0.0605 14.28241,-0.53457 21.19327,-2.3056 2.5083,-2.43573 1.41593,-6.21847 2.33853,-9.25978 1.22357,-7.11954 2.30014,-14.28208 2.63839,-21.50601 z"
         id="path3218"
         style="fill:none;stroke:#000000;stroke-width:2;stroke-linecap:butt;stroke-linejoin:miter;stroke-miterlimit:4;stroke-opacity:1;stroke-dasharray:8, 2;stroke-dashoffset:0" />
      <path
         d="m 409.37688,451.7732 c 4.26701,-2.47438 6.23346,-7.65407 10.8268,-9.68678 2.54273,-3.21293 1.50551,-7.62085 0.27754,-11.14805 -1.74561,-5.69869 -4.59653,-11.12931 -8.71616,-15.47333 -5.4803,-2.93559 -11.86916,-1.93358 -17.82458,-2.1105 -5.17525,0.23552 -10.32881,0.79853 -15.50232,1.06227 -2.72423,3.07909 -1.76643,7.44315 -2.13268,11.1862 -0.0605,7.11867 0.53458,14.28241 2.30561,21.19327 2.43572,2.50829 6.21847,1.41592 9.25977,2.33852 7.11955,1.22357 14.28209,2.30014 21.50602,2.6384 z"
         id="path3356"
         style="fill:none;stroke:#000000;stroke-width:2;stroke-linecap:butt;stroke-linejoin:miter;stroke-miterlimit:4;stroke-opacity:1;stroke-dasharray:8, 2;stroke-dashoffset:0" />
      <text
         x="424.17792"
         y="439.94485"
         id="text3358"
         xml:space="preserve"
         style="font-size:32.72175217px;font-style:normal;font-weight:normal;fill:#000000;fill-opacity:1;stroke:none;font-family:Bitstream Vera Sans"><tspan
           x="424.17792"
           y="439.94485"
           id="tspan3360">=</tspan></text>
      <text
         x="455.65686"
         y="424.34787"
         id="text3362"
         xml:space="preserve"
         style="font-size:12px;font-style:normal;font-weight:normal;fill:#000000;fill-opacity:1;stroke:none;font-family:Bitstream Vera Sans"><tspan
           x="455.65686"
           y="424.34787"
           id="tspan3364"><tspan
   id="tspan3376"
   style="font-weight:bold">zone</tspan> of authority,</tspan><tspan
           x="455.65686"
           y="439.34787"
           id="tspan3366">managed by a <tspan
   id="tspan4554"
   style="font-weight:bold">name server</tspan></tspan></text>
      <path
         d="m 83.656854,432.34788 28.999996,49"
         id="path3504"
         style="fill:none;stroke:#000000;stroke-width:1px;stroke-linecap:butt;stroke-linejoin:miter;stroke-opacity:1" />
      <path
         d="m 83.656854,432.34788 -34,49"
         id="path3500"
         style="fill:none;stroke:#000000;stroke-width:1px;stroke-linecap:butt;stroke-linejoin:miter;stroke-opacity:1" />
      <g
         transform="matrix(0.555556,0,0,0.555556,58.1608,182.3562)"
         id="g3476">
        <rect
           width="35"
           height="51"
           x="28"
           y="415.36218"
           id="rect3478"
           style="color:#000000;fill:#ffffc2;fill-opacity:1;fill-rule:evenodd;stroke:#000000;stroke-width:1;stroke-linecap:butt;stroke-linejoin:miter;stroke-miterlimit:4;stroke-opacity:1;stroke-dasharray:none;stroke-dashoffset:0;marker:none;visibility:visible;display:inline;overflow:visible" />
        <path
           d="m 33.380539,437.88823 c 2.9242,4.983 9.003461,-4.66151 6.002308,-5.30448 -3.001155,-0.64297 -3.155061,6.26893 -0.384764,6.10819 2.770296,-0.16074 8.233927,-3.37558 8.233927,-3.37558 0,0 1.23124,5.78671 4.3863,3.37558"
           id="path3480"
           style="color:#000000;fill:none;stroke:#000000;stroke-width:1px;stroke-linecap:butt;stroke-linejoin:miter;stroke-miterlimit:4;stroke-opacity:1;stroke-dasharray:none;stroke-dashoffset:0;marker:none;visibility:visible;display:inline;overflow:visible" />
        <path
           d="m 32.457108,423.26072 c 2.770295,-2.57187 6.233162,6.75116 10.157742,3.69706 3.92458,-3.0541 6.38707,-7.71561 8.38784,-3.69706 2.00077,4.01854 4.5402,1.44667 4.5402,1.44667"
           id="path3482"
           style="color:#000000;fill:none;stroke:#000000;stroke-width:1px;stroke-linecap:butt;stroke-linejoin:miter;stroke-miterlimit:4;stroke-opacity:1;stroke-dasharray:none;stroke-dashoffset:0;marker:none;visibility:visible;display:inline;overflow:visible" />
        <path
           d="m 33.303587,448.97942 c 2.847247,-2.08964 3.308963,-2.25038 5.694496,-0.16074 2.385531,2.08965 4.078487,-0.32148 4.078487,-0.32148"
           id="path3484"
           style="color:#000000;fill:none;stroke:#000000;stroke-width:1px;stroke-linecap:butt;stroke-linejoin:miter;stroke-miterlimit:4;stroke-opacity:1;stroke-dasharray:none;stroke-dashoffset:0;marker:none;visibility:visible;display:inline;overflow:visible" />
        <path
           d="m 45.38515,448.33646 c 3.61677,3.05409 3.46286,0.48222 7.4644,0.48222"
           id="path3486"
           style="color:#000000;fill:none;stroke:#000000;stroke-width:1px;stroke-linecap:butt;stroke-linejoin:miter;stroke-miterlimit:4;stroke-opacity:1;stroke-dasharray:none;stroke-dashoffset:0;marker:none;visibility:visible;display:inline;overflow:visible" />
        <path
           d="m 33.534445,457.82023 c 0.769526,-5.14374 3.847631,-1.28593 5.617541,0.96445 1.769912,2.25039 4.001534,-3.53632 8.233934,-1.76816 4.23239,1.76816 4.61715,2.57187 6.69487,0.16074"
           id="path3488"
           style="color:#000000;fill:none;stroke:#000000;stroke-width:1px;stroke-linecap:butt;stroke-linejoin:miter;stroke-miterlimit:4;stroke-opacity:1;stroke-dasharray:none;stroke-dashoffset:0;marker:none;visibility:visible;display:inline;overflow:visible" />
      </g>
      <text
         x="109.30865"
         y="423.00766"
         id="text3492"
         xml:space="preserve"
         style="font-size:12px;font-style:normal;font-weight:normal;fill:#000000;fill-opacity:1;stroke:none;font-family:Bitstream Vera Sans"><tspan
           x="109.30865"
           y="423.00766"
           id="tspan3494">&quot;delegated subzone&quot;</tspan></text>
      <text
         x="-294.9339"
         y="286.57416"
         transform="matrix(0.462358,-0.886693,0.886693,0.462358,0,0)"
         id="text3496"
         xml:space="preserve"
         style="font-size:11.99998665px;font-style:normal;font-weight:normal;fill:#000000;fill-opacity:1;stroke:none;font-family:Bitstream Vera Sans"><tspan
           x="-294.9339"
           y="286.57416"
           id="tspan3498">&quot;zone delegation&quot;</tspan></text>
      <g
         transform="matrix(0.555556,0,0,0.555556,24.37905,233.4243)"
         id="g3506">
        <rect
           width="35"
           height="51"
           x="28"
           y="415.36218"
           id="rect3508"
           style="color:#000000;fill:#ffffc2;fill-opacity:1;fill-rule:evenodd;stroke:#000000;stroke-width:1;stroke-linecap:butt;stroke-linejoin:miter;stroke-miterlimit:4;stroke-opacity:1;stroke-dasharray:none;stroke-dashoffset:0;marker:none;visibility:visible;display:inline;overflow:visible" />
        <path
           d="m 33.380539,437.88823 c 2.9242,4.983 9.003461,-4.66151 6.002308,-5.30448 -3.001155,-0.64297 -3.155061,6.26893 -0.384764,6.10819 2.770296,-0.16074 8.233927,-3.37558 8.233927,-3.37558 0,0 1.23124,5.78671 4.3863,3.37558"
           id="path3510"
           style="color:#000000;fill:none;stroke:#000000;stroke-width:1px;stroke-linecap:butt;stroke-linejoin:miter;stroke-miterlimit:4;stroke-opacity:1;stroke-dasharray:none;stroke-dashoffset:0;marker:none;visibility:visible;display:inline;overflow:visible" />
        <path
           d="m 32.457108,423.26072 c 2.770295,-2.57187 6.233162,6.75116 10.157742,3.69706 3.92458,-3.0541 6.38707,-7.71561 8.38784,-3.69706 2.00077,4.01854 4.5402,1.44667 4.5402,1.44667"
           id="path3512"
           style="color:#000000;fill:none;stroke:#000000;stroke-width:1px;stroke-linecap:butt;stroke-linejoin:miter;stroke-miterlimit:4;stroke-opacity:1;stroke-dasharray:none;stroke-dashoffset:0;marker:none;visibility:visible;display:inline;overflow:visible" />
        <path
           d="m 33.303587,448.97942 c 2.847247,-2.08964 3.308963,-2.25038 5.694496,-0.16074 2.385531,2.08965 4.078487,-0.32148 4.078487,-0.32148"
           id="path3514"
           style="color:#000000;fill:none;stroke:#000000;stroke-width:1px;stroke-linecap:butt;stroke-linejoin:miter;stroke-miterlimit:4;stroke-opacity:1;stroke-dasharray:none;stroke-dashoffset:0;marker:none;visibility:visible;display:inline;overflow:visible" />
        <path
           d="m 45.38515,448.33646 c 3.61677,3.05409 3.46286,0.48222 7.4644,0.48222"
           id="path3516"
           style="color:#000000;fill:none;stroke:#000000;stroke-width:1px;stroke-linecap:butt;stroke-linejoin:miter;stroke-miterlimit:4;stroke-opacity:1;stroke-dasharray:none;stroke-dashoffset:0;marker:none;visibility:visible;display:inline;overflow:visible" />
        <path
           d="m 33.534445,457.82023 c 0.769526,-5.14374 3.847631,-1.28593 5.617541,0.96445 1.769912,2.25039 4.001534,-3.53632 8.233934,-1.76816 4.23239,1.76816 4.61715,2.57187 6.69487,0.16074"
           id="path3518"
           style="color:#000000;fill:none;stroke:#000000;stroke-width:1px;stroke-linecap:butt;stroke-linejoin:miter;stroke-miterlimit:4;stroke-opacity:1;stroke-dasharray:none;stroke-dashoffset:0;marker:none;visibility:visible;display:inline;overflow:visible" />
      </g>
      <g
         transform="matrix(0.555556,0,0,0.555556,82.37905,232.4243)"
         id="g3540">
        <rect
           width="35"
           height="51"
           x="28"
           y="415.36218"
           id="rect3542"
           style="color:#000000;fill:#ffffc2;fill-opacity:1;fill-rule:evenodd;stroke:#000000;stroke-width:1;stroke-linecap:butt;stroke-linejoin:miter;stroke-miterlimit:4;stroke-opacity:1;stroke-dasharray:none;stroke-dashoffset:0;marker:none;visibility:visible;display:inline;overflow:visible" />
        <path
           d="m 33.380539,437.88823 c 2.9242,4.983 9.003461,-4.66151 6.002308,-5.30448 -3.001155,-0.64297 -3.155061,6.26893 -0.384764,6.10819 2.770296,-0.16074 8.233927,-3.37558 8.233927,-3.37558 0,0 1.23124,5.78671 4.3863,3.37558"
           id="path3544"
           style="color:#000000;fill:none;stroke:#000000;stroke-width:1px;stroke-linecap:butt;stroke-linejoin:miter;stroke-miterlimit:4;stroke-opacity:1;stroke-dasharray:none;stroke-dashoffset:0;marker:none;visibility:visible;display:inline;overflow:visible" />
        <path
           d="m 32.457108,423.26072 c 2.770295,-2.57187 6.233162,6.75116 10.157742,3.69706 3.92458,-3.0541 6.38707,-7.71561 8.38784,-3.69706 2.00077,4.01854 4.5402,1.44667 4.5402,1.44667"
           id="path3546"
           style="color:#000000;fill:none;stroke:#000000;stroke-width:1px;stroke-linecap:butt;stroke-linejoin:miter;stroke-miterlimit:4;stroke-opacity:1;stroke-dasharray:none;stroke-dashoffset:0;marker:none;visibility:visible;display:inline;overflow:visible" />
        <path
           d="m 33.303587,448.97942 c 2.847247,-2.08964 3.308963,-2.25038 5.694496,-0.16074 2.385531,2.08965 4.078487,-0.32148 4.078487,-0.32148"
           id="path3548"
           style="color:#000000;fill:none;stroke:#000000;stroke-width:1px;stroke-linecap:butt;stroke-linejoin:miter;stroke-miterlimit:4;stroke-opacity:1;stroke-dasharray:none;stroke-dashoffset:0;marker:none;visibility:visible;display:inline;overflow:visible" />
        <path
           d="m 45.38515,448.33646 c 3.61677,3.05409 3.46286,0.48222 7.4644,0.48222"
           id="path3550"
           style="color:#000000;fill:none;stroke:#000000;stroke-width:1px;stroke-linecap:butt;stroke-linejoin:miter;stroke-miterlimit:4;stroke-opacity:1;stroke-dasharray:none;stroke-dashoffset:0;marker:none;visibility:visible;display:inline;overflow:visible" />
        <path
           d="m 33.534445,457.82023 c 0.769526,-5.14374 3.847631,-1.28593 5.617541,0.96445 1.769912,2.25039 4.001534,-3.53632 8.233934,-1.76816 4.23239,1.76816 4.61715,2.57187 6.69487,0.16074"
           id="path3552"
           style="color:#000000;fill:none;stroke:#000000;stroke-width:1px;stroke-linecap:butt;stroke-linejoin:miter;stroke-miterlimit:4;stroke-opacity:1;stroke-dasharray:none;stroke-dashoffset:0;marker:none;visibility:visible;display:inline;overflow:visible" />
      </g>
      <path
         d="m 58.656854,416.34788 c -9.411891,9.79148 -15.975922,21.79611 -22.851244,33.39167 -4.274858,12.45191 -5.516642,25.63195 -8.077417,38.48015 0.18515,11.62897 11.978615,20.01933 22.984638,19.62187 14.193659,1.8055 30.54538,0.87311 44.826242,0.86347 11.942507,-0.8819 23.712397,-4.16762 29.078277,-15.91113 5.65147,-13.49388 2.09345,-28.82601 -3.7922,-41.60225 -4.46473,-8.8931 -12.52612,-15.09523 -18.83568,-22.52355 -4.88162,-8.07047 -5.616626,-17.67559 -7.976185,-26.61259 -5.483105,-11.60434 -25.804267,-10.40994 -29.21484,2.22553 -1.524968,4.22665 -2.525603,9.04243 -6.141591,12.06683 z"
         id="path3554"
         style="color:#000000;fill:none;stroke:#000000;stroke-width:2;stroke-linecap:butt;stroke-linejoin:miter;stroke-miterlimit:4;stroke-opacity:1;stroke-dasharray:8, 2;stroke-dashoffset:0;marker:none;visibility:visible;display:inline;overflow:visible" />
      <text
         x="173.82043"
         y="338.49643"
         id="text4536"
         xml:space="preserve"
         style="font-size:8.77892494px;font-style:normal;font-weight:normal;fill:#000000;fill-opacity:1;stroke:none;font-family:Bitstream Vera Sans"><tspan
           x="173.82043"
           y="338.49643"
           id="tspan4540"><tspan
   id="tspan4548"
   style="font-weight:bold">NS RR</tspan> (&quot;resource record&quot;)</tspan><tspan
           x="173.82043"
           y="349.47009"
           id="tspan4542">names the nameserver</tspan><tspan
           x="173.82043"
           y="360.44376"
           id="tspan4544">authoritative for</tspan><tspan
           x="173.82043"
           y="371.41739"
           id="tspan4546">delegated subzone</tspan></text>
      <path
         d="m 173.65685,275.34788 7,53"
         id="path4550"
         style="fill:none;stroke:#000000;stroke-width:0.5;stroke-linecap:butt;stroke-linejoin:miter;stroke-miterlimit:4;stroke-opacity:1;stroke-dasharray:none;marker-start:url(#Arrow1Lstart);marker-end:none" />
      <text
         x="144.65686"
         y="447.34787"
         id="text4556"
         xml:space="preserve"
         style="font-size:8.77892494px;font-style:normal;font-variant:normal;font-weight:normal;font-stretch:normal;text-indent:0;text-align:start;text-decoration:none;line-height:normal;letter-spacing:normal;word-spacing:normal;text-transform:none;direction:ltr;block-progression:tb;writing-mode:lr-tb;text-anchor:start;color:#000000;fill:#000000;fill-opacity:1;fill-rule:nonzero;stroke:none;stroke-width:1px;marker:none;visibility:visible;display:inline;overflow:visible;font-family:Bitstream Vera Sans"><tspan
           x="144.65686"
           y="447.34787"
           id="tspan4560">When a system administrator</tspan><tspan
           x="144.65686"
           y="458.32153"
           id="tspan4564">wants to let another administrator</tspan><tspan
           x="144.65686"
           y="469.2952"
           id="tspan4576">manage a part of a zone, the first</tspan><tspan
           x="144.65686"
           y="480.26883"
           id="tspan4578">administrator's nameserver <tspan
   id="tspan4584"
   style="font-size:8.77892494px;font-style:normal;font-variant:normal;font-weight:bold;font-stretch:normal;text-indent:0;text-align:start;text-decoration:none;line-height:normal;letter-spacing:normal;word-spacing:normal;text-transform:none;direction:ltr;block-progression:tb;writing-mode:lr-tb;text-anchor:start;color:#000000;fill:#000000;fill-opacity:1;fill-rule:nonzero;stroke:none;stroke-width:1px;marker:none;visibility:visible;display:inline;overflow:visible;font-family:Bitstream Vera Sans">delegates</tspan></tspan><tspan
           x="144.65686"
           y="491.24249"
           id="tspan4580">part of the zone to another</tspan><tspan
           x="144.65686"
           y="502.21616"
           id="tspan4568">nameserver.</tspan></text>
    </g>
  </g>
</svg>
