<svg
   xmlns:dc="http://purl.org/dc/elements/1.1/"
   xmlns:cc="http://creativecommons.org/ns#"
   xmlns:rdf="http://www.w3.org/1999/02/22-rdf-syntax-ns#"
   xmlns:svg="http://www.w3.org/2000/svg"
   xmlns="http://www.w3.org/2000/svg"
   xmlns:sodipodi="http://sodipodi.sourceforge.net/DTD/sodipodi-0.dtd"
   xmlns:inkscape="http://www.inkscape.org/namespaces/inkscape"
   width="676.3949"
   height="767.4339"
   viewBox="0 0 676.94227 768.21435"
   id="OS01-svg1"
   version="1.1"
   inkscape:version="0.48.5 r10040"
   sodipodi:docname="OS-overview.svg"
   inkscape:export-filename="/mnt/removable/lechten/src/gitlab/figures/OS/OS-overview.png"
   inkscape:export-xdpi="180"
   inkscape:export-ydpi="180">
  <title
     id="title3035">OS Overview</title>
  <defs
     id="defs4" />
  <sodipodi:namedview
     id="base"
     pagecolor="#ffffff"
     bordercolor="#666666"
     borderopacity="1.0"
     inkscape:pageopacity="0.0"
     inkscape:pageshadow="2"
     inkscape:zoom="0.9899495"
     inkscape:cx="335.00514"
     inkscape:cy="481.12968"
     inkscape:document-units="px"
     inkscape:current-layer="layer3"
     showgrid="true"
     inkscape:window-width="1280"
     inkscape:window-height="1001"
     inkscape:window-x="3"
     inkscape:window-y="23"
     inkscape:window-maximized="0"
     fit-margin-top="0"
     fit-margin-left="0"
     fit-margin-right="0"
     fit-margin-bottom="0">
    <inkscape:grid
       type="xygrid"
       id="grid3815"
       empspacing="5"
       visible="true"
       enabled="true"
       snapvisiblegridlinesonly="true"
       originx="-45.853781px"
       originy="-194.78044px" />
  </sodipodi:namedview>
  <metadata
     id="metadata7">
    <rdf:RDF>
      <cc:Work
         rdf:about="">
        <dc:format>image/svg+xml</dc:format>
        <dc:type
           rdf:resource="http://purl.org/dc/dcmitype/StillImage" />
        <dc:title>OS Overview</dc:title>
        <dc:creator>
          <cc:Agent>
            <dc:title>Jens Lechtenbörger</dc:title>
          </cc:Agent>
        </dc:creator>
        <cc:license
           rdf:resource="https://creativecommons.org/licenses/by-sa/4.0/" />
        <dc:date>Summer 2018</dc:date>
      </cc:Work>
      <cc:License
         rdf:about="https://creativecommons.org/licenses/by-sa/4.0/">
        <cc:permits
           rdf:resource="http://creativecommons.org/ns#Reproduction" />
        <cc:permits
           rdf:resource="http://creativecommons.org/ns#Distribution" />
        <cc:requires
           rdf:resource="http://creativecommons.org/ns#Notice" />
        <cc:requires
           rdf:resource="http://creativecommons.org/ns#Attribution" />
        <cc:permits
           rdf:resource="http://creativecommons.org/ns#DerivativeWorks" />
        <cc:requires
           rdf:resource="http://creativecommons.org/ns#ShareAlike" />
      </cc:License>
    </rdf:RDF>
  </metadata>
  <g
     inkscape:label="Layer 1"
     inkscape:groupmode="layer"
     id="layer1"
     transform="translate(-45.853854,-90.14786)">
    <g
       id="g3809"
       transform="translate(70.01017,64)">
      <text
         sodipodi:linespacing="125%"
         id="text3761"
         y="730.64795"
         x="379.23468"
         style="font-size:40px;font-style:normal;font-weight:normal;line-height:125%;letter-spacing:0px;word-spacing:0px;fill:#000000;fill-opacity:1;stroke:none;font-family:Sans"
         xml:space="preserve"><tspan
           style="font-size:32px;text-align:center;text-anchor:middle"
           y="730.64795"
           x="379.23468"
           id="tspan3763"
           sodipodi:role="line">Hardware as basis</tspan><tspan
           id="tspan3767"
           style="font-size:32px;text-align:center;text-anchor:middle"
           y="770.64795"
           x="379.23468"
           sodipodi:role="line">(Discussed in CS part)</tspan></text>
      <rect
         ry="41.42857"
         y="692.36218"
         x="180"
         height="100"
         width="400"
         id="rect3807"
         style="fill:none;stroke:#ff0000;stroke-width:4;stroke-linecap:butt;stroke-linejoin:miter;stroke-miterlimit:4;stroke-opacity:1;stroke-dasharray:none;stroke-dashoffset:0" />
    </g>
    <g
       id="g3819"
       transform="translate(88.64754,33.15759)">
      <text
         sodipodi:linespacing="125%"
         id="text3799"
         y="108.87971"
         x="195.84776"
         style="font-size:40px;font-style:normal;font-weight:normal;line-height:125%;letter-spacing:0px;word-spacing:0px;fill:#000000;fill-opacity:1;stroke:none;font-family:Sans"
         xml:space="preserve"><tspan
           style="font-size:32px"
           y="108.87971"
           x="195.84776"
           id="tspan3801"
           sodipodi:role="line">Applications (Users)</tspan></text>
      <rect
         ry="37.375645"
         y="61.204594"
         x="153.3606"
         height="80"
         width="400"
         id="rect3817"
         style="fill:none;stroke:#00ff00;stroke-width:4;stroke-linecap:butt;stroke-linejoin:miter;stroke-miterlimit:4;stroke-opacity:1;stroke-dasharray:none;stroke-dashoffset:0" />
    </g>
    <rect
       style="fill:none;stroke:#0000ff;stroke-width:4.50185156;stroke-linecap:butt;stroke-linejoin:miter;stroke-miterlimit:4;stroke-opacity:1;stroke-dasharray:none;stroke-dashoffset:0"
       id="rect3860"
       width="540.61749"
       height="440.61243"
       x="180"
       y="252.36218"
       ry="52.476189" />
  </g>
  <g
     inkscape:groupmode="layer"
     id="layer2"
     inkscape:label="Layer OS01"
     transform="translate(-45.853854,-90.14786)">
    <g
       id="g3981"
       transform="translate(26.008136,-76)">
      <text
         sodipodi:linespacing="125%"
         id="text3850"
         y="298.36218"
         x="290"
         style="font-size:40px;font-style:normal;font-weight:normal;line-height:125%;letter-spacing:0px;word-spacing:0px;fill:#000000;fill-opacity:1;stroke:none;font-family:Sans"
         xml:space="preserve"><tspan
           style="font-size:24px"
           y="298.36218"
           x="290"
           id="tspan3852"
           sodipodi:role="line">System Call Interface</tspan></text>
      <rect
         ry="16.969542"
         y="270.36218"
         x="240"
         height="40"
         width="360"
         id="rect3854"
         style="fill:none;stroke:#0000ff;stroke-width:4;stroke-linecap:butt;stroke-linejoin:miter;stroke-miterlimit:4;stroke-opacity:1;stroke-dasharray:none;stroke-dashoffset:0" />
    </g>
    <text
       xml:space="preserve"
       style="font-size:40px;font-style:normal;font-weight:normal;text-align:center;line-height:125%;letter-spacing:0px;word-spacing:0px;text-anchor:middle;fill:#000000;fill-opacity:1;stroke:none;font-family:Sans"
       x="-473.74332"
       y="104.06475"
       id="text2985"
       sodipodi:linespacing="125%"
       transform="matrix(0,-1,1,0,0,0)"><tspan
         sodipodi:role="line"
         x="-473.74332"
         y="104.06475"
         id="tspan2989"
         style="font-size:32px">WK 20: OS Introduction and Overview</tspan></text>
    <rect
       style="fill:none;stroke:#0000ff;stroke-width:4.42864561;stroke-linecap:butt;stroke-linejoin:miter;stroke-miterlimit:4;stroke-opacity:1;stroke-dasharray:none;stroke-dashoffset:0"
       id="rect2991"
       width="100"
       height="760"
       x="48"
       y="92.362183"
       ry="50.783409" />
  </g>
  <g
     inkscape:groupmode="layer"
     id="layer3"
     inkscape:label="Layer OS02"
     transform="translate(-45.853854,-90.14786)">
    <text
       xml:space="preserve"
       style="font-size:40px;font-style:normal;font-weight:normal;line-height:125%;letter-spacing:0px;word-spacing:0px;fill:#000000;fill-opacity:1;stroke:none;font-family:Sans"
       x="288.00613"
       y="732.34808"
       id="text3891"
       sodipodi:linespacing="125%"><tspan
         sodipodi:role="line"
         id="tspan3893"
         x="288.00613"
         y="732.34808"
         style="font-size:24px">Wk 21: <tspan
   style="font-weight:bold;-inkscape-font-specification:Sans Bold"
   id="tspan3036">I/O</tspan> and <tspan
   style="font-weight:bold;-inkscape-font-specification:Sans Bold"
   id="tspan3038">Interrupts</tspan></tspan></text>
    <rect
       style="fill:none;stroke:#c800c8;stroke-width:4;stroke-linecap:butt;stroke-linejoin:miter;stroke-miterlimit:4;stroke-opacity:1;stroke-dasharray:none;stroke-dashoffset:0"
       id="rect3854-3"
       width="360.36609"
       height="80.081337"
       x="270.15778"
       y="682.96448"
       ry="16.966461" />
  </g>
  <g
     inkscape:groupmode="layer"
     id="layer4"
     inkscape:label="Layer OS03"
     transform="translate(-45.853854,-90.14786)">
    <text
       xml:space="preserve"
       style="font-size:40px;font-style:normal;font-weight:normal;line-height:125%;letter-spacing:0px;word-spacing:0px;fill:#000000;fill-opacity:1;stroke:none;font-family:Sans"
       x="198"
       y="662.73816"
       id="text3895"
       sodipodi:linespacing="125%"><tspan
         sodipodi:role="line"
         id="tspan3897"
         x="198"
         y="662.73816"
         style="font-size:24px">Wk 21: <tspan
   style="font-weight:bold;-inkscape-font-specification:Sans Bold"
   id="tspan3998">Threads</tspan> as units of computation</tspan></text>
  </g>
  <g
     inkscape:groupmode="layer"
     id="layer5"
     inkscape:label="Layer OS04"
     transform="translate(-45.853854,-90.14786)">
    <text
       xml:space="preserve"
       style="font-size:40px;font-style:normal;font-weight:normal;line-height:125%;letter-spacing:0px;word-spacing:0px;fill:#000000;fill-opacity:1;stroke:none;font-family:Sans"
       x="198"
       y="622.65698"
       id="text3895-7"
       sodipodi:linespacing="125%"><tspan
         sodipodi:role="line"
         id="tspan3897-5"
         x="198"
         y="622.65698"
         style="font-size:24px">Wk 22: Thread <tspan
   style="font-weight:bold;-inkscape-font-specification:Sans Bold"
   id="tspan4000">scheduling</tspan></tspan></text>
  </g>
  <g
     inkscape:groupmode="layer"
     id="layer6"
     inkscape:label="Layer OS05"
     transform="translate(-45.853854,-90.14786)">
    <text
       xml:space="preserve"
       style="font-size:40px;font-style:normal;font-weight:normal;line-height:125%;letter-spacing:0px;word-spacing:0px;fill:#000000;fill-opacity:1;stroke:none;font-family:Sans"
       x="198"
       y="522.51947"
       id="text3895-7-3"
       sodipodi:linespacing="125%"><tspan
         sodipodi:role="line"
         id="tspan3897-5-5"
         x="198"
         y="522.51947"
         style="font-size:24px">Wk 23/25: <tspan
   style="font-weight:bold;-inkscape-font-specification:Sans Bold"
   id="tspan4002">Concurrency</tspan>, <tspan
   style="font-weight:bold;-inkscape-font-specification:Sans Bold"
   id="tspan4004">MX</tspan></tspan><tspan
         sodipodi:role="line"
         x="198"
         y="552.51947"
         style="font-size:24px"
         id="tspan3952">     - Primitives provided by OS</tspan><tspan
         sodipodi:role="line"
         x="198"
         y="582.51947"
         style="font-size:24px"
         id="tspan3954">     - Lots of challenges</tspan></text>
  </g>
  <g
     inkscape:groupmode="layer"
     id="layer7"
     inkscape:label="Layer OS08"
     transform="translate(-45.853854,-90.14786)">
    <text
       xml:space="preserve"
       style="font-size:40px;font-style:normal;font-weight:normal;line-height:125%;letter-spacing:0px;word-spacing:0px;fill:#000000;fill-opacity:1;stroke:none;font-family:Sans"
       x="200"
       y="422.31107"
       id="text3895-7-6"
       sodipodi:linespacing="125%"><tspan
         sodipodi:role="line"
         id="tspan3897-5-2"
         x="200"
         y="422.31107"
         style="font-size:24px">Wk 26: Threads need <tspan
   style="font-weight:bold;-inkscape-font-specification:Sans Bold"
   id="tspan4006">memory</tspan></tspan><tspan
         sodipodi:role="line"
         x="200"
         y="452.31107"
         style="font-size:24px"
         id="tspan3977">     - Instructions and data</tspan><tspan
         sodipodi:role="line"
         x="200"
         y="482.31107"
         style="font-size:24px"
         id="tspan3979">     - OS supports virtual memory</tspan></text>
  </g>
  <g
     inkscape:groupmode="layer"
     id="layer8"
     inkscape:label="Layer OS09"
     transform="translate(-45.853854,-90.14786)">
    <text
       xml:space="preserve"
       style="font-size:40px;font-style:normal;font-weight:normal;line-height:125%;letter-spacing:0px;word-spacing:0px;fill:#000000;fill-opacity:1;stroke:none;font-family:Sans"
       x="200.08659"
       y="292.56747"
       id="text3986"
       sodipodi:linespacing="125%"><tspan
         sodipodi:role="line"
         id="tspan3988"
         x="200.08659"
         y="292.56747"
         style="font-size:24px">Wk 27: <tspan
   style="font-weight:bold;-inkscape-font-specification:Sans Bold"
   id="tspan4008">Processes</tspan> and <tspan
   style="font-weight:bold;-inkscape-font-specification:Sans Bold"
   id="tspan4010">security</tspan></tspan><tspan
         sodipodi:role="line"
         x="200.08659"
         y="322.56747"
         style="font-size:24px"
         id="tspan3990">     - OS isolates processes</tspan><tspan
         sodipodi:role="line"
         x="200.08659"
         y="352.56747"
         style="font-size:24px"
         id="tspan3992">     - OS supports access control</tspan><tspan
         sodipodi:role="line"
         x="200.08659"
         y="382.56747"
         style="font-size:24px"
         id="tspan3994">     - OS may support crypto primitives</tspan></text>
  </g>
</svg>
