<?xml version="1.0" encoding="UTF-8" standalone="no"?>
<!-- Created with Inkscape (http://www.inkscape.org/) -->

<svg
   xmlns:dc="http://purl.org/dc/elements/1.1/"
   xmlns:cc="http://creativecommons.org/ns#"
   xmlns:rdf="http://www.w3.org/1999/02/22-rdf-syntax-ns#"
   xmlns:svg="http://www.w3.org/2000/svg"
   xmlns="http://www.w3.org/2000/svg"
   xmlns:sodipodi="http://sodipodi.sourceforge.net/DTD/sodipodi-0.dtd"
   xmlns:inkscape="http://www.inkscape.org/namespaces/inkscape"
   width="138.37714mm"
   height="88.635498mm"
   viewBox="0 0 138.37714 88.635498"
   version="1.1"
   id="svg8"
   inkscape:version="0.92.4 (5da689c313, 2019-01-14)"
   sodipodi:docname="file-descriptors.svg">
  <defs
     id="defs2">
    <marker
       inkscape:isstock="true"
       style="overflow:visible"
       id="marker3229"
       refX="0"
       refY="0"
       orient="auto"
       inkscape:stockid="Arrow2Mstart">
      <path
         transform="scale(0.6)"
         d="M 8.7185878,4.0337352 -2.2072895,0.01601326 8.7185884,-4.0017078 c -1.7454984,2.3720609 -1.7354408,5.6174519 -6e-7,8.035443 z"
         style="fill:#000000;fill-opacity:1;fill-rule:evenodd;stroke:#000000;stroke-width:0.625;stroke-linejoin:round;stroke-opacity:1"
         id="path3227"
         inkscape:connector-curvature="0" />
    </marker>
    <marker
       inkscape:isstock="true"
       style="overflow:visible"
       id="marker3135"
       refX="0"
       refY="0"
       orient="auto"
       inkscape:stockid="Arrow1Mend">
      <path
         transform="matrix(-0.4,0,0,-0.4,-4,0)"
         style="fill:#000000;fill-opacity:1;fill-rule:evenodd;stroke:#000000;stroke-width:1.00000003pt;stroke-opacity:1"
         d="M 0,0 5,-5 -12.5,0 5,5 Z"
         id="path3133"
         inkscape:connector-curvature="0" />
    </marker>
    <marker
       inkscape:isstock="true"
       style="overflow:visible"
       id="marker3065"
       refX="0"
       refY="0"
       orient="auto"
       inkscape:stockid="Arrow1Mend">
      <path
         transform="matrix(-0.4,0,0,-0.4,-4,0)"
         style="fill:#000000;fill-opacity:1;fill-rule:evenodd;stroke:#000000;stroke-width:1.00000003pt;stroke-opacity:1"
         d="M 0,0 5,-5 -12.5,0 5,5 Z"
         id="path3063"
         inkscape:connector-curvature="0" />
    </marker>
    <marker
       inkscape:stockid="Arrow1Mend"
       orient="auto"
       refY="0"
       refX="0"
       id="Arrow1Mend"
       style="overflow:visible"
       inkscape:isstock="true"
       inkscape:collect="always">
      <path
         id="path1074"
         d="M 0,0 5,-5 -12.5,0 5,5 Z"
         style="fill:#000000;fill-opacity:1;fill-rule:evenodd;stroke:#000000;stroke-width:1.00000003pt;stroke-opacity:1"
         transform="matrix(-0.4,0,0,-0.4,-4,0)"
         inkscape:connector-curvature="0" />
    </marker>
    <marker
       inkscape:stockid="Arrow2Mstart"
       orient="auto"
       refY="0"
       refX="0"
       id="Arrow2Mstart"
       style="overflow:visible"
       inkscape:isstock="true">
      <path
         id="path1089"
         style="fill:#000000;fill-opacity:1;fill-rule:evenodd;stroke:#000000;stroke-width:0.625;stroke-linejoin:round;stroke-opacity:1"
         d="M 8.7185878,4.0337352 -2.2072895,0.01601326 8.7185884,-4.0017078 c -1.7454984,2.3720609 -1.7354408,5.6174519 -6e-7,8.035443 z"
         transform="scale(0.6)"
         inkscape:connector-curvature="0" />
    </marker>
    <marker
       inkscape:stockid="Arrow1Mstart"
       orient="auto"
       refY="0"
       refX="0"
       id="marker2026"
       style="overflow:visible"
       inkscape:isstock="true">
      <path
         id="path2024"
         d="M 0,0 5,-5 -12.5,0 5,5 Z"
         style="fill:#000000;fill-opacity:1;fill-rule:evenodd;stroke:#000000;stroke-width:1.00000003pt;stroke-opacity:1"
         transform="matrix(0.4,0,0,0.4,4,0)"
         inkscape:connector-curvature="0" />
    </marker>
    <marker
       inkscape:stockid="Arrow1Mstart"
       orient="auto"
       refY="0"
       refX="0"
       id="Arrow1Mstart"
       style="overflow:visible"
       inkscape:isstock="true">
      <path
         id="path1071"
         d="M 0,0 5,-5 -12.5,0 5,5 Z"
         style="fill:#000000;fill-opacity:1;fill-rule:evenodd;stroke:#000000;stroke-width:1.00000003pt;stroke-opacity:1"
         transform="matrix(0.4,0,0,0.4,4,0)"
         inkscape:connector-curvature="0" />
    </marker>
    <marker
       inkscape:stockid="Arrow2Mend"
       orient="auto"
       refY="0"
       refX="0"
       id="Arrow2Mend"
       style="overflow:visible"
       inkscape:isstock="true">
      <path
         id="path1092"
         style="fill:#000000;fill-opacity:1;fill-rule:evenodd;stroke:#000000;stroke-width:0.625;stroke-linejoin:round;stroke-opacity:1"
         d="M 8.7185878,4.0337352 -2.2072895,0.01601326 8.7185884,-4.0017078 c -1.7454984,2.3720609 -1.7354408,5.6174519 -6e-7,8.035443 z"
         transform="scale(-0.6)"
         inkscape:connector-curvature="0" />
    </marker>
    <marker
       inkscape:stockid="Arrow1Send"
       orient="auto"
       refY="0"
       refX="0"
       id="Arrow1Send"
       style="overflow:visible"
       inkscape:isstock="true">
      <path
         id="path1080"
         d="M 0,0 5,-5 -12.5,0 5,5 Z"
         style="fill:#000000;fill-opacity:1;fill-rule:evenodd;stroke:#000000;stroke-width:1.00000003pt;stroke-opacity:1"
         transform="matrix(-0.2,0,0,-0.2,-1.2,0)"
         inkscape:connector-curvature="0" />
    </marker>
    <marker
       inkscape:stockid="Arrow1Lend"
       orient="auto"
       refY="0"
       refX="0"
       id="Arrow1Lend"
       style="overflow:visible"
       inkscape:isstock="true">
      <path
         id="path1068"
         d="M 0,0 5,-5 -12.5,0 5,5 Z"
         style="fill:#000000;fill-opacity:1;fill-rule:evenodd;stroke:#000000;stroke-width:1.00000003pt;stroke-opacity:1"
         transform="matrix(-0.8,0,0,-0.8,-10,0)"
         inkscape:connector-curvature="0" />
    </marker>
    <marker
       inkscape:stockid="Arrow2Mend"
       orient="auto"
       refY="0"
       refX="0"
       id="Arrow2Mend-5"
       style="overflow:visible"
       inkscape:isstock="true">
      <path
         inkscape:connector-curvature="0"
         id="path1092-3"
         style="fill:#000000;fill-opacity:1;fill-rule:evenodd;stroke:#000000;stroke-width:0.625;stroke-linejoin:round;stroke-opacity:1"
         d="M 8.7185878,4.0337352 -2.2072895,0.01601326 8.7185884,-4.0017078 c -1.7454984,2.3720609 -1.7354408,5.6174519 -6e-7,8.035443 z"
         transform="scale(-0.6)" />
    </marker>
    <marker
       inkscape:stockid="Arrow2Mstart"
       orient="auto"
       refY="0"
       refX="0"
       id="Arrow2Mstart-6"
       style="overflow:visible"
       inkscape:isstock="true"
       inkscape:collect="always">
      <path
         inkscape:connector-curvature="0"
         id="path1089-2"
         style="fill:#000000;fill-opacity:1;fill-rule:evenodd;stroke:#000000;stroke-width:0.625;stroke-linejoin:round;stroke-opacity:1"
         d="M 8.7185878,4.0337352 -2.2072895,0.01601326 8.7185884,-4.0017078 c -1.7454984,2.3720609 -1.7354408,5.6174519 -6e-7,8.035443 z"
         transform="scale(0.6)" />
    </marker>
  </defs>
  <sodipodi:namedview
     id="base"
     pagecolor="#ffffff"
     bordercolor="#666666"
     borderopacity="1.0"
     inkscape:pageopacity="0.0"
     inkscape:pageshadow="2"
     inkscape:zoom="0.98994949"
     inkscape:cx="153.54437"
     inkscape:cy="120.43655"
     inkscape:document-units="mm"
     inkscape:current-layer="layer1"
     showgrid="true"
     inkscape:window-width="1696"
     inkscape:window-height="1267"
     inkscape:window-x="50"
     inkscape:window-y="95"
     inkscape:window-maximized="0">
    <inkscape:grid
       type="xygrid"
       id="grid1046"
       originx="-18.917705"
       originy="-161.2635" />
  </sodipodi:namedview>
  <metadata
     id="metadata5">
    <rdf:RDF>
      <cc:Work
         rdf:about="">
        <dc:format>image/svg+xml</dc:format>
        <dc:type
           rdf:resource="http://purl.org/dc/dcmitype/StillImage" />
        <dc:title></dc:title>
      </cc:Work>
    </rdf:RDF>
  </metadata>
  <g
     inkscape:label="Ebene 1"
     inkscape:groupmode="layer"
     id="layer1"
     transform="translate(-18.917704,-47.101001)">
    <g
       id="g882"
       transform="matrix(0.26458333,0,0,0.26458333,26.283739,89.84713)">
      <path
         id="path880"
         d="M 90.21,50.93 C 88.34,60.85 83.05,69.57 75.62,75.82 68.15,82.1 58.52,85.88 48.02,85.88 38.15,85.88 29.05,82.54 21.79,76.93 14.38,71.2 8.89,63.1 6.46,53.76 l 5.36,-1.39 c 2.11,8.13 6.89,15.19 13.35,20.18 6.31,4.88 14.23,7.78 22.84,7.78 9.17,0 17.55,-3.29 24.04,-8.74 6.21,-5.22 10.7,-12.43 12.49,-20.65 H 78.82 L 87.41,40.48 96,50.93 Z M 61.35,27.23 C 61.3,27.18 61.26,27.15 61.22,27.12 61.18,27.09 61.13,27.07 61.09,27.05 L 61.08,27.04 C 61.05,27.02 61.01,27.01 60.96,27 v 0 c -0.04,0 -0.09,0 -0.15,0 -0.06,0 -0.12,0 -0.17,0.01 -0.05,0.01 -0.09,0.02 -0.12,0.04 l -0.02,0.01 c -0.03,0.02 -0.07,0.04 -0.11,0.06 -0.04,0.03 -0.08,0.06 -0.13,0.11 l -2.32,2.32 c -0.24,0.24 -0.54,0.37 -0.85,0.4 -0.31,0.03 -0.63,-0.05 -0.9,-0.24 -0.12,-0.08 -0.26,-0.16 -0.4,-0.24 v 0 c -0.17,-0.1 -0.31,-0.18 -0.43,-0.24 L 55.34,29.22 C 55.2,29.14 55.05,29.06 54.9,28.99 54.75,28.91 54.59,28.84 54.44,28.78 L 54.43,28.77 C 54.29,28.7 54.13,28.63 53.96,28.56 53.79,28.49 53.63,28.43 53.47,28.37 L 53.44,28.36 C 53.24,28.28 52.99,28.2 52.73,28.11 L 52.47,28 C 52.19,27.91 51.96,27.73 51.81,27.51 51.64,27.28 51.55,26.99 51.55,26.7 v -3.55 c 0,-0.06 0,-0.12 -0.01,-0.17 V 22.97 C 51.53,22.93 51.52,22.89 51.51,22.85 51.49,22.81 51.47,22.76 51.44,22.72 51.41,22.68 51.38,22.64 51.34,22.6 51.3,22.56 51.26,22.53 51.22,22.5 51.18,22.47 51.14,22.45 51.09,22.43 v 0 c -0.04,-0.02 -0.08,-0.03 -0.13,-0.04 -0.05,-0.01 -0.1,-0.01 -0.17,-0.01 h -4.45 c -0.06,0 -0.11,0 -0.16,0.01 -0.04,0.01 -0.08,0.02 -0.12,0.04 l -0.02,0.01 c -0.04,0.02 -0.08,0.04 -0.11,0.06 -0.04,0.03 -0.09,0.06 -0.13,0.11 -0.04,0.04 -0.07,0.08 -0.1,0.12 -0.03,0.04 -0.05,0.08 -0.07,0.13 -0.02,0.04 -0.03,0.08 -0.04,0.12 -0.01,0.05 -0.01,0.1 -0.01,0.17 v 3.24 c 0,0.33 -0.12,0.64 -0.32,0.88 -0.2,0.24 -0.49,0.42 -0.81,0.47 -0.27,0.06 -0.52,0.13 -0.75,0.2 L 43.48,28 c -0.31,0.09 -0.63,0.21 -0.95,0.33 l -0.03,0.01 c -0.02,0.01 -0.04,0.01 -0.07,0.02 -0.17,0.06 -0.34,0.14 -0.52,0.22 -0.12,0.05 -0.23,0.1 -0.35,0.15 -0.31,0.14 -0.6,0.29 -0.86,0.43 -0.27,0.15 -0.57,0.2 -0.85,0.16 -0.29,-0.04 -0.57,-0.17 -0.78,-0.39 -0.8,-0.86 -1.74,-1.72 -2.58,-2.56 -0.04,-0.04 -0.09,-0.08 -0.13,-0.11 L 36.34,26.25 C 36.32,26.24 36.3,26.23 36.29,26.22 36.27,26.21 36.26,26.21 36.24,26.2 v 0 c -0.02,-0.01 -0.06,-0.02 -0.09,-0.03 -0.04,-0.01 -0.1,-0.01 -0.15,-0.01 -0.06,0 -0.11,0 -0.16,0.01 h -0.01 c -0.04,0.01 -0.08,0.02 -0.11,0.03 l -0.01,0.01 c -0.04,0.02 -0.08,0.04 -0.12,0.07 -0.05,0.04 -0.1,0.08 -0.16,0.14 l -3.09,3.11 c -0.05,0.05 -0.1,0.1 -0.13,0.14 -0.03,0.04 -0.05,0.08 -0.07,0.12 l -0.01,0.02 c -0.01,0.03 -0.02,0.07 -0.03,0.11 v 0 c -0.01,0.05 -0.01,0.1 -0.01,0.16 0,0.12 0.02,0.21 0.05,0.29 0.04,0.08 0.1,0.17 0.19,0.26 l 2.32,2.32 c 0.24,0.24 0.37,0.54 0.4,0.85 0.03,0.31 -0.05,0.63 -0.24,0.9 -0.08,0.13 -0.16,0.26 -0.24,0.4 v 0 c -0.1,0.17 -0.18,0.31 -0.24,0.43 l -0.01,0.02 c -0.08,0.14 -0.16,0.29 -0.23,0.44 -0.08,0.15 -0.14,0.31 -0.21,0.46 l -0.01,0.01 c -0.07,0.14 -0.14,0.3 -0.21,0.47 -0.07,0.17 -0.13,0.33 -0.19,0.49 l -0.01,0.03 c -0.08,0.2 -0.16,0.45 -0.25,0.71 l -0.09,0.26 c -0.09,0.29 -0.27,0.52 -0.5,0.68 -0.23,0.17 -0.52,0.26 -0.81,0.26 h -3.55 c -0.07,0 -0.12,0 -0.17,0.01 -0.04,0.01 -0.09,0.02 -0.13,0.04 -0.04,0.02 -0.09,0.04 -0.13,0.07 -0.04,0.03 -0.08,0.06 -0.12,0.1 -0.04,0.04 -0.07,0.08 -0.1,0.12 -0.03,0.04 -0.05,0.08 -0.07,0.12 -0.02,0.05 -0.03,0.09 -0.04,0.14 -0.01,0.05 -0.01,0.1 -0.01,0.17 v 4.45 c 0,0.1 0.02,0.2 0.05,0.27 0.02,0.04 0.04,0.09 0.08,0.14 v 0 c 0.03,0.05 0.07,0.09 0.11,0.13 v 0 c 0.04,0.04 0.08,0.07 0.12,0.1 0.04,0.03 0.08,0.05 0.13,0.07 0.04,0.02 0.08,0.03 0.12,0.04 h 0.01 c 0.05,0.01 0.1,0.01 0.16,0.01 h 3.24 c 0.33,0 0.64,0.12 0.88,0.32 0.24,0.2 0.42,0.49 0.47,0.81 0.06,0.27 0.13,0.52 0.2,0.75 l 0.06,0.21 c 0.04,0.14 0.09,0.3 0.15,0.46 0.07,0.19 0.12,0.34 0.18,0.48 0.06,0.16 0.13,0.31 0.19,0.48 0.06,0.16 0.14,0.32 0.21,0.5 0.1,0.23 0.2,0.44 0.3,0.63 l 0.16,0.32 c 0.13,0.26 0.17,0.55 0.13,0.82 -0.04,0.29 -0.18,0.55 -0.39,0.76 -0.79,0.73 -1.82,1.74 -2.54,2.53 -0.05,0.05 -0.09,0.09 -0.12,0.13 -0.02,0.03 -0.04,0.05 -0.04,0.07 -0.01,0.02 -0.01,0.03 -0.02,0.05 -0.01,0.02 -0.02,0.05 -0.03,0.09 l -0.01,0.02 c -0.01,0.04 -0.01,0.08 -0.01,0.13 0,0.06 0,0.11 0.01,0.16 v 0.01 c 0.01,0.04 0.02,0.07 0.03,0.11 l 0.01,0.02 c 0.01,0.03 0.04,0.07 0.07,0.11 0.04,0.05 0.08,0.11 0.14,0.17 l 3.06,3.11 c 0.05,0.04 0.1,0.08 0.14,0.11 0.04,0.03 0.09,0.05 0.13,0.07 v 0 c 0.05,0.02 0.09,0.03 0.14,0.04 0.05,0.01 0.11,0.01 0.17,0.01 0.07,0 0.13,0 0.18,-0.01 h 0.01 c 0.04,-0.01 0.08,-0.02 0.11,-0.03 0.04,-0.02 0.09,-0.04 0.14,-0.07 0.04,-0.03 0.08,-0.06 0.13,-0.1 l 2.28,-2.32 c 0.23,-0.24 0.54,-0.38 0.85,-0.41 0.32,-0.03 0.64,0.05 0.91,0.24 0.13,0.08 0.26,0.16 0.4,0.24 v 0 c 0.17,0.1 0.31,0.18 0.43,0.24 l 0.02,0.01 c 0.29,0.17 0.59,0.31 0.9,0.44 l 0.03,0.01 c 0.14,0.07 0.29,0.13 0.45,0.2 0.17,0.07 0.33,0.13 0.49,0.19 l 0.03,0.01 c 0.2,0.08 0.45,0.17 0.71,0.25 l 0.25,0.09 c 0.29,0.09 0.52,0.27 0.68,0.5 0.17,0.23 0.26,0.52 0.26,0.81 v 3.55 c 0,0.12 0.02,0.22 0.05,0.31 0.02,0.04 0.04,0.08 0.07,0.12 0.03,0.04 0.06,0.08 0.1,0.12 0.08,0.08 0.16,0.13 0.24,0.17 0.09,0.04 0.19,0.05 0.3,0.05 h 4.45 c 0.1,0 0.2,-0.02 0.27,-0.05 0.04,-0.02 0.09,-0.04 0.14,-0.08 0.04,-0.03 0.09,-0.06 0.13,-0.11 0.04,-0.04 0.07,-0.08 0.1,-0.12 0.03,-0.04 0.05,-0.08 0.07,-0.13 0.02,-0.04 0.03,-0.08 0.04,-0.12 0.01,-0.05 0.01,-0.1 0.01,-0.17 v -3.24 c 0,-0.33 0.12,-0.64 0.32,-0.88 0.2,-0.24 0.49,-0.42 0.81,-0.48 0.27,-0.06 0.52,-0.13 0.75,-0.2 l 0.21,-0.06 c 0.31,-0.09 0.63,-0.21 0.95,-0.33 0.31,-0.12 0.63,-0.26 0.97,-0.41 0.23,-0.1 0.44,-0.2 0.63,-0.3 l 0.32,-0.16 c 0.26,-0.13 0.55,-0.17 0.82,-0.13 0.29,0.04 0.55,0.18 0.76,0.39 0.73,0.79 1.74,1.82 2.53,2.54 0.05,0.05 0.09,0.09 0.13,0.12 0.03,0.02 0.05,0.04 0.07,0.04 0.02,0.01 0.03,0.01 0.05,0.02 0.02,0.01 0.05,0.02 0.09,0.03 0.05,0.01 0.1,0.01 0.17,0.01 0.06,0 0.12,0 0.17,-0.01 0.04,-0.01 0.07,-0.02 0.09,-0.03 l 0.02,-0.01 c 0.03,-0.02 0.07,-0.04 0.1,-0.06 v 0 c 0.04,-0.03 0.08,-0.07 0.12,-0.1 0,0 2.88,-2.84 3.15,-3.11 0.04,-0.05 0.08,-0.1 0.11,-0.14 0.03,-0.04 0.05,-0.09 0.07,-0.13 v 0 c 0.02,-0.05 0.03,-0.09 0.04,-0.14 0.01,-0.05 0.01,-0.11 0.01,-0.17 0,-0.12 -0.02,-0.23 -0.05,-0.3 -0.02,-0.04 -0.04,-0.09 -0.07,-0.14 -0.03,-0.04 -0.06,-0.08 -0.1,-0.13 l -2.32,-2.28 c -0.24,-0.23 -0.38,-0.54 -0.41,-0.85 -0.03,-0.32 0.05,-0.64 0.24,-0.91 0.08,-0.13 0.16,-0.26 0.24,-0.4 0.09,-0.15 0.17,-0.3 0.24,-0.43 l 0.01,-0.02 c 0.17,-0.29 0.31,-0.59 0.44,-0.9 l 0.01,-0.03 c 0.07,-0.14 0.13,-0.29 0.2,-0.45 0.07,-0.17 0.13,-0.33 0.19,-0.49 l 0.01,-0.03 c 0.08,-0.2 0.16,-0.45 0.25,-0.71 l 0.09,-0.26 c 0.09,-0.29 0.27,-0.52 0.5,-0.68 0.23,-0.17 0.52,-0.26 0.81,-0.26 h 3.55 c 0.12,0 0.22,-0.02 0.31,-0.05 0.04,-0.02 0.08,-0.04 0.12,-0.07 0.04,-0.03 0.08,-0.06 0.12,-0.1 0.04,-0.04 0.07,-0.08 0.1,-0.12 0.03,-0.04 0.05,-0.08 0.07,-0.13 v 0 c 0.02,-0.04 0.03,-0.08 0.04,-0.12 v 0 c 0.01,-0.05 0.01,-0.1 0.01,-0.17 v -4.45 c 0,-0.06 0,-0.11 -0.01,-0.16 -0.01,-0.04 -0.02,-0.08 -0.03,-0.12 L 68.42,40.93 C 68.4,40.89 68.38,40.85 68.35,40.81 l -0.01,-0.02 c -0.03,-0.04 -0.06,-0.07 -0.1,-0.11 -0.04,-0.04 -0.08,-0.07 -0.12,-0.1 -0.04,-0.03 -0.08,-0.05 -0.13,-0.07 -0.04,-0.02 -0.08,-0.03 -0.12,-0.04 -0.05,-0.01 -0.1,-0.01 -0.17,-0.01 h -3.24 c -0.34,0 -0.65,-0.13 -0.89,-0.33 C 63.33,39.92 63.16,39.64 63.1,39.32 63.02,39.01 62.94,38.7 62.85,38.39 62.81,38.26 62.76,38.1 62.7,37.92 62.64,37.75 62.58,37.59 62.52,37.43 L 62.51,37.4 c -0.01,-0.02 -0.02,-0.05 -0.02,-0.08 -0.1,-0.26 -0.22,-0.53 -0.33,-0.79 l -0.04,-0.09 c -0.13,-0.3 -0.27,-0.58 -0.43,-0.86 L 61.68,35.56 C 61.54,35.29 61.49,35 61.53,34.72 c 0.04,-0.29 0.17,-0.57 0.39,-0.78 0.85,-0.86 1.7,-1.73 2.56,-2.58 0.05,-0.05 0.09,-0.09 0.12,-0.13 l 0.01,-0.02 c 0.01,-0.02 0.02,-0.04 0.03,-0.05 0.01,-0.02 0.01,-0.03 0.02,-0.05 0.01,-0.02 0.02,-0.05 0.03,-0.09 0.01,-0.04 0.01,-0.1 0.01,-0.15 0,-0.06 0,-0.11 -0.01,-0.16 V 30.7 C 64.68,30.66 64.67,30.63 64.66,30.59 L 64.65,30.58 C 64.63,30.54 64.61,30.5 64.58,30.46 64.54,30.41 64.5,30.36 64.44,30.3 Z m 0.81,-2.73 c 0.21,0.09 0.41,0.19 0.6,0.32 0.19,0.13 0.37,0.28 0.54,0.45 l 3.13,3.13 c 0.17,0.17 0.32,0.35 0.45,0.54 0.13,0.19 0.24,0.39 0.32,0.6 v 0.01 c 0.09,0.21 0.16,0.42 0.2,0.65 0.05,0.23 0.07,0.46 0.07,0.69 0,0.23 -0.02,0.47 -0.07,0.7 -0.05,0.23 -0.12,0.45 -0.21,0.66 v 0 c -0.09,0.21 -0.2,0.4 -0.34,0.59 -0.13,0.19 -0.28,0.36 -0.45,0.52 l -1.8,1.84 c 0.02,0.05 0.05,0.1 0.07,0.14 v 0 c 0.14,0.3 0.27,0.61 0.39,0.91 l 0.04,0.1 c 0.03,0.04 0.04,0.09 0.05,0.14 v 0.02 c 0.06,0.16 0.12,0.33 0.18,0.5 0.06,0.18 0.13,0.38 0.19,0.59 0.01,0.04 0.03,0.08 0.04,0.12 h 2.19 c 0.23,0 0.46,0.02 0.69,0.07 0.23,0.04 0.45,0.11 0.66,0.2 0.21,0.09 0.41,0.19 0.6,0.33 0.19,0.13 0.36,0.28 0.53,0.44 l 0.03,0.03 0.02,0.03 c 0.15,0.16 0.3,0.34 0.42,0.52 0.13,0.19 0.23,0.39 0.31,0.59 0.09,0.21 0.15,0.43 0.2,0.65 0.04,0.22 0.07,0.44 0.07,0.67 v 4.45 c 0,0.24 -0.02,0.47 -0.07,0.69 -0.04,0.22 -0.11,0.44 -0.19,0.65 v 0 c -0.09,0.21 -0.19,0.41 -0.32,0.6 -0.13,0.19 -0.28,0.37 -0.45,0.54 -0.17,0.17 -0.35,0.32 -0.54,0.45 -0.19,0.13 -0.39,0.24 -0.6,0.32 -0.21,0.08 -0.42,0.15 -0.65,0.19 -0.23,0.04 -0.46,0.07 -0.7,0.07 h -2.57 c -0.02,0.06 -0.04,0.11 -0.06,0.17 -0.12,0.31 -0.26,0.63 -0.4,0.95 -0.07,0.15 -0.14,0.33 -0.22,0.47 -0.13,0.27 -0.25,0.53 -0.39,0.79 l -0.05,0.09 c 0.54,0.53 1.09,1.06 1.62,1.6 0.16,0.17 0.3,0.34 0.42,0.53 0.13,0.19 0.23,0.39 0.31,0.6 0.08,0.2 0.14,0.42 0.19,0.64 0.04,0.23 0.06,0.46 0.06,0.68 0,0.23 -0.02,0.46 -0.06,0.68 -0.04,0.22 -0.1,0.44 -0.19,0.64 -0.08,0.2 -0.18,0.4 -0.3,0.59 v 0 c -0.11,0.18 -0.25,0.36 -0.4,0.52 -0.04,0.06 -0.07,0.1 -0.13,0.13 l -3.06,3.02 c -0.16,0.17 -0.34,0.33 -0.54,0.46 -0.19,0.13 -0.39,0.24 -0.6,0.33 h -0.01 c -0.2,0.09 -0.42,0.15 -0.64,0.2 -0.23,0.05 -0.47,0.07 -0.71,0.07 -0.23,0 -0.47,-0.02 -0.7,-0.07 C 59.1,62.25 58.88,62.18 58.66,62.09 58.45,62 58.24,61.89 58.05,61.75 v 0 c -0.18,-0.13 -0.36,-0.28 -0.52,-0.44 l -1.81,-1.81 -0.15,0.07 v 0 c -0.34,0.15 -0.71,0.3 -1.1,0.46 l -0.03,0.01 c -0.18,0.07 -0.36,0.13 -0.54,0.2 -0.21,0.07 -0.41,0.14 -0.59,0.19 l -0.11,0.04 v 2.19 c 0,0.23 -0.02,0.46 -0.07,0.69 -0.04,0.23 -0.11,0.45 -0.2,0.66 -0.09,0.21 -0.19,0.41 -0.33,0.6 -0.13,0.19 -0.28,0.36 -0.44,0.53 l -0.05,0.05 c -0.16,0.15 -0.34,0.29 -0.52,0.41 -0.19,0.12 -0.38,0.23 -0.58,0.32 v 0 c -0.21,0.09 -0.43,0.15 -0.65,0.2 -0.22,0.04 -0.44,0.07 -0.67,0.07 H 45.24 C 44.75,66.19 44.3,66.1 43.88,65.93 43.46,65.76 43.09,65.5 42.75,65.16 42.58,64.99 42.43,64.81 42.3,64.62 42.17,64.43 42.06,64.23 41.98,64.02 41.9,63.81 41.83,63.6 41.79,63.37 41.75,63.14 41.72,62.91 41.72,62.67 V 60.1 C 41.66,60.08 41.61,60.06 41.55,60.04 41.23,59.92 40.92,59.78 40.6,59.64 40.44,59.57 40.29,59.5 40.14,59.42 v 0 C 39.87,59.29 39.6,59.17 39.34,59.03 L 39.25,59 c -0.53,0.54 -1.06,1.09 -1.6,1.62 -0.17,0.16 -0.34,0.3 -0.53,0.42 -0.19,0.13 -0.39,0.23 -0.6,0.31 -0.2,0.08 -0.42,0.14 -0.64,0.19 -0.23,0.04 -0.46,0.06 -0.68,0.06 -0.22,0 -0.46,-0.02 -0.68,-0.06 -0.22,-0.04 -0.44,-0.1 -0.64,-0.19 -0.2,-0.08 -0.4,-0.18 -0.59,-0.3 l -0.03,-0.02 c -0.18,-0.11 -0.34,-0.24 -0.49,-0.38 -0.06,-0.04 -0.1,-0.07 -0.13,-0.13 L 29.6,57.44 C 29.43,57.27 29.28,57.09 29.15,56.9 29.02,56.71 28.91,56.51 28.83,56.3 v -0.01 c -0.09,-0.21 -0.16,-0.42 -0.2,-0.64 -0.05,-0.23 -0.07,-0.46 -0.07,-0.7 0,-0.23 0.02,-0.47 0.07,-0.7 0.05,-0.23 0.12,-0.45 0.21,-0.66 v 0 c 0.09,-0.21 0.2,-0.4 0.34,-0.59 0.13,-0.18 0.28,-0.36 0.44,-0.51 l 1.81,-1.81 -0.07,-0.15 v 0 C 31.28,50.35 31.2,50.17 31.13,50 L 31.12,49.98 C 31.05,49.8 30.97,49.62 30.9,49.43 L 30.89,49.4 C 30.82,49.22 30.76,49.04 30.69,48.86 30.62,48.65 30.55,48.45 30.5,48.27 30.49,48.23 30.48,48.2 30.47,48.16 h -2.19 c -0.23,0 -0.46,-0.02 -0.69,-0.07 -0.23,-0.04 -0.45,-0.11 -0.66,-0.2 -0.21,-0.09 -0.41,-0.2 -0.6,-0.33 -0.19,-0.13 -0.36,-0.28 -0.53,-0.44 l -0.03,-0.03 c -0.16,-0.17 -0.3,-0.35 -0.43,-0.54 -0.12,-0.19 -0.23,-0.38 -0.32,-0.58 v 0 C 24.93,45.76 24.87,45.54 24.82,45.32 24.78,45.1 24.75,44.88 24.75,44.65 V 40.2 c 0,-0.24 0.02,-0.47 0.07,-0.69 0.04,-0.22 0.11,-0.44 0.19,-0.65 v 0 c 0.09,-0.21 0.19,-0.41 0.32,-0.6 0.13,-0.19 0.28,-0.37 0.45,-0.54 0.34,-0.34 0.72,-0.6 1.14,-0.77 0.21,-0.08 0.42,-0.15 0.65,-0.19 0.23,-0.04 0.46,-0.07 0.7,-0.07 h 2.57 c 0.02,-0.06 0.04,-0.11 0.06,-0.17 0.12,-0.32 0.26,-0.63 0.4,-0.95 0.07,-0.16 0.14,-0.31 0.22,-0.47 v 0 c 0.13,-0.27 0.26,-0.54 0.39,-0.8 l 0.05,-0.09 -1.55,-1.55 C 30.25,32.5 30.1,32.32 29.97,32.13 29.84,31.94 29.73,31.74 29.63,31.53 v 0 c -0.09,-0.21 -0.16,-0.43 -0.21,-0.66 -0.05,-0.23 -0.07,-0.46 -0.07,-0.69 0,-0.23 0.02,-0.47 0.07,-0.7 0.05,-0.23 0.12,-0.45 0.21,-0.66 0.09,-0.22 0.2,-0.42 0.33,-0.6 0.13,-0.19 0.28,-0.36 0.45,-0.53 1.03,-1.03 2.09,-2.17 3.15,-3.15 0.16,-0.16 0.34,-0.31 0.52,-0.43 0.19,-0.13 0.39,-0.24 0.6,-0.32 h 0.01 c 0.21,-0.09 0.42,-0.16 0.65,-0.2 0.23,-0.05 0.46,-0.07 0.69,-0.07 0.23,0 0.47,0.02 0.7,0.07 0.23,0.05 0.45,0.12 0.66,0.21 0.21,0.09 0.41,0.21 0.59,0.34 L 38,24.16 c 0.18,0.13 0.34,0.27 0.5,0.43 l 1.84,1.8 c 0.04,-0.02 0.08,-0.04 0.15,-0.07 l 0.12,-0.06 c 0.28,-0.12 0.57,-0.25 0.86,-0.37 0.07,-0.05 0.12,-0.06 0.19,-0.07 0.16,-0.06 0.33,-0.12 0.5,-0.18 0.21,-0.07 0.41,-0.14 0.59,-0.19 l 0.11,-0.04 V 23.2 c 0,-0.23 0.02,-0.46 0.07,-0.69 0.04,-0.23 0.11,-0.45 0.2,-0.66 0.09,-0.21 0.19,-0.41 0.33,-0.6 0.13,-0.19 0.28,-0.36 0.44,-0.53 l 0.04,-0.03 c 0.17,-0.16 0.35,-0.3 0.53,-0.43 0.19,-0.12 0.38,-0.23 0.58,-0.32 v 0 c 0.21,-0.09 0.43,-0.15 0.65,-0.2 0.22,-0.04 0.44,-0.07 0.67,-0.07 h 4.45 c 0.24,0 0.47,0.02 0.69,0.07 0.22,0.04 0.44,0.11 0.65,0.19 v 0 c 0.21,0.08 0.41,0.19 0.6,0.32 0.19,0.13 0.37,0.28 0.55,0.45 l 0.01,0.01 c 0.17,0.17 0.32,0.35 0.45,0.54 0.13,0.19 0.24,0.39 0.32,0.6 0.08,0.21 0.15,0.42 0.19,0.65 0.04,0.23 0.07,0.46 0.07,0.7 v 2.57 c 0.06,0.02 0.11,0.04 0.17,0.06 0.19,0.07 0.38,0.14 0.57,0.23 l 0.02,0.01 c 0.19,0.08 0.37,0.16 0.55,0.25 l 0.29,0.14 c 0.27,0.13 0.53,0.25 0.79,0.39 l 0.09,0.05 1.55,-1.55 c 0.16,-0.16 0.34,-0.31 0.53,-0.44 0.19,-0.13 0.39,-0.24 0.6,-0.34 v 0 c 0.21,-0.09 0.43,-0.16 0.66,-0.21 0.23,-0.05 0.46,-0.07 0.7,-0.07 0.23,0 0.47,0.02 0.69,0.07 0.15,0.03 0.3,0.07 0.45,0.12 0.04,-0.01 0.09,0 0.15,0.02 z M 48,32.79 c 0.33,0 0.67,0.02 1.02,0.05 0.34,0.03 0.67,0.08 0.99,0.15 v 0 c 0.32,0.06 0.64,0.15 0.97,0.25 0.32,0.1 0.64,0.22 0.95,0.35 l 0.02,0.01 c 0.3,0.13 0.6,0.27 0.88,0.43 0.28,0.15 0.55,0.32 0.81,0.51 l 0.01,0.01 c 0.54,0.36 1.01,0.76 1.46,1.2 l 0.01,0.01 c 0.23,0.23 0.44,0.47 0.64,0.71 0.2,0.25 0.39,0.51 0.57,0.77 l 0.02,0.03 c 0.17,0.27 0.34,0.53 0.48,0.8 0.16,0.28 0.3,0.57 0.44,0.87 0.01,0.02 0.02,0.04 0.03,0.06 0.01,0.02 0.02,0.05 0.02,0.07 0.25,0.6 0.43,1.2 0.54,1.8 0.06,0.32 0.11,0.65 0.15,0.99 0.03,0.34 0.05,0.68 0.05,1.02 0,0.33 -0.02,0.67 -0.05,1.02 -0.03,0.34 -0.08,0.67 -0.15,0.99 v 0 c -0.06,0.32 -0.15,0.64 -0.25,0.97 -0.1,0.32 -0.22,0.64 -0.35,0.95 l -0.01,0.02 c -0.26,0.59 -0.57,1.16 -0.93,1.69 l -0.01,0.02 c -0.18,0.27 -0.37,0.52 -0.56,0.76 -0.2,0.24 -0.41,0.48 -0.64,0.71 L 55.1,50 c -0.23,0.23 -0.47,0.44 -0.71,0.64 -0.25,0.21 -0.51,0.39 -0.77,0.57 l -0.03,0.02 c -0.27,0.17 -0.53,0.34 -0.8,0.48 -0.28,0.16 -0.57,0.3 -0.87,0.44 l -0.01,0.01 c -0.04,0.02 -0.08,0.04 -0.13,0.05 -0.6,0.25 -1.19,0.42 -1.8,0.54 -0.32,0.06 -0.65,0.11 -0.99,0.15 -0.34,0.03 -0.68,0.05 -1.02,0.05 -0.33,0 -0.67,-0.02 -1.02,-0.05 -0.34,-0.03 -0.67,-0.08 -0.99,-0.15 v 0 C 45.64,52.69 45.32,52.6 44.99,52.5 44.67,52.4 44.35,52.28 44.04,52.15 L 44.02,52.14 C 43.43,51.88 42.86,51.57 42.33,51.21 L 42.31,51.2 C 42.04,51.02 41.79,50.83 41.55,50.64 41.31,50.44 41.07,50.23 40.84,50 L 40.83,49.99 C 40.6,49.76 40.39,49.52 40.19,49.28 39.99,49.03 39.8,48.77 39.62,48.51 L 39.6,48.48 C 39.25,47.95 38.94,47.39 38.68,46.81 L 38.67,46.8 c -0.02,-0.04 -0.04,-0.08 -0.05,-0.13 -0.12,-0.29 -0.23,-0.58 -0.31,-0.87 -0.09,-0.3 -0.17,-0.61 -0.22,-0.92 -0.06,-0.32 -0.11,-0.65 -0.15,-0.99 -0.03,-0.34 -0.05,-0.68 -0.05,-1.02 0,-0.33 0.02,-0.67 0.05,-1.02 0.03,-0.34 0.08,-0.67 0.15,-0.99 v 0 c 0.06,-0.32 0.15,-0.64 0.25,-0.97 0.1,-0.32 0.22,-0.64 0.35,-0.95 l 0.01,-0.02 c 0.13,-0.29 0.27,-0.58 0.42,-0.86 0.16,-0.29 0.33,-0.56 0.51,-0.83 l 0.01,-0.02 C 40,36.67 40.4,36.2 40.84,35.75 l 0.01,-0.01 c 0.23,-0.23 0.47,-0.44 0.71,-0.64 0.25,-0.2 0.51,-0.39 0.77,-0.57 l 0.03,-0.02 c 0.27,-0.17 0.53,-0.34 0.8,-0.48 0.28,-0.16 0.57,-0.3 0.87,-0.44 l 0.01,-0.01 c 0.04,-0.02 0.08,-0.04 0.13,-0.05 0.29,-0.12 0.57,-0.22 0.87,-0.31 0.31,-0.09 0.61,-0.17 0.93,-0.23 v 0 c 0.32,-0.06 0.65,-0.11 0.99,-0.15 0.37,-0.03 0.7,-0.05 1.04,-0.05 z m 1.39,2.88 C 49.17,35.63 48.96,35.6 48.74,35.58 48.51,35.56 48.26,35.54 48,35.54 c -0.26,0 -0.51,0.01 -0.75,0.04 -0.24,0.02 -0.49,0.06 -0.73,0.11 -0.24,0.05 -0.47,0.1 -0.68,0.17 -0.2,0.06 -0.4,0.13 -0.6,0.21 -0.02,0.01 -0.05,0.02 -0.07,0.03 l -0.02,0.01 c -0.22,0.1 -0.44,0.2 -0.65,0.31 l -0.02,0.01 c -0.21,0.11 -0.41,0.23 -0.6,0.36 l -0.01,0.01 c -0.19,0.13 -0.37,0.26 -0.55,0.4 v 0 c -0.19,0.15 -0.36,0.3 -0.53,0.46 -0.16,0.16 -0.31,0.33 -0.46,0.51 l -0.02,0.02 c -0.14,0.17 -0.27,0.35 -0.4,0.54 l -0.01,0.02 c -0.12,0.18 -0.24,0.38 -0.35,0.59 -0.12,0.22 -0.22,0.44 -0.32,0.67 v 0.01 c -0.09,0.22 -0.17,0.44 -0.24,0.66 -0.07,0.23 -0.13,0.46 -0.17,0.7 v 0 c -0.05,0.25 -0.08,0.49 -0.11,0.74 -0.02,0.23 -0.03,0.48 -0.03,0.74 0,0.26 0.01,0.51 0.04,0.75 0.02,0.24 0.06,0.49 0.11,0.73 0.05,0.24 0.1,0.46 0.17,0.68 0.06,0.21 0.13,0.41 0.21,0.62 0.01,0.02 0.02,0.05 0.03,0.07 l 0.01,0.02 c 0.1,0.22 0.2,0.44 0.31,0.65 l 0.01,0.02 c 0.11,0.2 0.23,0.41 0.36,0.6 l 0.01,0.01 c 0.13,0.19 0.26,0.37 0.41,0.55 0.15,0.18 0.3,0.35 0.47,0.52 0.17,0.17 0.35,0.33 0.53,0.47 0.18,0.14 0.36,0.28 0.55,0.4 l 0.02,0.01 c 0.18,0.12 0.38,0.24 0.59,0.35 0.22,0.12 0.44,0.22 0.67,0.32 l 0.01,0.01 c 0.22,0.09 0.44,0.17 0.66,0.24 0.23,0.07 0.46,0.13 0.7,0.17 v 0 c 0.25,0.05 0.49,0.08 0.74,0.11 0.23,0.02 0.48,0.03 0.74,0.03 0.26,0 0.51,-0.01 0.75,-0.04 0.24,-0.02 0.49,-0.06 0.73,-0.11 0.24,-0.05 0.47,-0.1 0.68,-0.17 0.2,-0.06 0.4,-0.13 0.59,-0.21 0.03,-0.02 0.05,-0.02 0.07,-0.03 l 0.02,-0.01 c 0.22,-0.1 0.44,-0.2 0.65,-0.31 l 0.02,-0.01 c 0.2,-0.11 0.41,-0.23 0.6,-0.36 l 0.01,-0.01 c 0.19,-0.13 0.37,-0.26 0.55,-0.4 v 0 c 0.19,-0.15 0.36,-0.3 0.53,-0.46 0.16,-0.16 0.31,-0.33 0.46,-0.51 l 0.02,-0.02 c 0.14,-0.17 0.27,-0.35 0.4,-0.54 h 0.01 c 0.12,-0.18 0.24,-0.38 0.35,-0.59 v 0 c 0.12,-0.22 0.22,-0.44 0.32,-0.67 l 0.01,-0.01 c 0.09,-0.22 0.17,-0.44 0.24,-0.66 0.07,-0.23 0.13,-0.46 0.17,-0.7 v 0 c 0.05,-0.25 0.08,-0.49 0.11,-0.74 0.02,-0.23 0.03,-0.48 0.03,-0.74 0,-0.26 -0.01,-0.51 -0.04,-0.75 C 55.29,41.9 55.25,41.65 55.2,41.41 55.15,41.17 55.1,40.94 55.03,40.73 54.97,40.53 54.9,40.33 54.82,40.13 54.8,40.1 54.8,40.08 54.79,40.06 l -0.01,-0.02 c -0.1,-0.22 -0.2,-0.44 -0.31,-0.65 l -0.01,-0.02 c -0.11,-0.21 -0.23,-0.41 -0.36,-0.6 l -0.01,-0.01 c -0.13,-0.19 -0.26,-0.37 -0.41,-0.55 -0.15,-0.18 -0.3,-0.35 -0.47,-0.52 -0.17,-0.17 -0.35,-0.33 -0.53,-0.47 -0.18,-0.14 -0.36,-0.28 -0.55,-0.4 l -0.02,-0.01 c -0.18,-0.13 -0.38,-0.24 -0.59,-0.35 v 0 C 51.3,36.34 51.08,36.24 50.85,36.14 L 50.84,36.13 C 50.62,36.04 50.4,35.96 50.18,35.89 49.95,35.82 49.72,35.76 49.48,35.72 49.45,35.7 49.42,35.69 49.39,35.67 Z M 5.83,34.95 C 7.68,25.12 12.89,16.47 20.21,10.24 27.71,3.85 37.42,0 48.02,0 57.34,0 65.96,2.97 73,8.02 80.22,13.2 85.78,20.57 88.69,29.16 l -2.63,0.89 -2.63,0.89 C 83.36,30.72 83.28,30.5 83.2,30.29 80.61,23.1 75.87,16.92 69.76,12.54 63.63,8.15 56.12,5.57 48.01,5.57 38.76,5.57 30.3,8.92 23.79,14.46 17.67,19.67 13.25,26.82 11.48,34.96 h 5.69 L 8.59,45.41 0,34.95 Z"
         inkscape:connector-curvature="0" />
    </g>
    <g
       id="g944"
       transform="matrix(0.26458333,0,0,0.26458333,109.95159,106.26696)">
      <path
         id="path942"
         d="m 95.05,12.23 c 0.08,-1.55 0.32,-3.09 0.55,-4.66 0.5,-3.3 1.01,-1.88 -0.11,-5.02 -0.36,-0.99 0.16,-2.09 1.15,-2.44 0.99,-0.36 2.09,0.16 2.44,1.15 1.46,4.07 0.88,3.12 0.31,6.88 -0.21,1.39 -0.42,2.76 -0.5,4.09 v 0 c 0.99,0 1.89,0.4 2.54,1.05 0.05,0.05 0.1,0.1 0.14,0.16 0.57,0.64 0.91,1.47 0.91,2.38 v 0.19 h 11.33 c 2.49,0 4.76,1.02 6.4,2.66 1.64,1.64 2.66,3.91 2.66,6.4 v 41.35 c 0,2.49 -1.02,4.76 -2.66,6.4 -1.64,1.64 -3.91,2.66 -6.4,2.66 H 9.06 C 6.57,75.48 4.3,74.46 2.66,72.82 1.02,71.19 0,68.92 0,66.43 V 25.08 c 0,-2.49 1.02,-4.76 2.66,-6.4 1.64,-1.64 3.91,-2.66 6.4,-2.66 h 81.26 v -0.19 c 0,-0.98 0.4,-1.88 1.05,-2.53 v 0 0 0 c 0.65,-0.65 1.55,-1.05 2.53,-1.05 h 1.15 z m -2.81,7.62 H 9.06 c -1.44,0 -2.74,0.59 -3.69,1.54 -0.95,0.95 -1.54,2.25 -1.54,3.69 v 41.35 c 0,1.44 0.59,2.74 1.54,3.69 0.95,0.95 2.25,1.54 3.69,1.54 h 104.75 c 1.44,0 2.74,-0.59 3.69,-1.54 0.95,-0.95 1.54,-2.25 1.54,-3.69 V 25.08 c 0,-1.44 -0.59,-2.74 -1.54,-3.69 -0.95,-0.95 -2.25,-1.54 -3.69,-1.54 h -13.24 c -1.06,0 -1.92,-0.86 -1.92,-1.92 v -1.87 h -4.49 v 1.87 c 0,1.06 -0.86,1.92 -1.92,1.92 z m -79.98,5.89 h 7.75 c 1.06,0 1.92,0.86 1.92,1.92 v 6.54 c 0,1.06 -0.86,1.92 -1.92,1.92 h -7.75 c -1.06,0 -1.92,-0.86 -1.92,-1.92 v -6.54 c 0,-1.06 0.86,-1.92 1.92,-1.92 z m 15.35,0 h 7.75 c 1.06,0 1.92,0.86 1.92,1.92 v 6.54 c 0,1.06 -0.86,1.92 -1.92,1.92 h -7.75 c -1.06,0 -1.92,-0.86 -1.92,-1.92 v -6.54 c 0,-1.06 0.86,-1.92 1.92,-1.92 z m 15.36,0 h 7.75 c 1.06,0 1.92,0.86 1.92,1.92 v 6.54 c 0,1.06 -0.86,1.92 -1.92,1.92 h -7.75 c -1.06,0 -1.92,-0.86 -1.92,-1.92 v -6.54 c 0,-1.06 0.86,-1.92 1.92,-1.92 z m 15.35,0 h 7.75 c 1.06,0 1.92,0.86 1.92,1.92 v 6.54 c 0,1.06 -0.86,1.92 -1.92,1.92 h -7.75 c -1.06,0 -1.92,-0.86 -1.92,-1.92 v -6.54 c 0.01,-1.06 0.86,-1.92 1.92,-1.92 z m 15.36,0 h 7.75 c 1.06,0 1.92,0.86 1.92,1.92 v 6.54 c 0,1.06 -0.86,1.92 -1.92,1.92 h -7.75 c -1.06,0 -1.92,-0.86 -1.92,-1.92 v -6.54 c 0,-1.06 0.86,-1.92 1.92,-1.92 z m 15.35,0 h 7.75 c 1.06,0 1.92,0.86 1.92,1.92 v 6.54 c 0,1.06 -0.86,1.92 -1.92,1.92 h -7.75 c -1.06,0 -1.92,-0.86 -1.92,-1.92 v -6.54 c 0.01,-1.06 0.87,-1.92 1.92,-1.92 z m 15.36,0 h 7.75 c 1.06,0 1.92,0.86 1.92,1.92 v 6.54 c 0,1.06 -0.86,1.92 -1.92,1.92 h -7.75 c -1.06,0 -1.92,-0.86 -1.92,-1.92 v -6.54 c 0,-1.06 0.86,-1.92 1.92,-1.92 z m 0,14.12 h 7.75 c 1.06,0 1.92,0.87 1.92,1.94 v 20.68 c 0,1.07 -0.86,1.94 -1.92,1.94 h -7.75 c -1.06,0 -1.92,-0.87 -1.92,-1.94 V 41.8 c 0,-1.07 0.86,-1.94 1.92,-1.94 z m -92.13,0.17 h 7.75 c 1.06,0 1.92,0.86 1.92,1.92 v 6.54 c 0,1.06 -0.86,1.92 -1.92,1.92 h -7.75 c -1.06,0 -1.92,-0.86 -1.92,-1.92 v -6.54 c 0,-1.06 0.86,-1.92 1.92,-1.92 z m 15.35,0 h 7.75 c 1.06,0 1.92,0.86 1.92,1.92 v 6.54 c 0,1.06 -0.86,1.92 -1.92,1.92 h -7.75 c -1.06,0 -1.92,-0.86 -1.92,-1.92 v -6.54 c 0,-1.06 0.86,-1.92 1.92,-1.92 z m 15.36,0 h 7.75 c 1.06,0 1.92,0.86 1.92,1.92 v 6.54 c 0,1.06 -0.86,1.92 -1.92,1.92 h -7.75 c -1.06,0 -1.92,-0.86 -1.92,-1.92 v -6.54 c 0,-1.06 0.86,-1.92 1.92,-1.92 z m 15.35,0 h 7.75 c 1.06,0 1.92,0.86 1.92,1.92 v 6.54 c 0,1.06 -0.86,1.92 -1.92,1.92 h -7.75 c -1.06,0 -1.92,-0.86 -1.92,-1.92 v -6.54 c 0.01,-1.06 0.86,-1.92 1.92,-1.92 z m 15.36,0 h 7.75 c 1.06,0 1.92,0.86 1.92,1.92 v 6.54 c 0,1.06 -0.86,1.92 -1.92,1.92 h -7.75 c -1.06,0 -1.92,-0.86 -1.92,-1.92 v -6.54 c 0,-1.06 0.86,-1.92 1.92,-1.92 z m 15.35,0 h 7.75 c 1.06,0 1.92,0.86 1.92,1.92 v 6.54 c 0,1.06 -0.86,1.92 -1.92,1.92 h -7.75 c -1.06,0 -1.92,-0.86 -1.92,-1.92 v -6.54 c 0.01,-1.06 0.87,-1.92 1.92,-1.92 z M 12.26,54.17 h 7.75 c 1.06,0 1.92,0.86 1.92,1.92 v 6.54 c 0,1.06 -0.86,1.92 -1.92,1.92 h -7.75 c -1.06,0 -1.92,-0.86 -1.92,-1.92 v -6.54 c 0,-1.06 0.86,-1.92 1.92,-1.92 z m 15.35,0 h 38.47 c 1.05,0 1.9,0.86 1.9,1.92 v 6.54 c 0,1.06 -0.85,1.92 -1.9,1.92 H 27.61 c -1.05,0 -1.9,-0.86 -1.9,-1.92 v -6.54 c 0,-1.06 0.85,-1.92 1.9,-1.92 z m 46.07,0 h 7.75 c 1.06,0 1.92,0.86 1.92,1.92 v 6.54 c 0,1.06 -0.86,1.92 -1.92,1.92 h -7.75 c -1.06,0 -1.92,-0.86 -1.92,-1.92 v -6.54 c 0,-1.06 0.86,-1.92 1.92,-1.92 z m 15.35,0 h 7.75 c 1.06,0 1.92,0.86 1.92,1.92 v 6.54 c 0,1.06 -0.86,1.92 -1.92,1.92 h -7.75 c -1.06,0 -1.92,-0.86 -1.92,-1.92 v -6.54 c 0.01,-1.06 0.87,-1.92 1.92,-1.92 z"
         inkscape:connector-curvature="0" />
    </g>
    <g
       id="g1010"
       transform="matrix(0.26458333,0,0,0.26458333,109.95027,65.478444)">
      <path
         id="path1008"
         d="m 3.34,0 h 116.2 c 1.84,0 3.34,1.5 3.34,3.34 v 76.98 c 0,1.84 -1.5,3.34 -3.34,3.34 H 3.34 C 1.5,83.66 0,82.16 0,80.32 V 3.34 C 0,1.5 1.5,0 3.34,0 Z m 9.23,11.68 h 9.82 v 2.56 h -9.82 z m 14.5,27.12 h -14.5 v -2.57 h 14.5 z M 46.8,38.81 H 30.02 V 36.23 H 46.8 Z m 28.86,0 H 49.64 v -2.57 h 26.03 v 2.57 z M 37.25,28.07 H 88.4 V 30.6 H 37.25 Z M 25.22,28.05 h 9.26 v 2.56 h -9.26 z m -12.65,0 h 9.82 v 2.56 h -9.82 z m 22.2,-5.64 h -22.2 v -2.54 h 22.21 v 2.54 z m 12.03,0.01 h -9.26 v -2.56 h 9.26 z m 28.86,0.01 H 49.64 v -2.57 h 26.03 v 2.57 z M 37.25,11.68 h 22.21 v 2.54 H 37.25 Z m -12.03,0 h 9.26 v 2.56 h -9.26 z m 65.98,50.4 -9.1,-5.1 v -2.92 l 9.1,-5.1 v 3.36 l -6.34,3.16 6.34,3.26 z m 1.69,2.27 3.29,-17.91 h 1.91 l -3.31,17.91 z m 6.59,-2.25 v -3.34 l 6.35,-3.2 -6.35,-3.24 V 49 l 9.1,5.14 v 2.88 z M 46.29,88.27 h 30.3 c 0.08,5.24 2.24,9.93 8.09,13.63 H 38.2 c 4.68,-3.39 8.11,-7.51 8.09,-13.63 z M 61.44,72.41 c 2.37,0 4.29,1.92 4.29,4.29 0,2.37 -1.92,4.29 -4.29,4.29 -2.37,0 -4.29,-1.92 -4.29,-4.29 0,-2.37 1.92,-4.29 4.29,-4.29 z M 10.05,6.29 h 102.79 c 1.63,0 2.95,1.33 2.95,2.95 v 57.52 c 0,1.62 -1.33,2.95 -2.95,2.95 H 10.05 C 8.43,69.71 7.1,68.38 7.1,66.76 V 9.24 C 7.09,7.62 8.42,6.29 10.05,6.29 Z"
         class="st0"
         inkscape:connector-curvature="0"
         style="clip-rule:evenodd;fill-rule:evenodd" />
    </g>
    <text
       xml:space="preserve"
       style="font-style:normal;font-weight:normal;font-size:10.58333302px;line-height:1.25;font-family:sans-serif;letter-spacing:0px;word-spacing:0px;fill:#000000;fill-opacity:1;stroke:none;stroke-width:0.26458332"
       x="100.56441"
       y="57.211906"
       id="text1024"><tspan
         sodipodi:role="line"
         id="tspan1022"
         x="100.56441"
         y="57.211906"
         style="font-size:7.05555534px;stroke-width:0.26458332">Command line</tspan></text>
    <text
       xml:space="preserve"
       style="font-style:normal;font-weight:normal;font-size:10.58333302px;line-height:1.25;font-family:sans-serif;letter-spacing:0px;word-spacing:0px;fill:#000000;fill-opacity:1;stroke:none;stroke-width:0.26458332"
       x="25.41695"
       y="77.531525"
       id="text1024-3"><tspan
         sodipodi:role="line"
         id="tspan1022-6"
         x="25.41695"
         y="77.531525"
         style="font-size:7.05555534px;stroke-width:0.26458332">Process</tspan></text>
    <rect
       style="fill:none;fill-opacity:1;stroke:#4b668e;stroke-width:1.32291663;stroke-miterlimit:4;stroke-dasharray:none"
       id="rect1044"
       width="38.809151"
       height="62.261658"
       x="19.579163"
       y="58.875"
       ry="0" />
    <rect
       style="fill:none;fill-opacity:1;stroke:#4b668e;stroke-width:1.32299995;stroke-linejoin:round;stroke-miterlimit:4;stroke-dasharray:none"
       id="rect1044-7"
       width="60.854168"
       height="87.3125"
       x="95.779167"
       y="47.762501" />
    <path
       style="fill:none;stroke:#000000;stroke-width:1.06500006;stroke-linecap:butt;stroke-linejoin:miter;stroke-miterlimit:4;stroke-dasharray:none;stroke-opacity:1;marker-end:url(#Arrow1Mend)"
       d="M 109.80208,114.4375 H 59.266667"
       id="path1063"
       inkscape:connector-curvature="0"
       sodipodi:nodetypes="cc" />
    <path
       style="fill:none;stroke:#000000;stroke-width:1.06500006;stroke-linecap:butt;stroke-linejoin:miter;stroke-miterlimit:4;stroke-dasharray:none;stroke-opacity:1;marker-start:url(#Arrow2Mstart-6)"
       d="M 108.47917,69.458333 H 58.208335"
       id="path1063-5"
       inkscape:connector-curvature="0"
       sodipodi:nodetypes="cc" />
    <path
       style="fill:none;stroke:#000000;stroke-width:1.06500006;stroke-linecap:butt;stroke-linejoin:miter;stroke-miterlimit:4;stroke-dasharray:none;stroke-opacity:1;marker-start:url(#marker3229)"
       d="M 108.47917,82.6875 H 58.208333"
       id="path1063-5-9"
       inkscape:connector-curvature="0"
       sodipodi:nodetypes="cc" />
    <text
       xml:space="preserve"
       style="font-style:normal;font-weight:normal;font-size:10.58333302px;line-height:1.25;font-family:sans-serif;letter-spacing:0px;word-spacing:0px;fill:#000000;fill-opacity:1;stroke:none;stroke-width:0.26458332"
       x="66.8778"
       y="120.63305"
       id="text2915"><tspan
         sodipodi:role="line"
         id="tspan2913"
         x="66.8778"
         y="120.63305"
         style="font-size:6.3499999px;stroke-width:0.26458332">stdin (0)</tspan></text>
    <text
       xml:space="preserve"
       style="font-style:normal;font-weight:normal;font-size:10.58333302px;line-height:1.25;font-family:sans-serif;letter-spacing:0px;word-spacing:0px;fill:#000000;fill-opacity:1;stroke:none;stroke-width:0.26458332"
       x="62.398682"
       y="89.025406"
       id="text2915-1"><tspan
         sodipodi:role="line"
         id="tspan2913-2"
         x="62.398682"
         y="89.025406"
         style="font-size:6.3499999px;stroke-width:0.26458332">stdout (1)</tspan></text>
    <text
       xml:space="preserve"
       style="font-style:normal;font-weight:normal;font-size:10.58333302px;line-height:1.25;font-family:sans-serif;letter-spacing:0px;word-spacing:0px;fill:#000000;fill-opacity:1;stroke:none;stroke-width:0.26458332"
       x="63.087013"
       y="67.329552"
       id="text2915-1-7"><tspan
         sodipodi:role="line"
         id="tspan2913-2-0"
         x="63.087013"
         y="67.329552"
         style="font-size:6.3499999px;stroke-width:0.26458332">stderr (2)</tspan></text>
  </g>
  <style
     id="style1006"
     type="text/css">.st0{fill-rule:evenodd;clip-rule:evenodd;}</style>
</svg>
