EESchema Schematic File Version 4
EELAYER 30 0
EELAYER END
$Descr A4 11693 8268
encoding utf-8
Sheet 3 14
Title ""
Date "2020-08-06"
Rev ""
Comp "grokkingStuff (Vishakh Kumar)"
Comment1 ""
Comment2 ""
Comment3 ""
Comment4 ""
$EndDescr
$Comp
L Device:C C11
U 1 1 6035E17B
P 2200 4050
F 0 "C11" V 2452 4050 50  0000 C CNN
F 1 "2.2nF" V 2361 4050 50  0000 C CNN
F 2 "Capacitor_SMD:C_0402_1005Metric" H 2238 3900 50  0001 C CNN
F 3 "~" H 2200 4050 50  0001 C CNN
	1    2200 4050
	0    1    -1   0   
$EndComp
$Comp
L Device:C C15
U 1 1 6035E181
P 3650 4100
F 0 "C15" V 3902 4100 50  0000 C CNN
F 1 "0.1 uF" V 3811 4100 50  0000 C CNN
F 2 "Capacitor_SMD:C_0402_1005Metric" H 3688 3950 50  0001 C CNN
F 3 "~" H 3650 4100 50  0001 C CNN
	1    3650 4100
	0    1    -1   0   
$EndComp
$Comp
L power:GND #PWR0117
U 1 1 6035E187
P 3500 4100
F 0 "#PWR0117" H 3500 3850 50  0001 C CNN
F 1 "GND" H 3500 3950 50  0000 C CNN
F 2 "" H 3500 4100 50  0000 C CNN
F 3 "" H 3500 4100 50  0000 C CNN
	1    3500 4100
	0    1    -1   0   
$EndComp
$Comp
L power:GND #PWR0118
U 1 1 6035E18D
P 2050 4050
F 0 "#PWR0118" H 2050 3800 50  0001 C CNN
F 1 "GND" H 2050 3900 50  0000 C CNN
F 2 "" H 2050 4050 50  0000 C CNN
F 3 "" H 2050 4050 50  0000 C CNN
	1    2050 4050
	0    1    -1   0   
$EndComp
$Comp
L Sensor_Motion:MPU-6050 U1
U 1 1 6035E193
P 2800 3000
F 0 "U1" H 2350 2450 50  0000 C CNN
F 1 "MPU-6050" H 2500 2350 50  0000 C CNN
F 2 "Sensor_Motion:InvenSense_QFN-24_4x4mm_P0.5mm" H 2800 2200 50  0001 C CNN
F 3 "https://store.invensense.com/datasheets/invensense/MPU-6050_DataSheet_V3%204.pdf" H 2800 2850 50  0001 C CNN
	1    2800 3000
	1    0    0    -1  
$EndComp
$Comp
L power:GND #PWR0119
U 1 1 6035E199
P 3700 3500
F 0 "#PWR0119" H 3700 3250 50  0001 C CNN
F 1 "GND" H 3700 3350 50  0000 C CNN
F 2 "" H 3700 3500 50  0000 C CNN
F 3 "" H 3700 3500 50  0000 C CNN
	1    3700 3500
	0    1    -1   0   
$EndComp
$Comp
L power:GND #PWR0120
U 1 1 6035E19F
P 3700 3650
F 0 "#PWR0120" H 3700 3400 50  0001 C CNN
F 1 "GND" H 3700 3500 50  0000 C CNN
F 2 "" H 3700 3650 50  0000 C CNN
F 3 "" H 3700 3650 50  0000 C CNN
	1    3700 3650
	0    1    -1   0   
$EndComp
$Comp
L Device:C C13
U 1 1 6035E1A5
P 3000 3850
F 0 "C13" V 2748 3850 50  0000 C CNN
F 1 "0.1 uF" V 2839 3850 50  0000 C CNN
F 2 "Capacitor_SMD:C_0402_1005Metric" H 3038 3700 50  0001 C CNN
F 3 "~" H 3000 3850 50  0001 C CNN
	1    3000 3850
	0    1    1    0   
$EndComp
$Comp
L power:GND #PWR0121
U 1 1 6035E1AB
P 3150 3850
F 0 "#PWR0121" H 3150 3600 50  0001 C CNN
F 1 "GND" H 3150 3700 50  0000 C CNN
F 2 "" H 3150 3850 50  0000 C CNN
F 3 "" H 3150 3850 50  0000 C CNN
	1    3150 3850
	0    -1   -1   0   
$EndComp
$Comp
L power:+3V3 #PWR0122
U 1 1 6035E1B1
P 3250 2250
F 0 "#PWR0122" H 3250 2100 50  0001 C CNN
F 1 "+3.3V" V 3250 2450 28  0000 C CNN
F 2 "" H 3250 2250 50  0000 C CNN
F 3 "" H 3250 2250 50  0000 C CNN
	1    3250 2250
	0    1    1    0   
$EndComp
$Comp
L Device:C C14
U 1 1 6035E1B7
P 3100 2250
F 0 "C14" V 2848 2250 50  0000 C CNN
F 1 "0.1 uF" V 2939 2250 50  0000 C CNN
F 2 "Capacitor_SMD:C_0402_1005Metric" H 3138 2100 50  0001 C CNN
F 3 "~" H 3100 2250 50  0001 C CNN
	1    3100 2250
	0    1    1    0   
$EndComp
Text Label 3500 2700 0    50   ~ 0
IMU_INTERRUPT
Text Label 3500 2900 0    50   ~ 0
COMPASS_SDA
Text Label 3500 3000 0    50   ~ 0
COMPASS_SCL
Text Label 2100 2700 2    50   ~ 0
SCL
Text Label 2100 2800 2    50   ~ 0
SDA
Text Label 2100 2900 2    50   ~ 0
AD0
Text Label 3700 3500 0    50   ~ 0
FSYNC
Text Label 3700 3650 0    50   ~ 0
CLKIN
$Comp
L power:GND #PWR0123
U 1 1 6035E1C5
P 2350 2050
F 0 "#PWR0123" H 2350 1800 50  0001 C CNN
F 1 "GND" H 2350 1900 50  0000 C CNN
F 2 "" H 2350 2050 50  0000 C CNN
F 3 "" H 2350 2050 50  0000 C CNN
	1    2350 2050
	0    1    -1   0   
$EndComp
Wire Wire Line
	2700 2250 2700 2050
$Comp
L Device:C C12
U 1 1 6035E1CC
P 2500 2050
F 0 "C12" V 2752 2050 50  0000 C CNN
F 1 "10 nF" V 2661 2050 50  0000 C CNN
F 2 "Capacitor_SMD:C_0402_1005Metric" H 2538 1900 50  0001 C CNN
F 3 "~" H 2500 2050 50  0001 C CNN
	1    2500 2050
	0    1    -1   0   
$EndComp
Wire Wire Line
	2700 2050 2650 2050
$Comp
L power:+3V3 #PWR0124
U 1 1 6035E1D3
P 2550 2250
F 0 "#PWR0124" H 2550 2100 50  0001 C CNN
F 1 "+3.3V" V 2550 2450 28  0000 C CNN
F 2 "" H 2550 2250 50  0000 C CNN
F 3 "" H 2550 2250 50  0000 C CNN
	1    2550 2250
	0    -1   1    0   
$EndComp
Text Label 3800 4100 0    50   ~ 0
IMU_REGOUT
Text Label 2350 4050 0    50   ~ 0
IMU_CPOUT
Text Label 3500 3200 0    50   ~ 0
IMU_CPOUT
Text Label 3500 3300 0    50   ~ 0
IMU_REGOUT
Text Label 2100 3200 2    50   ~ 0
FSYNC
Text Label 2100 3300 2    50   ~ 0
CLKIN
Wire Wire Line
	2950 2250 2900 2250
Wire Wire Line
	2900 2250 2900 2300
Wire Wire Line
	2800 3700 2800 3850
Wire Wire Line
	2800 3850 2850 3850
Wire Wire Line
	2700 2250 2700 2300
Connection ~ 2700 2250
Wire Wire Line
	2550 2250 2700 2250
Text Notes 1550 1600 0    50   ~ 0
IMU
Wire Notes Line
	1750 1500 1750 1650
Wire Notes Line
	1750 1650 1500 1650
Text Notes 5050 1900 0    50   ~ 0
The MPU6050 is a 6-DOF IMU with a 3-Axis \naccelerometer and a 3-Axis gyroscope \nintegrated on a single chip, with the option\nto add an external magnetometer/compass.\n
Wire Notes Line
	4500 4500 1500 4500
Wire Notes Line
	1500 1500 4500 1500
Wire Notes Line
	1500 1500 1500 4500
Wire Notes Line
	4500 1500 4500 4500
$EndSCHEMATC
