<?xml version="1.0" encoding="UTF-8" standalone="no"?>
<svg
   xmlns:dc="http://purl.org/dc/elements/1.1/"
   xmlns:cc="http://creativecommons.org/ns#"
   xmlns:rdf="http://www.w3.org/1999/02/22-rdf-syntax-ns#"
   xmlns:svg="http://www.w3.org/2000/svg"
   xmlns="http://www.w3.org/2000/svg"
   xmlns:sodipodi="http://sodipodi.sourceforge.net/DTD/sodipodi-0.dtd"
   xmlns:inkscape="http://www.inkscape.org/namespaces/inkscape"
   inkscape:version="1.0 (4035a4fb49, 2020-05-01)"
   inkscape:export-ydpi="96"
   inkscape:export-xdpi="96"
   inkscape:export-filename="/home/grokkingstuff/Scratchpad/AcrylicBending/images/consistent-line-of-bending.png"
   sodipodi:docname="consistent-line-of-bending.svg"
   id="svg8"
   version="1.1"
   viewBox="0 0 210 297"
   height="297mm"
   width="210mm">
  <defs
     id="defs2" />
  <sodipodi:namedview
     inkscape:window-maximized="0"
     inkscape:window-y="2160"
     inkscape:window-x="0"
     inkscape:window-height="1795"
     inkscape:window-width="2728"
     showgrid="false"
     inkscape:document-rotation="0"
     inkscape:current-layer="layer1"
     inkscape:document-units="mm"
     inkscape:cy="217.03831"
     inkscape:cx="416.59162"
     inkscape:zoom="1.9043284"
     inkscape:pageshadow="2"
     inkscape:pageopacity="0.0"
     borderopacity="1.0"
     bordercolor="#666666"
     pagecolor="#ffffff"
     id="base" />
  <metadata
     id="metadata5">
    <rdf:RDF>
      <cc:Work
         rdf:about="">
        <dc:format>image/svg+xml</dc:format>
        <dc:type
           rdf:resource="http://purl.org/dc/dcmitype/StillImage" />
        <dc:title></dc:title>
      </cc:Work>
    </rdf:RDF>
  </metadata>
  <g
     id="layer1"
     inkscape:groupmode="layer"
     inkscape:label="Layer 1">
    <path
       id="path199"
       d="m 52.16726,107.60205 h 116.9978 V 67.200814 h -23.24119 v 0 l 0,-39.767742 h -16.70831"
       style="fill:none;stroke:#000000;stroke-width:0.264583px;stroke-linecap:butt;stroke-linejoin:miter;stroke-opacity:1" />
    <path
       id="path201"
       d="m 129.21556,27.433071 v 0 49.058636 h -19.00472 v 0 -29.42111 l -16.827088,0 0,29.456287 H 77.586074"
       style="fill:none;stroke:#000000;stroke-width:0.264583px;stroke-linecap:butt;stroke-linejoin:miter;stroke-opacity:1" />
    <circle
       r="0.39687499"
       cy="76.526886"
       cx="77.586075"
       style="fill:#000000;stroke:none;stroke-width:0.264583"
       id="path203" />
    <path
       id="path205"
       d="M 77.586072,76.526884 V 27.538666 h -25.18125 v 78.761254 1.0206"
       style="fill:none;stroke:#000000;stroke-width:0.264583px;stroke-linecap:butt;stroke-linejoin:miter;stroke-opacity:1" />
    <path
       id="path211"
       d="m 46.26788,39.081874 c 0.428498,0.105785 1.417921,0.361902 1.781694,0.387098 2.370899,0.164211 4.832709,-0.117829 7.205958,-0.140769 2.40528,-0.02326 4.848977,0.225976 7.245546,0.140769 2.894886,-0.102925 4.557842,-0.539147 7.364328,-0.844619 1.531096,-0.16665 3.032241,-0.08628 4.553217,-0.246361 1.309764,-0.137859 2.087338,-0.212934 3.365418,-0.24633 0.620133,-0.01622 1.233636,-0.276921 1.860881,-0.316748 0.500642,-0.03179 1.004517,0.0756 1.504537,0.03521 0.269515,-0.02177 0.544793,-0.285835 0.791863,-0.17598 0.208447,0.09268 0.29263,0.350084 0.435528,0.527905"
       style="fill:none;stroke:#ff0000;stroke-width:0.264583px;stroke-linecap:butt;stroke-linejoin:miter;stroke-opacity:1" />
    <path
       id="path1042"
       d="m 87.563557,52.912602 c -0.0132,-0.269814 -0.252831,-0.643599 -0.03959,-0.809442 0.195731,-0.152231 0.433295,0.253597 0.673082,0.316748 0.834337,0.219734 1.67813,0.418545 2.533962,0.527868 1.546114,0.197501 8.121034,0.573598 9.264793,0.563078 5.833446,-0.05365 6.163896,-0.520245 11.719586,-0.809408 1.12029,-0.05831 2.24413,-0.03407 3.36541,0 0.42473,0.01291 0.84423,0.09783 1.26698,0.140772 0.0525,0.0053 0.15837,0.05279 0.15837,0 0,-0.04812 -0.66781,0.08707 -1.18779,0.175945"
       style="fill:none;stroke:#ff0000;stroke-width:0.264583px;stroke-linecap:butt;stroke-linejoin:miter;stroke-opacity:1" />
    <path
       id="path1044"
       d="m 122.84106,35.914523 c 5.4215,-0.620387 10.95047,-0.102595 16.39158,0 6.3363,0.119475 6.52247,0.06115 12.39266,0.03518 0.16943,-7.94e-4 2.53187,0.03539 3.32582,-0.03518 0.1788,-0.0159 -0.30135,-0.197499 -0.43552,-0.316749 -0.17051,-0.151537 0.23696,-0.415565 0.43552,-0.527867"
       style="fill:none;stroke:#ff0000;stroke-width:0.264583px;stroke-linecap:butt;stroke-linejoin:miter;stroke-opacity:1" />
    <path
       id="path1046"
       d="m 40.526872,63.118462 c 0.435525,-0.234614 0.837025,-0.548119 1.30657,-0.703847 1.119624,-0.371327 6.580823,-0.03878 7.443523,-0.03517 6.065676,0.02532 12.075329,-0.260059 18.133663,-0.527904 8.932169,-0.394899 17.86705,-0.391391 26.80458,-0.563079 8.097432,-0.155548 13.479022,-0.453033 21.657462,-0.211153 9.39895,0.277974 10.0091,0.873239 19.04431,1.020596 6.84637,0.111659 8.51472,-0.236945 14.96621,-0.457518 5.34396,-0.182705 4.8382,0.05953 9.344,-0.351925 1.37877,-0.125904 2.82246,-0.305784 4.19687,-0.527902 0.27563,-0.04454 0.5717,-0.106217 0.83145,-0.211153 0.29035,-0.117298 0.24401,-0.348107 0.35634,-0.281541 0.0957,0.05674 0.42797,-0.109516 0.31675,-0.10556 -0.37005,0.01318 -0.73907,0.04692 -1.10861,0.07038"
       style="fill:none;stroke:#00fe00;stroke-width:0.264583px;stroke-linecap:butt;stroke-linejoin:miter;stroke-opacity:1" />
    <path
       d="m 170.58513,60.725433 c 0.13731,0.109992 0.28463,0.208555 0.41195,0.329978 0.4444,0.423822 0.83983,0.896249 1.26616,1.338246 0.632,0.655225 1.2624,1.277845 1.86008,1.965402 0.4469,0.385141 0.79997,0.93477 1.32847,1.223444 0.92205,0.42809 1.48337,-0.714425 1.92929,-1.28396 0.14867,-0.189883 0.3064,-0.372557 0.46398,-0.555114 0.37615,-0.435763 0.74824,-0.875313 1.13713,-1.299742 0.65625,-0.716229 1.33188,-1.414467 1.99782,-2.121699 4.07647,-4.192434 8.51032,-8.012083 13.08171,-11.650371 0.045,-0.0891 0.0901,-0.178207 0.13513,-0.267311 0,0 -0.0388,0.01513 -0.0388,0.01513 v 0 c -0.52948,0.283885 -1.05896,0.567772 -1.58844,0.851659 -4.47605,3.660016 -8.81651,7.489645 -12.89252,11.593928 -1.64787,1.694868 -1.96969,1.984465 -3.35289,3.523353 -0.17009,0.189235 -0.33245,0.38531 -0.49563,0.580533 -0.0753,0.09008 -0.33042,0.314354 -0.21972,0.27527 1.10039,-0.388477 1.60152,-1.048771 1.27077,-0.620051 -0.1473,-0.02984 -0.24003,-0.107717 -0.35845,-0.20133 -0.35882,-0.283649 -0.68793,-0.600548 -1.02783,-0.906163 -0.20322,-0.167172 -0.41376,-0.325835 -0.60967,-0.501521 -1.09243,-0.979638 -2.00812,-2.147054 -3.15846,-3.061702 0,0 -1.14005,0.772009 -1.14005,0.772009 z"
       id="path1048"
       style="fill:none;fill-opacity:1;stroke:#00fe00;stroke-width:0;stroke-opacity:1" />
    <path
       d="m 169.44333,60.36828 c 0.67227,0.547595 1.24431,1.20795 1.82082,1.851996 0.22302,0.249145 0.42733,0.515487 0.662,0.753692 0.20487,0.20796 0.38636,0.466095 0.65416,0.582295 0.27016,0.117223 0.58638,0.05546 0.87957,0.08318 0.43791,-0.233058 0.90068,-0.424466 1.31374,-0.699177 0.98149,-0.652748 1.94074,-1.34166 2.86149,-2.077606 0.24163,-0.193138 3.68167,-3.362291 3.88743,-3.551076 1.85936,-1.70596 1.50424,-1.379707 3.23516,-2.951787 0.16848,-0.219806 0.33697,-0.439608 0.50546,-0.659413 0,0 -0.0387,0.0155 -0.0387,0.0155 v 0 c -0.61066,0.400812 -1.22133,0.801622 -1.83199,1.202431 -1.70128,1.573519 -3.39605,3.15432 -5.10857,4.715647 -0.64064,0.584081 -1.31703,1.130393 -1.92897,1.744475 -0.1928,0.193463 -0.26401,0.494133 -0.47485,0.667745 -0.36624,0.301556 -0.81471,0.486325 -1.22206,0.729491 -0.28977,0.0062 -0.59151,0.101123 -0.86932,0.01849 -0.28823,-0.08574 -0.51454,-0.314156 -0.75065,-0.50038 -0.96053,-0.757579 -1.70392,-1.758768 -2.6774,-2.502487 0,0 -0.91733,0.576971 -0.91733,0.576971 z"
       id="path1050"
       style="fill:none;fill-opacity:1;stroke:#00fe00;stroke-width:0;stroke-opacity:1" />
    <path
       d="m 164.45191,58.45593 c 0.18779,0.181311 0.39276,0.346374 0.56338,0.54393 0.36293,0.420235 1.38656,1.838471 1.66519,2.233565 0.74128,1.051147 1.47492,2.107623 2.15365,3.199969 0.39172,0.6526 0.85788,1.254633 1.28954,1.880063 0.85286,0.652105 2.63563,-2.079726 3.02111,-2.573356 0.53598,-0.686348 1.0781,-1.367901 1.62311,-2.0471 2.31395,-2.883667 1.70654,-2.120688 4.34518,-5.166947 3.56281,-4.034153 7.49653,-7.716555 11.58613,-11.207523 0.45648,-0.376515 0.9114,-0.759446 1.39422,-1.102796 0.0523,-0.03721 0.21754,-0.136393 0.16192,-0.104307 -1.5601,0.90007 -1.84531,1.443395 -1.5493,0.889257 -0.28301,-0.425135 -0.2863,-0.11406 0.68006,-0.564036 0,0 -0.0335,0.02482 -0.0335,0.02482 v 0 c 0.81545,-0.328498 1.21552,-0.132487 0.88798,-0.63995 -0.61453,-0.09828 -2.60202,1.66601 -3.20127,2.17075 -3.95583,3.48505 -7.7376,7.173767 -11.26087,11.097279 -0.8333,0.948885 -1.68063,1.885635 -2.49991,2.846654 -0.023,0.02701 -3.49694,4.256628 -3.66216,4.457634 -0.37856,0.46056 -1.19169,0.787538 -1.13634,1.381138 0.34893,3.742553 1.36537,-1.154554 1.20462,-0.396795 -0.52989,-0.548074 -0.90863,-1.227238 -1.42659,-1.785962 -0.22701,-0.275095 -0.46272,-0.543239 -0.68104,-0.825288 -0.26806,-0.346302 -0.5155,-0.708102 -0.7775,-1.059013 -1.01984,-1.365962 -2.01516,-2.762136 -3.17714,-4.012528 0,0 -1.17049,0.760537 -1.17049,0.760537 z"
       id="path1052"
       style="fill:#00ff00;fill-opacity:1;stroke:#00fe00;stroke-width:0;stroke-opacity:1" />
    <path
       d="m 88.765569,23.050485 c 0.186473,-0.0085 0.375431,-0.05689 0.559417,-0.02539 0.895175,0.153277 2.042451,0.690058 2.787425,1.063758 0.747495,0.374965 1.479791,0.780633 2.201701,1.202767 1.884336,1.101859 3.149034,1.979931 4.97228,3.190585 2.934558,1.955469 5.704898,4.135741 8.437828,6.359236 0.52459,0.399487 0.94795,0.906285 1.40988,1.372285 0.54707,0.525233 0.1738,0.503098 1.15496,-0.04051 0,0 0.0367,-0.01968 0.0367,-0.01968 v 0 c 0.96857,-0.651722 0.89538,-0.350562 0.36117,-0.892802 -0.48015,-0.463648 -0.90399,-0.985906 -1.45918,-1.366806 -2.87764,-2.131869 -5.87141,-4.10396 -8.82486,-6.127482 -1.651126,-1.079535 -3.296149,-2.181074 -4.992882,-3.189329 -0.717622,-0.426434 -1.445694,-0.83584 -2.183781,-1.225784 -0.904835,-0.478041 -1.757122,-0.921635 -2.748595,-1.160581 -0.185235,-0.04464 -0.379862,-0.03035 -0.569793,-0.04553 0,0 -1.14231,0.905258 -1.14231,0.905258 z"
       id="path1058"
       style="fill:#ff0000;fill-opacity:1;stroke:#00fe00;stroke-width:0;stroke-opacity:1" />
    <path
       inkscape:export-ydpi="96"
       inkscape:export-xdpi="96"
       d="m 104.64617,22.197156 c -0.23013,0.303514 -0.44947,0.615524 -0.6904,0.910541 -0.63849,0.781835 -2.81536,3.285374 -3.31226,3.854543 -0.732548,0.839105 -1.462644,1.680448 -2.205533,2.510417 -1.332474,1.488662 -2.897153,3.166054 -4.262983,4.640289 -1.332206,1.406768 -2.631522,2.85129 -4.065728,4.157339 -0.574354,0.523034 -1.162288,0.997347 -1.826942,1.395635 3.290067,-0.548476 1.29799,-0.866087 0.983541,-0.634984 -0.278106,0.204391 -0.534906,0.436293 -0.802357,0.654439 0,0 0.0384,-0.01622 0.0384,-0.01622 v 0 c -0.19117,0.130961 -0.402045,0.237008 -0.573514,0.39288 -0.04881,0.04436 0.128231,-0.03092 0.192347,-0.04639 0.570005,-0.316936 1.14001,-0.633876 1.710015,-0.950815 0.617731,-0.407805 1.171684,-0.874545 1.710021,-1.385054 1.367192,-1.296519 2.611297,-2.715008 3.892121,-4.094387 2.126248,-2.350352 4.238927,-4.712105 6.328332,-7.095366 0.98223,-1.120372 2.3345,-2.661387 3.31061,-3.862249 0.24704,-0.303925 0.47656,-0.621683 0.71484,-0.932525 0,0 -1.14051,0.50189 -1.14051,0.50189 z"
       id="path1060"
       style="fill:#ff0000;fill-opacity:1;stroke:#00fe00;stroke-width:0;stroke-opacity:1" />
  </g>
</svg>
