{
    "Account Holders Info": [
        {
            "name": "FirstName1 LastName1",
            "age": 30,
            "city": "CityA",
            "coordinates": {
                "lat": 20.157,
                "long": 19.4532
            },
            "accounts": [
                {
                    "bank": "XYZ",
                    "account id": "XYZ-423467",
                    "balance": 500.45,
                    "currency": "USD"
                },
                {
                    "bank": "ABC",
                    "account id": "ABC-753390",
                    "balance": 890.70,
                    "currency": "PKR"
                },
                {
                    "bank": "RQ8",
                    "account id": "RQ8-036831",
                    "balance": 312.07,
                    "currency": "EUR"
                }
            ]
        },
        {
            "name": "FirstName2 LastName2",
            "age": 57,
            "city": "CityH",
            "coordinates": {
                "lat": 75.15,
                "long": 40.561
            },
            "accounts": [
                {
                    "bank": "TY5",
                    "account id": "TY5-718743",
                    "balance": 585.120,
                    "currency": "EUR"
                },
                {
                    "bank": "RQ8",
                    "account id": "RQ8-897513",
                    "balance": 900.25,
                    "currency": "SAR"
                }
            ]
        },
        {
            "name": "FirstName3 LastName3",
            "age": 24,
            "city": "CityW",
            "coordinates": {
                "lat": 518.12,
                "long": 398.647
            },
            "accounts": []
        },
        {
            "name": "FirstName4 LastName4",
            "age": 34,
            "city": "CityP",
            "coordinates": {
                "lat": 245.47,
                "long": 22.158
            },
            "accounts": [
                {
                    "bank": "ABC",
                    "account id": "ABC-856432",
                    "balance": 154.151,
                    "currency": "PKR"
                },
                {
                    "bank": "EFG",
                    "account id": "EFG-374516",
                    "balance": 10540.12,
                    "currency": "SAR"
                },
                {
                    "bank": "QRS",
                    "account id": "QRS-456312",
                    "balance": 1357.97,
                    "currency": "TRY"
                },
                {
                    "bank": "Z7L",
                    "account id": "Z7L-658132",
                    "balance": 196.2,
                    "currency": "CAD"
                }
            ]
        },
        {
            "name": "FirstName5 LastName5",
            "age": 35,
            "city": "CityU",
            "coordinates": {
                "lat": 20.111,
                "long": 19.123
            },
            "accounts": [
                {
                    "bank": "XDE",
                    "account id": "XDE-455467",
                    "balance": 501.45,
                    "currency": "USD"
                },
                {
                    "bank": "DKI",
                    "account id": "DKI-759990",
                    "balance": 891.70,
                    "currency": "PKR"
                }
            ]
        },
        {
            "name": "FirstName6 LastName6",
            "age": 36,
            "city": "CityI",
            "coordinates": {
                "lat": 21.111,
                "long": 12.123
            },
            "accounts": [
                {
                    "bank": "XRE",
                    "account id": "XRE-545467",
                    "balance": 502.45,
                    "currency": "USD"
                },
                {
                    "bank": "DKG",
                    "account id": "DKG-579990",
                    "balance": 892.70,
                    "currency": "PKR"
                }
            ]
        },
        {
            "name": "FirstName7 LastName7",
            "age": 37,
            "city": "CityM",
            "coordinates": {
                "lat": 22.111,
                "long": 155.123
            },
            "accounts": [
                {
                    "bank": "RDE",
                    "account id": "RDE-555467",
                    "balance": 50123.45,
                    "currency": "USD"
                },
                {
                    "bank": "DKR",
                    "account id": "DKR-7139990",
                    "balance": 891123.70,
                    "currency": "PKR"
                }
            ]
        },
        {
            "name": "FirstName8 LastName8",
            "age": 38,
            "city": "CityK",
            "coordinates": {
                "lat": 23.11,
                "long": 112.123
            },
            "accounts": [
                {
                    "bank": "FSA",
                    "account id": "FSA-434467",
                    "balance": 501231.45,
                    "currency": "USD"
                },
                {
                    "bank": "DDF",
                    "account id": "DDF-712390",
                    "balance": 89123.70,
                    "currency": "PKR"
                }
            ]
        }
    ]
}