210325_110446
x		y
-8.04554080963 5.03218650818
-8.03782272339 4.83233547211
-8.03010463715 4.63248443604
-8.0223865509 4.43263339996
-8.01466846466 4.23278236389
-8.00695037842 4.03293132782
-7.99923229218 3.83308029175
-7.99151420593 3.63322925568
-7.98379611969 3.4333782196
-7.97607803345 3.23352718353
-7.9683599472 3.03367614746
-7.96064186096 2.83382511139
-7.95217943192 2.44200730324
-7.96445178986 2.24238419533
-7.98999500275 2.04402208328
-8.02869606018 1.84780216217
-8.08038234711 1.65459632874
-8.14482498169 1.46526288986
-8.22173690796 1.2806429863
-8.31077766418 1.10155701637
-8.41155052185 0.928800463676
-8.5236082077 0.76314085722
-8.64645290375 0.605314195156
-8.7795381546 0.456021696329
-8.92227363586 0.315926611423
-9.07402420044 0.185651376843
-9.23411655426 0.0657747611403
-9.40183925629 -0.043170645833
-9.5764465332 -0.140700817108
-9.75716400146 -0.226382449269
-9.94318771362 -0.299834877253
-10.133690834 -0.360731780529
-10.3278274536 -0.408802568913
-10.5247354507 -0.443833708763
-10.7235403061 -0.465669572353
-11.109670639 -0.476237565279
-11.3096513748 -0.478991389275
-11.5096321106 -0.48174521327
-11.7096128464 -0.484499037266
-11.9095935822 -0.487252861261
-12.1095743179 -0.490006685257
-12.3095550537 -0.492760509253
-12.5095357895 -0.495514333248
-12.7095165253 -0.498268157244
-12.909497261 -0.501021981239
-13.1094779968 -0.503775775433
-13.3094587326 -0.506529569626
-13.5094394684 -0.509283363819
-13.7094202042 -0.512037158012
-13.9094009399 -0.514790952206
-14.1093816757 -0.517544746399
-14.3093624115 -0.520298540592
-14.5093431473 -0.523052334785
-14.7093238831 -0.525806128979
-14.9093046188 -0.528559923172
-15.1092853546 -0.531313717365
-15.3092660904 -0.534067511559
-15.402305603 -0.535348892212
-14.545837887 -0.490314715943
-14.7451448441 -0.506952702999
-15.118475914 -0.531429469585
-15.3269681931 -0.53431147337
-15.402305603 -0.535348892212
-14.6257008788 -0.499396494387
-14.8250865936 -0.515059351921
-15.3125219345 -0.534112513065
-15.402305603 -0.535348892212
-14.7037677537 -0.505221404778
-14.9032201767 -0.520008504391
-15.3338394165 -0.534406065941
-15.402305603 -0.535348892212
-14.7742305508 -0.510300205638
-14.9737386703 -0.52431845665
-15.3490886688 -0.534616053104
-15.402305603 -0.535348892212
-14.8912802059 -0.516428433177
-15.402305603 -0.535348892212
-14.9676151276 -0.521470487118
-15.402305603 -0.535348892212
