210325_115613
time	cmd_vx	cmd_phi	fb_vx	fb_phi	odom_x	odom_y
1616648175.68 0.232533179781 0.245974999669 0.0 0.0 -7.7929725647 -7.45400285721
1616648175.73 0.2258665127 0.235981210622 0.0 0.000854273850564 -7.7929725647 -7.45400285721
1616648175.78 0.2258665127 0.235981210622 0.0 0.000854273850564 -7.7929725647 -7.45400285721
1616648175.83 0.219199845367 0.225981211822 0.0 0.0427136905491 -7.7929725647 -7.45400285721
1616648175.88 0.212533178039 0.21598133571 0.0 0.0427136905491 -7.7929725647 -7.45400285721
1616648175.93 0.212533178039 0.21598133571 0.0 0.0961058065295 -7.7929725647 -7.45400285721
1616648175.98 0.205866510816 0.205996352137 0.0 0.0961058065295 -7.7929725647 -7.45400285721
1616648176.03 0.205866510816 0.205996352137 0.0 0.134120985866 -7.7929725647 -7.45400285721
1616648176.08 0.199199843586 0.196002325307 0.0 0.134120985866 -7.7929725647 -7.45400285721
1616648176.13 0.199199843586 0.196002325307 0.0 0.154623568058 -7.7929725647 -7.45400285721
1616648176.18 0.192533176427 0.188342914482 0.0 0.154623568058 -7.7929725781 -7.45400635935
1616648176.23 0.192533176427 0.188342914482 0.0152124864981 0.165729135275 -7.7929725781 -7.45400635935
1616648176.28 0.185866509101 0.178344385247 0.0152124864981 0.165729135275 -7.79297827368 -7.45549480459
1616648176.33 0.172533182274 0.16808573147 0.00730199320242 0.171281903982 -7.79297827368 -7.45549480459
1616648176.38 0.165866527588 0.16753909935 0.0152124864981 0.174271866679 -7.79298114243 -7.45624450501
1616648176.43 0.152533244906 0.167193988728 0.0152124864981 0.174271866679 -7.79298114243 -7.45624450501
1616648176.48 0.145866577768 0.169851923922 0.0152124864981 0.174271866679 -7.79298923554 -7.45848335818
1616648176.53 0.139199911651 0.169831417559 0.0152124864981 0.174271866679 -7.79298923554 -7.45848335818
1616648176.58 0.132533254625 0.170426626874 0.0225144792348 0.175980418921 -7.792989254 -7.45848846436
1616648176.63 0.112533263838 0.173019342968 0.0225144792348 0.175980418921 -7.792989254 -7.45848846436
1616648176.68 0.112533263838 0.173019342968 0.0304249729961 0.177261814475 -7.79298930782 -7.45850612448
1616648176.73 0.099199933002 0.176915108526 0.0304249729961 0.177261814475 -7.79298930782 -7.45850612448
1616648176.78 0.0858666038984 0.177501550232 0.0529394522309 0.178543224931 -7.79302210308 -7.47042721004
1616648176.83 0.0791999419437 0.17795897935 0.0529394522309 0.178543224931 -7.79302210308 -7.47042721004
1616648176.88 0.0725332746108 0.186742128202 0.0760624334216 0.181106045842 -7.79302215576 -7.47044944763
1616648176.93 0.0591999681971 0.186100081966 0.0760624334216 0.181106045842 -7.79302215576 -7.47044944763
1616648176.98 0.0458666394152 0.188128778635 0.0760624334216 0.181960329413 -7.79303976712 -7.47247570535
1616648177.03 0.0325333182462 0.185415039621 0.0760624334216 0.181960329413 -7.79303976712 -7.47247570535
1616648177.08 0.0258666509767 0.185425762285 0.068151935935 0.183241739869 -7.79303979874 -7.47247934341
1616648177.13 0.019199989773 0.183464268113 0.068151935935 0.183241739869 -7.79303979874 -7.47247934341
1616648177.18 0.00586665903423 0.179432302674 0.0608499459922 0.18409602344 -7.7930421732 -7.47571716042
1616648177.23 -0.0074666674602 0.173346198401 0.0608499459922 0.18409602344 -7.7930421732 -7.47571716042
1616648177.28 -0.0141333320375 0.171600399267 0.0377269648015 0.18409602344 -7.79303932835 -7.48095143214
1616648177.33 -0.0207999942432 0.169797526126 0.0377269648015 0.18409602344 -7.79303932835 -7.48095143214
1616648177.38 -0.0341333115558 0.162573107965 0.0377269648015 0.18409602344 -7.79303031577 -7.48839470815
1616648177.43 -0.040799978487 0.160996128262 0.0377269648015 0.18409602344 -7.79303031577 -7.48839470815
1616648177.48 -0.0541332680478 0.152941263285 0.0304249729961 0.183668881655 -7.79303026199 -7.4884390831
1616648177.53 -0.0607999333501 0.148456554193 0.0304249729961 0.183668881655 -7.79303026199 -7.4884390831
1616648177.58 -0.0741332679641 0.134721832226 0.0152124864981 0.183668881655 -7.79302266595 -7.49422679265
1616648177.63 -0.0874665971494 0.125493884564 0.0152124864981 0.183668881655 -7.79302266595 -7.49422679265
1616648177.68 -0.09413326409 0.120441601804 -0.00730199320242 0.179824635386 -7.79301978587 -7.49499615117
1616648177.73 -0.100799905127 0.119044591639 -0.00730199320242 0.179824635386 -7.79301978587 -7.49499615117
1616648177.78 -0.114133235468 0.112922507011 -0.00730199320242 0.171281903982 -7.79302261969 -7.49425557857
1616648177.83 -0.127466555824 0.104342151417 -0.00730199320242 0.171281903982 -7.79302261969 -7.49425557857
1616648177.88 -0.134133222767 0.0998488755319 -0.0152124864981 0.161884889007 -7.79303069953 -7.49202051341
1616648177.93 -0.147466522467 0.0958505134335 -0.0152124864981 0.161884889007 -7.79303069953 -7.49202051341
1616648177.98 -0.15413318496 0.0939993987161 -0.0304249729961 0.152060732245 -7.793038806 -7.48977788137
1616648178.03 -0.167466493719 0.086534537266 -0.0304249729961 0.152060732245 -7.793038806 -7.48977788137
1616648178.08 -0.174133160126 0.0827128726429 -0.0377269648015 0.14095517993 -7.79304832986 -7.48802424302
1616648178.13 -0.187466488481 0.0799730678821 -0.0377269648015 0.14095517993 -7.79304832986 -7.48802424302
1616648178.18 -0.194133152258 0.0774100678483 -0.0529394522309 0.130276754498 -7.79306308866 -7.48876854275
1616648178.23 -0.207466463939 0.0740912860148 -0.0529394522309 0.119598336518 -7.79306308866 -7.48876854275
1616648178.29 -0.214133131216 0.0682036442819 -0.0608499459922 0.119598336518 -7.79308856677 -7.48359864472
1616648178.34 -0.227466457337 0.0640616219555 -0.0760624334216 0.108492776752 -7.79308856677 -7.48359864472
1616648178.39 -0.240799484563 0.0584856113587 -0.0760624334216 0.108492776752 -7.79310031342 -7.4738467757
1616648178.44 -0.240799484563 0.0584856113587 -0.0985769107938 0.0969600826502 -7.79310031342 -7.4738467757
1616648178.49 -0.254132811847 0.0497540637358 -0.0985769107938 0.0969600826502 -7.79169697462 -7.46384333321
1616648178.54 -0.267466141654 0.0451407276948 -0.113789394498 0.0858545228839 -7.79169697462 -7.46384333321
1616648178.59 -0.27413280599 0.0384324410902 -0.113789394498 0.0858545228839 -7.79168274044 -7.45158332654
1616648178.64 -0.287466129 0.0313684715749 -0.136912375689 0.0743218287826 -7.79166375365 -7.43667546516
1616648178.69 -0.294132789148 0.0295696466095 -0.136912375689 0.0743218287826 -7.79166375365 -7.43667546516
1616648178.74 -0.307466119513 0.0231902911276 -0.152124866843 0.0623619928956 -7.79162996271 -7.43058543731
1616648178.79 -0.314132740558 0.021341181129 -0.152124866843 0.0623619928956 -7.79162996271 -7.43058543731
1616648178.84 -0.327465671511 0.0187620510047 -0.167337357998 0.050829295069 -7.79157805324 -7.41195101513
1616648178.89 -0.340798986641 0.0140344190214 -0.167337357998 0.050829295069 -7.79157805324 -7.41195101513
1616648178.94 -0.347465653074 0.0124627251573 -0.18985183537 0.0405780076981 -7.79149531695 -7.39030927615
1616648178.99 -0.360798971303 0.00510216622082 -0.18985183537 0.0405780076981 -7.79149531695 -7.39030927615
1616648179.04 -0.367465530964 0.00420088127213 -0.21297480166 0.0311809964478 -7.79138690857 -7.36790310292
1616648179.09 -0.37413217567 0.00221608799696 -0.21297480166 0.0311809964478 -7.79138690857 -7.36790310292
1616648179.14 -0.387465236707 -0.0022947445712 -0.228187292814 0.0230653937906 -7.791256598 -7.34254884279
1616648179.19 -0.400798419059 -0.00519310885838 -0.228187292814 0.0230653937906 -7.791256598 -7.34254884279
1616648179.24 -0.40746506552 -0.00611402147595 -0.258612275124 0.0149497920647 -7.79110484623 -7.33242021017
1616648179.29 -0.420798197418 -0.0105520674504 -0.258612275124 0.0149497920647 -7.79110484623 -7.33242021017
1616648179.34 -0.427464793309 -0.0109280132987 -0.258612275124 0.00768846459687 -7.79110383987 -7.33235359192
1616648179.39 -0.440797777849 -0.0125347544371 -0.258612275124 0.00768846459687 -7.79110383987 -7.33235359192
1616648179.44 -0.447464117663 -0.0131594197444 -0.29633924365 0.000854273850564 -7.79093680455 -7.303257085
1616648179.49 -0.460797083033 -0.014416917284 -0.29633924365 0.000854273850564 -7.79093680455 -7.303257085
1616648179.54 -0.467463594795 -0.0155014940493 -0.311551719904 -0.0051256432198 -7.79073614939 -7.27186838119
1616648179.59 -0.480796573313 -0.017307067304 -0.311551719904 -0.0051256432198 -7.79073614939 -7.27186838119
1616648179.64 -0.487463201277 -0.0268650862405 -0.334674715996 -0.00939701218158 -7.79052370868 -7.23826492759
1616648179.69 -0.5007962121 -0.0273017310369 -0.334674715996 -0.00939701218158 -7.79052370868 -7.23826492759
1616648179.74 -0.507462850442 -0.0268634643923 -0.357189178467 -0.013668381609 -7.79030427448 -7.20244858815
1616648179.79 -0.520796009258 -0.0262321174379 -0.357189178467 -0.013668381609 -7.79030427448 -7.20244858815
1616648179.84 -0.527462243875 -0.0264589050459 -0.380312174559 -0.0187940243632 -7.79002426898 -7.18201691178
1616648179.89 -0.540795261627 -0.0273709377929 -0.380312174559 -0.0187940243632 -7.79002426898 -7.18201691178
1616648179.94 -0.547461615281 -0.0279692903969 -0.40282663703 -0.0226382557303 -7.78974696536 -7.14164515398
1616648179.99 -0.542436344152 -0.0274539981052 -0.425949603319 -0.0260553527623 -7.78974696536 -7.14164515398
1616648180.04 -0.555769578242 -0.0368365524427 -0.425949603319 -0.0260553527623 -7.78940616889 -7.09841323279
1616648180.09 -0.569102728647 -0.0377578100279 -0.448464095592 -0.0290453098714 -7.78940616889 -7.09841323279
1616648180.14 -0.575769378289 -0.047757542785 -0.448464095592 -0.0290453098714 -7.78912009331 -7.05354254901
1616648180.19 -0.589102080879 -0.0418036846834 -0.471587061882 -0.0328895412385 -7.78912009331 -7.05354254901
1616648180.24 -0.595768505976 -0.0406711218675 -0.471587061882 -0.0328895412385 -7.78886275067 -7.00558770685
1616648180.29 -0.599999954061 -0.0360014618895 -0.502012014389 -0.0375880487263 -7.78886275067 -7.00558770685
1616648180.34 -0.599999976017 -0.0376777571936 -0.502012014389 -0.0375880487263 -7.78860357261 -6.97632769378
1616648180.39 -0.599999380595 -0.0296479208653 -0.524526536465 -0.0401508696377 -7.78860357261 -6.97632769378
1616648180.44 -0.599999943517 -0.0320863274882 -0.524526536465 -0.0401508696377 -7.78831226148 -6.92517164093
1616648180.49 -0.599999867659 -0.0420828494394 -0.524526536465 -0.0401508696377 -7.78831226148 -6.92517164093
1616648180.54 -0.599999850199 -0.0363182944286 -0.524526536465 -0.0401508696377 -7.78831100464 -6.92495059967
1616648180.59 -0.599999995828 -0.03588336469 -0.562862038612 -0.0410051457584 -7.78831100464 -6.92495059967
1616648180.64 -0.599999980797 -0.0352252212435 -0.562862038612 -0.0410051457584 -7.78817349286 -6.80869129166
1616648180.69 -0.591126557438 -0.0255040715446 -0.593286991119 -0.0414322838187 -7.78817349286 -6.80869129166
1616648180.74 -0.599999985493 -0.00860136603377 -0.593286991119 -0.0414322838187 -7.78819743179 -6.74959230407
1616648180.79 -0.592471482889 0.000944383797504 -0.608499467373 -0.0414322838187 -7.78819743179 -6.74959230407
1616648180.84 -0.6 0.0126229504809 -0.608499467373 -0.0414322838187 -7.78827236156 -6.72386775406
1616648180.89 -0.599999481886 0.015519372718 -0.61580145359 -0.0371609143913 -7.78827236156 -6.72386775406
1616648180.94 -0.599999766537 0.0174267184265 -0.61580145359 -0.024773940444 -7.78860702542 -6.66118883462
1616648180.99 -0.6 0.0274230350383 -0.61580145359 -0.024773940444 -7.78860702542 -6.66118883462
1616648181.04 -0.599999517106 0.0330776800847 -0.61580145359 -0.0111055597663 -7.78860702542 -6.66118883462
1616648181.09 -0.599999935459 0.0389332168708 -0.61580145359 -0.0111055597663 -7.78860702542 -6.66118883462
1616648181.14 -0.599999933996 0.0382574306597 -0.623711943626 0.00384423229843 -7.78888724888 -6.59390082519
1616648181.19 -0.593433842833 0.0482517244623 -0.623711943626 0.00384423229843 -7.78888724888 -6.59390082519
1616648181.24 -0.599999876534 0.0584647973585 -0.631013929844 0.0166583396494 -7.78979326282 -6.44717762863
1616648181.3 -0.59999987384 0.0594307414401 -0.631013929844 0.0166583396494 -7.78979326282 -6.44717762863
1616648181.35 -0.599999929614 0.0792429337382 -0.63892441988 0.0298995841295 -7.79037099876 -6.41962737948
1616648181.4 -0.599998254695 0.0856909088164 -0.63892441988 0.0298995841295 -7.79037099876 -6.41962737948
1616648181.45 -0.599999906185 0.0926053836843 -0.63892441988 0.0469850599766 -7.79112633923 -6.35554644657
1616648181.5 -0.599999974419 0.106172244749 -0.63892441988 0.0469850599766 -7.79112633923 -6.35554644657
1616648181.55 -0.599999823625 0.106061151036 -0.63892441988 0.0636434033513 -7.79186030167 -6.28173293396
1616648181.6 -0.590520534654 0.115539994991 -0.63892441988 0.0636434033513 -7.79186030167 -6.28173293396
1616648181.65 -0.599999955637 0.109549887364 -0.631013929844 0.0790203362703 -7.79251067583 -6.20212841791
1616648181.7 -0.592440708227 0.109837155504 -0.631013929844 0.0790203362703 -7.79251067583 -6.20212841791
1616648181.75 -0.599999839182 0.102836279749 -0.631013929844 0.0905530229211 -7.79292309292 -6.13853217227
1616648181.8 -0.599999839182 0.102836279749 -0.631013929844 0.0905530229211 -7.79292309292 -6.13853217227
1616648181.85 -0.592302975195 0.102788727129 -0.631013929844 0.0961058065295 -7.79348832657 -6.10052133043
1616648181.9 -0.599999437636 0.0891619092593 -0.631013929844 0.0961058065295 -7.79348832657 -6.10052133043
1616648181.95 -0.599999956336 0.104123819798 -0.623711943626 0.0986686274409 -7.79387971426 -6.03776519791
1616648182.0 -0.599999620277 0.0956957687819 -0.623711943626 0.0986686274409 -7.79387971426 -6.03776519791
1616648182.05 -0.599999884796 0.093392104676 -0.623711943626 0.0986686274409 -7.79388141632 -6.03749084473
1616648182.1 -0.599999943603 0.0929955812655 -0.61580145359 0.0986686274409 -7.79388141632 -6.03749084473
1616648182.15 -0.6 0.092252626103 -0.61580145359 0.0986686274409 -7.79401008735 -5.8953088818
1616648182.2 -0.6 0.092252626103 -0.61580145359 0.0986686274409 -7.79401008735 -5.8953088818
1616648182.25 -0.584981278438 0.077182145903 -0.608499467373 0.0982414856553 -7.78797487445 -5.81103349769
1616648182.3 -0.584981278438 0.077182145903 -0.608499467373 0.0982414856553 -7.78797487445 -5.81103349769
1616648182.35 -0.578322652042 0.0571837536108 -0.600588917732 0.0943972542882 -7.78727979247 -5.75031126477
1616648182.4 -0.578322652042 0.0571837536108 -0.600588917732 0.0943972542882 -7.78727979247 -5.75031126477
1616648182.45 -0.565001242197 0.0471839785098 -0.600588917732 0.0850002467632 -7.78046886582 -5.73232455152
1616648182.5 -0.578334568399 0.0271841242353 -0.600588917732 0.0850002467632 -7.78046886582 -5.73232455152
1616648182.55 -0.591667775982 0.00718676858277 -0.593286991119 0.0713318660855 -7.77953476094 -5.6725666824
1616648182.6 -0.598334326171 -0.0028126932597 -0.593286991119 0.0713318660855 -7.77953476094 -5.6725666824
1616648182.65 -0.599999967543 -0.0228104639494 -0.585376441479 0.0491207428277 -7.77805247734 -5.53959982809
1616648182.7 -0.599999967543 -0.0228104639494 -0.585376441479 0.0491207428277 -7.77805247734 -5.53959982809
1616648182.75 -0.586666646299 -0.0328103102556 -0.585376441479 0.0222111195326 -7.77645118255 -5.48037606881
1616648182.8 -0.593333298495 -0.0428102087955 -0.585376441479 0.0222111195326 -7.77645118255 -5.48037606881
1616648182.85 -0.599999999744 -0.0628098986121 -0.585376441479 -0.00384423229843 -7.77482947515 -5.42215370424
1616648182.9 -0.586669826115 -0.0828096167606 -0.578074514866 -0.0281910356134 -7.77482947515 -5.42215370424
1616648182.95 -0.593336485002 -0.092808883419 -0.578074514866 -0.0281910356134 -7.77325214644 -5.44720340217
1616648183.0 -0.6 -0.102807932618 -0.585376441479 -0.0555278025568 -7.77325214644 -5.44720340217
1616648183.05 -0.599999983138 -0.132802020936 -0.585376441479 -0.0555278025568 -7.77325214644 -5.44720340217
1616648183.1 -0.599999988494 -0.142800696672 -0.593286991119 -0.0850002467632 -7.77325214644 -5.44720340217
1616648183.15 -0.599999965477 -0.161169302571 -0.593286991119 -0.0850002467632 -7.77339913888 -5.2564964205
1616648183.2 -0.599999965477 -0.161169302571 -0.593286991119 -0.11404556036 -7.77339913888 -5.2564964205
1616648183.25 -0.59333318327 -0.158071374985 -0.593286991119 -0.11404556036 -7.77190531006 -5.19483997756
1616648183.3 -0.599999846473 -0.148071439442 -0.593286991119 -0.14010091126 -7.77190531006 -5.19483997756
1616648183.35 -0.6 -0.145065302487 -0.593286991119 -0.14010091126 -7.7718963623 -5.19447755814
1616648183.4 -0.6 -0.145008925721 -0.600588917732 -0.152060732245 -7.7718963623 -5.19447755814
1616648183.45 -0.6 -0.145012087139 -0.600588917732 -0.152060732245 -7.7707552232 -5.13418333876
1616648183.5 -0.599998687828 -0.13535222287 -0.608499467373 -0.156759247184 -7.7707552232 -5.13418333876
1616648183.55 -0.599999938764 -0.131296202594 -0.608499467373 -0.156759247184 -7.77025238633 -5.15017022875
1616648183.6 -0.599999967907 -0.141292489128 -0.608499467373 -0.156759247184 -7.77025238633 -5.15017022875
1616648183.65 -0.599999929506 -0.150790741577 -0.600588917732 -0.156759247184 -7.79068510201 -4.95779907384
1616648183.7 -0.599999929506 -0.150790741577 -0.600588917732 -0.156759247184 -7.79068510201 -4.95779907384
1616648183.75 -0.593332041539 -0.130792378238 -0.600588917732 -0.156759247184 -7.79077291489 -4.95697212219
1616648183.8 -0.599997344206 -0.11079593159 -0.600588917732 -0.156759247184 -7.79077291489 -4.95697212219
1616648183.85 -0.599999826295 -0.0907965032818 -0.585376441479 -0.154623568058 -7.79077291489 -4.95697212219
1616648183.9 -0.6 -0.0807965350247 -0.585376441479 -0.154623568058 -7.79077291489 -4.95697212219
1616648183.95 -0.599999993753 -0.0607972862575 -0.585376441479 -0.137110948563 -7.79077291489 -4.95697212219
1616648184.0 -0.599999993753 -0.0607972862575 -0.585376441479 -0.137110948563 -7.79077291489 -4.95697212219
1616648184.06 -0.586666680939 -0.0507974010597 -0.585376441479 -0.108492776752 -7.78674050783 -4.87328977668
1616648184.11 -0.573333379517 -0.0407976073193 -0.585376441479 -0.108492776752 -7.78674050783 -4.87328977668
1616648184.16 -0.579942164251 -0.030913958267 -0.578074514866 -0.0875630676746 -7.78668546677 -4.87369251251
1616648184.21 -0.586608829691 -0.0209140277775 -0.578074514866 -0.0875630676746 -7.78668546677 -4.87369251251
1616648184.26 -0.599942150647 -0.000914158441482 -0.585376441479 -0.0662062242627 -7.79768846637 -4.60293899315
1616648184.31 -0.58660883313 0.00908571990747 -0.585376441479 -0.0662062242627 -7.79768846637 -4.60293899315
1616648184.36 -0.593275487531 0.0190857060249 -0.578074514866 -0.0439951047301 -7.79997179859 -4.5444798675
1616648184.41 -0.593275487531 0.0190857060249 -0.578074514866 -0.0439951047301 -7.79997179859 -4.5444798675
1616648184.46 -0.579943397494 0.0290856226573 -0.585376441479 -0.0217839833349 -7.80663751825 -4.57567471842
1616648184.51 -0.586610000083 0.0390853763335 -0.585376441479 -0.0217839833349 -7.80663751825 -4.57567471842
1616648184.56 -0.599943286302 0.0590851946679 -0.578074514866 -0.00384423229843 -7.81092255409 -4.46773719961
1616648184.61 -0.586610264293 0.0690849077929 -0.578074514866 -0.00384423229843 -7.81092255409 -4.46773719961
1616648184.66 -0.59326684697 0.0790836800241 -0.578074514866 0.013668381609 -7.81093120575 -4.46751832962
1616648184.71 -0.599999852938 0.109081789733 -0.578074514866 0.013668381609 -7.81093120575 -4.46751832962
1616648184.76 -0.6 0.119081755181 -0.585376441479 0.0350252278149 -7.8142323983 -4.37901832452
1616648184.81 -0.599999853317 0.13908061953 -0.593286991119 0.0636434033513 -7.8142323983 -4.37901832452
1616648184.86 -0.599999829849 0.149079643938 -0.593286991119 0.0636434033513 -7.81747531301 -4.31989054585
1616648184.91 -0.586667715347 0.159079614503 -0.593286991119 0.0961058065295 -7.81747531301 -4.31989054585
1616648184.96 -0.599999995394 0.179079041255 -0.593286991119 0.0961058065295 -7.82064380389 -4.25944575182
1616648185.01 -0.591247363327 0.189078674197 -0.608499467373 0.124296844006 -7.82064380389 -4.25944575182
1616648185.06 -0.59999992288 0.209076284509 -0.608499467373 0.124296844006 -7.82393541271 -4.2804922637
1616648185.11 -0.599999916842 0.229074729312 -0.608499467373 0.153342157602 -7.82393541271 -4.2804922637
1616648185.16 -0.599999986528 0.239074347276 -0.608499467373 0.153342157602 -7.82728758003 -4.16209413795
1616648185.21 -0.599999691694 0.249073762762 -0.61580145359 0.18409602344 -7.82728758003 -4.16209413795
1616648185.26 -0.6 0.25415246754 -0.61580145359 0.18409602344 -7.83050808053 -4.09693778511
1616648185.31 -0.59968758042 0.260493999699 -0.608499467373 0.210151359439 -7.83050808053 -4.09693778511
1616648185.36 -0.599999952702 0.253686624351 -0.608499467373 0.210151359439 -7.833260033 -4.03468224134
1616648185.41 -0.6 0.252486029267 -0.608499467373 0.229799672961 -7.833260033 -4.03468224134
1616648185.46 -0.599999976065 0.240501453186 -0.608499467373 0.229799672961 -7.83530865221 -3.97515293925
1616648185.51 -0.599995499381 0.230521049982 -0.593286991119 0.240050956607 -7.83530865221 -3.97515293925
1616648185.56 -0.599999987368 0.226994218377 -0.600588917732 0.242186620831 -7.82944977645 -3.92062347488
1616648185.61 -0.599998661483 0.225860783072 -0.600588917732 0.242186620831 -7.82944977645 -3.92062347488
1616648185.66 -0.59999884268 0.225894133225 -0.585376441479 0.242186620831 -7.83106155083 -3.85124173328
1616648185.71 -0.599916626754 0.21589440426 -0.585376441479 0.242186620831 -7.83106155083 -3.85124173328
1616648185.76 -0.599999997918 0.210293435503 -0.585376441479 0.23791526258 -7.83205568462 -3.79116288291
1616648185.81 -0.599999904233 0.20029359442 -0.585376441479 0.23791526258 -7.83205568462 -3.79116288291
1616648185.86 -0.599999909998 0.193893282815 -0.585376441479 0.22809112072 -7.83239284532 -3.73408566675
1616648185.91 -0.588197581707 0.183895695522 -0.585376441479 0.22809112072 -7.83239284532 -3.73408566675
1616648185.96 -0.594864241423 0.175375673198 -0.570163965225 0.214422732592 -7.83239650726 -3.73346304893
1616648186.01 -0.599999777137 0.174920781419 -0.570163965225 0.214422732592 -7.83239650726 -3.73346304893
1616648186.06 -0.599999771399 0.174919801486 -0.570163965225 0.199900075793 -7.83151421273 -3.63509649378
1616648186.11 -0.586668107781 0.164919828878 -0.570163965225 0.199900075793 -7.83151421273 -3.63509649378
1616648186.16 -0.6 0.144920092847 -0.554951488972 0.186658829451 -7.8303159537 -3.5705022381
1616648186.21 -0.599999909598 0.1349201788 -0.554951488972 0.186658829451 -7.8303159537 -3.5705022381
1616648186.26 -0.6 0.121129802863 -0.554951488972 0.171709045768 -7.82837260455 -3.50775260573
1616648186.31 -0.6 0.121129802863 -0.554951488972 0.171709045768 -7.82837260455 -3.50775260573
1616648186.36 -0.586669804788 0.111129900603 -0.554951488972 0.152060732245 -7.82604619906 -3.45232883317
1616648186.41 -0.593336467063 0.101129913455 -0.554951488972 0.134120985866 -7.82604619906 -3.45232883317
1616648186.46 -0.586676017694 0.081130247386 -0.554951488972 0.134120985866 -7.82604619906 -3.45232883317
1616648186.51 -0.59334182294 0.0711305540648 -0.547649502754 0.115326970816 -7.82604619906 -3.45232883317
1616648186.56 -0.599999862023 0.061131007061 -0.547649502754 0.115326970816 -7.81952134158 -3.30395449903
1616648186.61 -0.599999862023 0.061131007061 -0.562862038612 0.0952515304089 -7.81952134158 -3.30395449903
1616648186.66 -0.586673443052 0.051131249047 -0.562862038612 0.0952515304089 -7.8159925626 -3.29895752865
1616648186.71 -0.6 0.0311312551734 -0.562862038612 0.0756032317877 -7.8159925626 -3.29895752865
1616648186.76 -0.599999938994 0.0211314490308 -0.562862038612 0.0756032317877 -7.81198881679 -3.23343509774
1616648186.81 -0.598920056375 0.0111318731836 -0.570163965225 0.0551006644964 -7.81198881679 -3.23343509774
1616648186.87 -0.599999905194 -0.00886742010316 -0.570163965225 0.0551006644964 -7.80779871893 -3.17583440106
1616648186.92 -0.599999995261 -0.0188673926586 -0.578074514866 0.0328895412385 -7.80779871893 -3.17583440106
1616648186.97 -0.599999891921 -0.0288664767666 -0.578074514866 0.0328895412385 -7.80698597058 -3.09314265924
1616648187.02 -0.586667919982 -0.0388663773948 -0.585376441479 0.00854273885489 -7.80698597058 -3.09314265924
1616648187.07 -0.593334530966 -0.0488662443547 -0.585376441479 0.00854273885489 -7.80225942708 -3.03418381612
1616648187.12 -0.599996483645 -0.0588661681619 -0.593286991119 -0.0145226549357 -7.80225942708 -3.03418381612
1616648187.17 -0.599999995349 -0.0688660256177 -0.593286991119 -0.0145226549357 -7.80521583233 -3.00974625317
1616648187.22 -0.599998878981 -0.088844889862 -0.600588917732 -0.03545236215 -7.80521583233 -3.00974625317
1616648187.27 -0.6 -0.0988447700318 -0.600588917732 -0.03545236215 -7.80004299731 -2.94881439652
1616648187.32 -0.586693916552 -0.108843892292 -0.600588917732 -0.0589448958635 -7.80004299731 -2.94881439652
1616648187.37 -0.593360528827 -0.118843107075 -0.600588917732 -0.0589448958635 -7.8000202179 -2.94854736328
1616648187.42 -0.5999999995 -0.138842747004 -0.608499467373 -0.0824374258518 -7.8000202179 -2.94854736328
1616648187.47 -0.599999992443 -0.148842434732 -0.608499467373 -0.0824374258518 -7.79483550622 -2.88634765209
1616648187.52 -0.599999820628 -0.158841587613 -0.61580145359 -0.106357097626 -7.79483550622 -2.88634765209
1616648187.57 -0.599999999326 -0.178840393014 -0.61580145359 -0.106357097626 -7.78970838504 -2.80748431104
1616648187.62 -0.599998396132 -0.18879500373 -0.61580145359 -0.13113103807 -7.78970838504 -2.80748431104
1616648187.67 -0.6 -0.208794803726 -0.61580145359 -0.13113103807 -7.78482733655 -2.74595040184
1616648187.72 -0.6 -0.208794803726 -0.608499467373 -0.158040672541 -7.78482733655 -2.74595040184
1616648187.77 -0.596565864931 -0.218794699982 -0.623711943626 -0.183668881655 -7.77992203853 -2.7229455202
1616648187.82 -0.599999569596 -0.235213368826 -0.623711943626 -0.183668881655 -7.77992203853 -2.7229455202
1616648187.87 -0.599999746338 -0.235298283281 -0.608499467373 -0.206307128072 -7.77531996022 -2.66163363805
1616648187.92 -0.599998385056 -0.231973058028 -0.608499467373 -0.206307128072 -7.77531996022 -2.66163363805
1616648187.97 -0.599999957761 -0.230841028035 -0.608499467373 -0.222111210227 -7.76953039966 -2.5852225587
1616648188.02 -0.599999857259 -0.224586942496 -0.608499467373 -0.222111210227 -7.76953039966 -2.5852225587
1616648188.07 -0.599999936025 -0.225128453472 -0.608499467373 -0.231081083417 -7.76951265335 -2.58498835564
1616648188.12 -0.599999992313 -0.215129180528 -0.608499467373 -0.231081083417 -7.76951265335 -2.58498835564
1616648188.17 -0.599999947938 -0.214236981902 -0.608499467373 -0.234498158097 -7.76285726836 -2.45155340105
1616648188.22 -0.59999952715 -0.204237450484 -0.608499467373 -0.234498158097 -7.76285726836 -2.45155340105
1616648188.27 -0.59999952715 -0.204237450484 -0.608499467373 -0.234498158097 -7.76364147099 -2.42120510129
1616648188.32 -0.599999994239 -0.196786867463 -0.608499467373 -0.234498158097 -7.76364147099 -2.42120510129
1616648188.37 -0.599999998081 -0.196551861855 -0.578074514866 -0.233643889427 -7.75961357621 -2.29189226457
1616648188.42 -0.599999998081 -0.196551861855 -0.578074514866 -0.233643889427 -7.75961357621 -2.29189226457
1616648188.47 -0.586671846726 -0.186552141374 -0.570163965225 -0.227236837149 -7.75878007488 -2.22692402851
1616648188.52 -0.573362150721 -0.176552696308 -0.570163965225 -0.227236837149 -7.75878007488 -2.22692402851
1616648188.57 -0.569364245526 -0.16655656922 -0.562862038612 -0.218266963959 -7.75851420831 -2.17006818497
1616648188.62 -0.582697380856 -0.146556835598 -0.562862038612 -0.218266963959 -7.75851420831 -2.17006818497
1616648188.67 -0.589364008771 -0.136556909082 -0.554951488972 -0.20289003849 -7.75854002358 -2.14282120496
1616648188.72 -0.6 -0.116557486897 -0.539739012718 -0.20289003849 -7.75854002358 -2.14282120496
1616648188.77 -0.6 -0.10655753054 -0.539739012718 -0.181960329413 -7.75913081797 -2.08839744953
1616648188.82 -0.599999994524 -0.0865588460694 -0.539739012718 -0.181960329413 -7.75913081797 -2.08839744953
1616648188.87 -0.599999685535 -0.0765607447097 -0.547649502754 -0.153342157602 -7.7604317282 -2.02587557974
1616648188.92 -0.599999304305 -0.0665610021891 -0.547649502754 -0.124296844006 -7.7604317282 -2.02587557974
1616648188.97 -0.599997230371 -0.0365959784706 -0.547649502754 -0.124296844006 -7.7604317282 -2.02587557974
1616648189.02 -0.599999923556 -0.0265976361236 -0.539739012718 -0.0969600826502 -7.7604317282 -2.02587557974
1616648189.07 -0.599999987256 -0.0165985502683 -0.539739012718 -0.0969600826502 -7.76226957398 -1.96196738873
1616648189.12 -0.599999974007 0.00340097865112 -0.547649502754 -0.0657790824771 -7.76226957398 -1.96196738873
1616648189.17 -0.599999927321 0.0133996325364 -0.547649502754 -0.0657790824771 -7.7644101872 -1.90663554037
1616648189.22 -0.6 0.0333737737526 -0.554951488972 -0.0367337763309 -7.7644101872 -1.90663554037
1616648189.27 -0.599999837241 0.0433715520939 -0.554951488972 -0.0367337763309 -7.76685658886 -1.8697853272
1616648189.32 -0.599999491588 0.0633663905115 -0.570163965225 -0.00341709540226 -7.76685658886 -1.8697853272
1616648189.38 -0.599997093362 0.0833538391383 -0.570163965225 -0.00341709540226 -7.7697909149 -1.81266239842
1616648189.43 -0.599999927607 0.0933520261248 -0.578074514866 0.0234925299883 -7.7697909149 -1.81266239842
1616648189.48 -0.599999650598 0.113348070186 -0.578074514866 0.0234925299883 -7.77320630958 -1.75459533336
1616648189.53 -0.599999612853 0.133343470183 -0.578074514866 0.051256429404 -7.77320630958 -1.75459533336
1616648189.58 -0.599999612853 0.133343470183 -0.578074514866 0.051256429404 -7.77322483063 -1.75428056717
1616648189.63 -0.599999745755 0.153327140376 -0.593286991119 0.0815831497312 -7.77322483063 -1.75428056717
1616648189.68 -0.599999683854 0.163317926188 -0.593286991119 0.0815831497312 -7.77688505746 -1.69511916476
1616648189.73 -0.599999979523 0.183316596011 -0.600588917732 0.108919911087 -7.77688505746 -1.69511916476
1616648189.78 -0.599999992598 0.193315959748 -0.600588917732 0.108919911087 -7.7842604843 -1.55345110381
1616648189.83 -0.599998967406 0.203305033564 -0.600588917732 0.135829538107 -7.7842604843 -1.55345110381
1616648189.88 -0.599999988158 0.223302851968 -0.600588917732 0.135829538107 -7.7879463543 -1.49123356729
1616648189.93 -0.599999917847 0.233301019493 -0.61580145359 0.161457747221 -7.7879463543 -1.49123356729
1616648189.98 -0.599999930399 0.236122299397 -0.608499467373 0.187513098121 -7.79177756464 -1.460557924
1616648190.03 -0.599999816684 0.242566796065 -0.608499467373 0.187513098121 -7.79177756464 -1.460557924
1616648190.08 -0.599999937195 0.242630717192 -0.608499467373 0.208869948983 -7.79536716553 -1.39876197076
1616648190.13 -0.599999898563 0.239018964571 -0.608499467373 0.208869948983 -7.79536716553 -1.39876197076
1616648190.18 -0.599999923708 0.239019589548 -0.608499467373 0.222111210227 -7.79833613259 -1.33830222162
1616648190.23 -0.586666622123 0.229019590003 -0.608499467373 0.222111210227 -7.79833613259 -1.33830222162
1616648190.28 -0.5999638165 0.218932386237 -0.593286991119 0.228518247604 -7.80097540367 -1.255992987
1616648190.33 -0.599999748138 0.219625421487 -0.593286991119 0.228518247604 -7.80097540367 -1.255992987
1616648190.38 -0.599999433379 0.219782196372 -0.593286991119 0.228518247604 -7.80099209497 -1.25548419647
1616648190.43 -0.599999433379 0.219782196372 -0.593286991119 0.228518247604 -7.80099209497 -1.25548419647
1616648190.48 -0.586666797367 0.209782209921 -0.578074514866 0.228518247604 -7.8049597877 -1.15920340294
1616648190.53 -0.593313280415 0.209250228444 -0.578074514866 0.228518247604 -7.8049597877 -1.15920340294
1616648190.58 -0.593313280415 0.209250228444 -0.570163965225 0.224246874452 -7.8049597877 -1.15920340294
1616648190.63 -0.599971766782 0.208153241392 -0.570163965225 0.224246874452 -7.8049597877 -1.15920340294
1616648190.68 -0.599971766782 0.208153241392 -0.570163965225 0.218266963959 -7.80637741089 -1.10130143166
1616648190.73 -0.58663848621 0.198153241957 -0.570163965225 0.218266963959 -7.80637741089 -1.10130143166
1616648190.78 -0.573305172564 0.188153242463 -0.562862038612 0.212287053466 -7.80720101354 -1.04433066521
1616648190.83 -0.573305172564 0.188153242463 -0.562862038612 0.212287053466 -7.80720101354 -1.04433066521
1616648190.88 -0.577908904166 0.178153243386 -0.562862038612 0.203317180276 -7.80720949173 -1.04374420643
1616648190.93 -0.577908904166 0.178153243386 -0.562862038612 0.203317180276 -7.80720949173 -1.04374420643
1616648190.98 -0.577908904166 0.178153243386 -0.554951488972 0.1939201653 -7.80722694487 -0.960841918571
1616648191.03 -0.564575586456 0.168153244271 -0.554951488972 0.1939201653 -7.80722694487 -0.960841918571
1616648191.09 -0.564575586456 0.168153244271 -0.554951488972 0.18495029211 -7.80598338569 -0.874001429596
1616648191.14 -0.564575586456 0.168153244271 -0.554951488972 0.18495029211 -7.80598338569 -0.874001429596
1616648191.19 -0.551242252476 0.158153243611 -0.547649502754 0.175980418921 -7.80596955397 -0.873298170452
1616648191.24 -0.551242252476 0.158153243611 -0.547649502754 0.175980418921 -7.80596955397 -0.873298170452
1616648191.29 -0.551242252476 0.158153243611 -0.547649502754 0.167864814401 -7.80342099298 -0.763401532256
1616648191.34 -0.551242252476 0.158153243611 -0.547649502754 0.167864814401 -7.80342099298 -0.763401532256
1616648191.39 -0.551242252476 0.158153243611 -0.547649502754 0.160176336765 -7.80100400093 -0.68990258042
1616648191.44 -0.551242252476 0.158153243611 -0.547649502754 0.160176336765 -7.80100400093 -0.68990258042
1616648191.49 -0.551242252476 0.158153243611 -0.539739012718 0.155477836728 -7.80098772049 -0.689407646656
1616648191.54 -0.551242252476 0.158153243611 -0.539739012718 0.155477836728 -7.79819390003 -0.635239342287
1616648191.59 -0.551242252476 0.158153243611 -0.539739012718 0.152060732245 -7.79819390003 -0.635239342287
1616648191.64 -0.551242252476 0.158153243611 -0.539739012718 0.152060732245 -7.79515741853 -0.605422311526
1616648191.69 -0.551242252476 0.158153243611 -0.532437026501 0.149925068021 -7.79515741853 -0.605422311526
1616648191.74 -0.551242252476 0.158153243611 -0.532437026501 0.149925068021 -7.7873236503 -0.442369439211
1616648191.79 -0.551242252476 0.158153243611 -0.532437026501 0.149925068021 -7.7873236503 -0.442369439211
1616648191.84 -0.551242252476 0.158153243611 -0.532437026501 0.148643657565 -7.77853440196 -0.359567001464
1616648191.89 -0.551242252476 0.158153243611 -0.532437026501 0.148643657565 -7.77853440196 -0.359567001464
1616648191.94 -0.551242252476 0.158153243611 -0.532437026501 0.148643657565 -7.77848148346 -0.359069287777
1616648191.99 -0.551242252476 0.158153243611 -0.524526536465 0.148643657565 -7.77848148346 -0.359069287777
1616648192.04 -0.551242252476 0.158153243611 -0.524526536465 0.148643657565 -7.77848148346 -0.359069287777
1616648192.1 -0.537909228789 0.148153062216 -0.524526536465 0.148643657565 -7.77848148346 -0.359069287777
1616648192.15 -0.537909228789 0.148153062216 -0.532437026501 0.148643657565 -7.76839686819 -0.235883107405
1616648192.2 -0.537909228789 0.148153062216 -0.532437026501 0.148643657565 -7.76839686819 -0.235883107405
1616648192.25 -0.537909228789 0.148153062216 -0.532437026501 0.147362247109 -7.7627412481 -0.183330178021
1616648192.3 -0.52457590769 0.158152909451 -0.532437026501 0.147362247109 -7.7627412481 -0.183330178021
1616648192.35 -0.52457590769 0.158152909451 -0.532437026501 0.144799411297 -7.75695287699 -0.155553012019
1616648192.4 -0.52457590769 0.158152909451 -0.532437026501 0.144799411297 -7.75695287699 -0.155553012019
1616648192.45 -0.511242584985 0.16815286006 -0.532437026501 0.144799411297 -7.75080966949 -0.102655604482
1616648192.5 -0.511242584985 0.16815286006 -0.524526536465 0.144372269511 -7.75080966949 -0.102655604482
1616648192.55 -0.497909272242 0.178152703251 -0.524526536465 0.144372269511 -7.75080966949 -0.102655604482
1616648192.6 -0.497909272242 0.178152703251 -0.517224550247 0.144372269511 -7.75080966949 -0.102655604482
1616648192.65 -0.484575942663 0.18815264229 -0.517224550247 0.144372269511 -7.74482793844 -0.0880097405991
1616648192.7 -0.484575942663 0.18815264229 -0.517224550247 0.149497926235 -7.74482793844 -0.0880097405991
1616648192.75 -0.484575942663 0.18815264229 -0.517224550247 0.149497926235 -7.73816942367 0.0223553398616
1616648192.8 -0.471242608773 0.198152642059 -0.509314060211 0.158040672541 -7.73816942367 0.0223553398616
1616648192.85 -0.471242608773 0.198152642059 -0.509314060211 0.158040672541 -7.73107946783 0.0747263719825
1616648192.9 -0.471242608773 0.198152642059 -0.486799567938 0.166583403945 -7.73107946783 0.0747263719825
1616648192.95 -0.457909289117 0.208152586506 -0.486799567938 0.166583403945 -7.72461429137 0.0990347710156
1616648193.0 -0.457909289117 0.208152586506 -0.478889077902 0.174699008465 -7.72461429137 0.0990347710156
1616648193.05 -0.44457710516 0.218147511781 -0.478889077902 0.174699008465 -7.71061536463 0.201543776723
1616648193.1 -0.44457710516 0.218147511781 -0.456374585629 0.182814598083 -7.71061536463 0.201543776723
1616648193.15 -0.44457710516 0.218147511781 -0.456374585629 0.182814598083 -7.7034195476 0.262740596907
1616648193.2 -0.431243772702 0.228147509038 -0.456374585629 0.190503060818 -7.7034195476 0.262740596907
1616648193.25 -0.431243772702 0.228147509038 -0.456374585629 0.190503060818 -7.7034195476 0.262740596907
1616648193.3 -0.431243772702 0.228147509038 -0.441162109375 0.196910113096 -7.7034195476 0.262740596907
1616648193.35 -0.417910438999 0.238147508705 -0.433251619339 0.204171448946 -7.69594736367 0.308508396231
1616648193.4 -0.417910438999 0.238147508705 -0.433251619339 0.204171448946 -7.69594736367 0.308508396231
1616648193.46 -0.404577136819 0.248147436102 -0.418039113283 0.21185991168 -7.68877744675 0.336981266737
1616648193.51 -0.404577136819 0.248147436102 -0.418039113283 0.21185991168 -7.68877744675 0.336981266737
1616648193.56 -0.404577136819 0.248147436102 -0.418039113283 0.219548374414 -7.68140888214 0.379709899426
1616648193.61 -0.391243804329 0.258147432428 -0.410737127066 0.219548374414 -7.68140888214 0.379709899426
1616648193.66 -0.391243804329 0.258147432428 -0.410737127066 0.219548374414 -7.67402172089 0.423055231571
1616648193.71 -0.377910509292 0.268147310211 -0.395524650812 0.226382568479 -7.67402172089 0.423055231571
1616648193.76 -0.377910509292 0.268147310211 -0.380312174559 0.233643889427 -7.66655384025 0.473403950172
1616648193.81 -0.377910509292 0.268147310211 -0.380312174559 0.233643889427 -7.66655384025 0.473403950172
1616648193.86 -0.364577198336 0.278147273298 -0.37240165472 0.241332352161 -7.65907287598 0.51201581955
1616648193.91 -0.364577198336 0.278147273298 -0.37240165472 0.241332352161 -7.65907287598 0.51201581955
1616648193.96 -0.364577198336 0.278147273298 -0.365099668503 0.248166561127 -7.65166596612 0.547717075569
1616648194.01 -0.364577198336 0.278147273298 -0.365099668503 0.248166561127 -7.65166596612 0.547717075569
1616648194.06 -0.364577198336 0.278147273298 -0.357189178467 0.25500074029 -7.64410289604 0.584921214076
1616648194.11 -0.364577198336 0.278147273298 -0.357189178467 0.25500074029 -7.64410289604 0.584921214076
1616648194.16 -0.351243864678 0.288147273298 -0.341976702213 0.260126382113 -7.62910795385 0.662865477855
1616648194.22 -0.351243864678 0.288147273298 -0.341976702213 0.260126382113 -7.62910795385 0.662865477855
1616648194.27 -0.351243864678 0.288147273298 -0.341976702213 0.26397061348 -7.62910795385 0.662865477855
1616648194.32 -0.33791053255 0.298147267016 -0.341976702213 0.26397061348 -7.62910795385 0.662865477855
1616648194.37 -0.33791053255 0.298147267016 -0.32676422596 0.268669128418 -7.61377678813 0.735230166014
1616648194.42 -0.33791053255 0.298147267016 -0.32676422596 0.268669128418 -7.61377678813 0.735230166014
1616648194.47 -0.32457723048 0.308147133411 -0.32676422596 0.273794770241 -7.61377678813 0.735230166014
1616648194.52 -0.32457723048 0.308147133411 -0.32676422596 0.273794770241 -7.61377678813 0.735230166014
1616648194.57 -0.32457723048 0.308147133411 -0.31946220994 0.278493255377 -7.60624741109 0.766375371792
1616648194.62 -0.32457723048 0.308147133411 -0.31946220994 0.278493255377 -7.60624741109 0.766375371792
1616648194.67 -0.311243896793 0.31814713235 -0.304249733686 0.2836188972 -7.60600614548 0.767373204231
1616648194.72 -0.311243896793 0.31814713235 -0.304249733686 0.2836188972 -7.60600614548 0.767373204231
1616648194.77 -0.311243896793 0.31814713235 -0.29633924365 0.29002597928 -7.59857519026 0.79754641716
1616648194.82 -0.29791056692 0.328147112702 -0.29633924365 0.29002597928 -7.59857519026 0.79754641716
1616648194.87 -0.29791056692 0.328147112702 -0.29633924365 0.294724494219 -7.59085348427 0.828099378243
1616648194.92 -0.29791056692 0.328147112702 -0.29633924365 0.294724494219 -7.59085348427 0.828099378243
1616648194.97 -0.284577250101 0.338147039202 -0.281126767397 0.300704389811 -7.57585834387 0.892584456623
1616648195.02 -0.284577250101 0.338147039202 -0.281126767397 0.300704389811 -7.57585834387 0.892584456623
1616648195.07 -0.284577250101 0.338147039202 -0.281126767397 0.305830031633 -7.56840181351 0.919867813587
1616648195.12 -0.284577250101 0.338147039202 -0.281126767397 0.305830031633 -7.56840181351 0.919867813587
1616648195.17 -0.271243918971 0.348147017223 -0.265914261341 0.311382830143 -7.56840181351 0.919867813587
1616648195.22 -0.271243918971 0.348147017223 -0.265914261341 0.311382830143 -7.56840181351 0.919867813587
1616648195.27 -0.271243918971 0.348147017223 -0.258612275124 0.31693559885 -7.56107767763 0.946093505527
1616648195.32 -0.257910585247 0.358147015567 -0.258612275124 0.31693559885 -7.56107767763 0.946093505527
1616648195.37 -0.244577258942 0.368146933235 -0.250701785088 0.323342651129 -7.54641532898 0.996776342392
1616648195.42 -0.231243943061 0.378146829151 -0.250701785088 0.323342651129 -7.54641532898 0.996776342392
1616648195.47 -0.204577310824 0.398146162602 -0.243399783969 0.330603986979 -7.54637953043 0.996895867436
1616648195.52 -0.191243996093 0.40814447362 -0.243399783969 0.330603986979 -7.54637953043 0.996895867436
1616648195.57 -0.177910691997 0.398144692941 -0.228187292814 0.342563807964 -7.53244861133 1.0371962786
1616648195.62 -0.151244026654 0.378144705274 -0.228187292814 0.342563807964 -7.53244861133 1.0371962786
1616648195.68 -0.137910749736 0.368145085026 -0.220276802778 0.355805039406 -7.53229803107 1.03762881633
1616648195.73 -0.124577417167 0.35814508967 -0.220276802778 0.355805039406 -7.53229803107 1.03762881633
1616648195.78 -0.111244133385 0.34814522086 -0.205064311624 0.360930681229 -7.51908556928 1.07980534193
1616648195.83 -0.0845775787045 0.32814548689 -0.205064311624 0.360930681229 -7.51908556928 1.07980534193
1616648195.88 -0.0712442459496 0.318145488907 -0.174639344215 0.360930681229 -7.51305018903 1.09911147135
1616648195.93 -0.0579142045144 0.308155650084 -0.174639344215 0.3617849648 -7.51305018903 1.09911147135
1616648195.98 -0.0312475509164 0.288155690064 -0.152124866843 0.354096531868 -7.50199898284 1.13251394765
1616648196.03 -0.0045809158118 0.268155730127 -0.152124866843 0.354096531868 -7.50199898284 1.13251394765
1616648196.08 0.00875236981885 0.258155841586 -0.152124866843 0.339573830366 -7.49765476088 1.14538746016
1616648196.13 0.0220856950221 0.248155853445 -0.152124866843 0.339573830366 -7.49765476088 1.14538746016
1616648196.18 0.0354189675068 0.238156127742 -0.129001885653 0.319498389959 -7.49764347076 1.14542090893
1616648196.24 0.0487523010316 0.228156128777 -0.129001885653 0.319498389959 -7.49764347076 1.14542090893
1616648196.29 0.0620856332784 0.218156129655 -0.0985769107938 0.299423009157 -7.49402942287 1.1559727905
1616648196.34 0.0887522720665 0.198156217889 -0.0985769107938 0.299423009157 -7.49402942287 1.1559727905
1616648196.39 0.115418799529 0.178156800793 -0.0608499459922 0.278066128492 -7.49181529483 1.16832646342
1616648196.44 0.128752125456 0.168156827848 -0.0608499459922 0.278066128492 -7.49081351733 1.17123546266
1616648196.49 0.142085459389 0.158156827584 0.0152124864981 0.255855023861 -7.49081351733 1.17123546266
1616648196.54 0.182085432555 0.128156931896 0.0152124864981 0.255855023861 -7.49081006234 1.1712559629
1616648196.59 0.182085432555 0.128156931896 0.0225144792348 0.228518247604 -7.49081006234 1.1712559629
1616648196.64 0.208752009118 0.108157213841 0.0225144792348 0.228518247604 -7.4927825252 1.18478384246
1616648196.69 0.222084866589 0.0981602762736 0.0456374585629 0.197337254882 -7.4927825252 1.18478384246
1616648196.74 0.235418184925 0.0881603652667 0.0456374585629 0.197337254882 -7.49279594421 1.18489611149
1616648196.79 0.248751509413 0.0781604185384 0.0760624334216 0.167010545731 -7.49279594421 1.18489611149
1616648196.84 0.275418131832 0.0798116491861 0.0760624334216 0.167010545731 -7.497754771 1.17403034407
1616648196.89 0.302084501847 0.0875982658798 0.0833644270897 0.137538090348 -7.497754771 1.17403034407
1616648196.94 0.328751114461 0.0937347665238 0.0833644270897 0.137538090348 -7.50120629132 1.16418596792
1616648196.99 0.342084444605 0.0982557453725 0.0985769107938 0.118316926062 -7.50120629132 1.16418596792
1616648197.04 0.342084444605 0.0982557453725 0.0985769107938 0.118316926062 -7.50189623022 1.16851714069
1616648197.09 0.368751093678 0.104779318935 0.121699891984 0.10592995584 -7.50189623022 1.16851714069
1616648197.14 0.382084230254 0.106891099409 0.121699891984 0.10592995584 -7.5031965046 1.16742007147
1616648197.19 0.408750423214 0.111138898649 0.144214376807 0.0982414856553 -7.5031965046 1.16742007147
1616648197.24 0.435416137848 0.113333115468 0.144214376807 0.0982414856553 -7.50856231111 1.15192234809
1616648197.29 0.448749436381 0.11440808147 0.159426853061 0.0943972542882 -7.50856231111 1.15192234809
1616648197.34 0.475416086502 0.116606200631 0.159426853061 0.0943972542882 -7.51440990233 1.13495234311
1616648197.39 0.477850615414 0.122982100163 0.174639344215 0.0922615751624 -7.51440990233 1.13495234311
1616648197.44 0.477849276409 0.122983071186 0.174639344215 0.0922615751624 -7.52096144517 1.11586463045
1616648197.49 0.473809466906 0.129995018793 0.220276802778 0.0922615751624 -7.52096144517 1.11586463045
1616648197.54 0.473806517136 0.129998631664 0.220276802778 0.0922615751624 -7.51403811894 1.10534947003
1616648197.59 0.478639254183 0.119998631657 0.243399783969 0.0931158512831 -7.51403811894 1.10534947003
1616648197.64 0.478363301247 0.109998632267 0.243399783969 0.0931158512831 -7.52192764002 1.08725808377
1616648197.69 0.47354993326 0.114951746683 0.243399783969 0.0931158512831 -7.52192764002 1.08725808377
1616648197.74 0.473549933932 0.114951745396 0.265914261341 0.0952515304089 -7.52196455002 1.08717370033
1616648197.79 0.468334032747 0.120560635905 0.265914261341 0.0952515304089 -7.52196455002 1.08717370033
1616648197.85 0.468332009767 0.120563069161 0.311551719904 0.0969600826502 -7.54515045551 1.00812286611
1616648197.9 0.468332009767 0.120563069161 0.311551719904 0.0969600826502 -7.54515045551 1.00812286611
1616648197.95 0.461665343758 0.130563066928 0.32676422596 0.099095761776 -7.55544472416 0.977014167618
1616648198.0 0.458496325005 0.134462096741 0.32676422596 0.099095761776 -7.55544472416 0.977014167618
1616648198.05 0.451829657896 0.144462096959 0.32676422596 0.102512858808 -7.55553436279 0.976743459702
1616648198.1 0.451156188772 0.147622007184 0.32676422596 0.102512858808 -7.55553436279 0.976743459702
1616648198.15 0.451156188749 0.147622007181 0.341976702213 0.109347052872 -7.55673862549 0.965286968875
1616648198.2 0.450220845636 0.145011280614 0.341976702213 0.109347052872 -7.55673862549 0.965286968875
1616648198.25 0.450226904848 0.14500179079 0.365099668503 0.117462649941 -7.56833177709 0.917918115261
1616648198.3 0.450200048195 0.145011077121 0.365099668503 0.117462649941 -7.56833177709 0.917918115261
1616648198.35 0.443533452502 0.153562872538 0.387614160776 0.123442567885 -7.5804550897 0.880401678054
1616648198.4 0.442159944564 0.152479232922 0.387614160776 0.123442567885 -7.5804550897 0.880401678054
1616648198.45 0.435493282024 0.162479221015 0.40282663703 0.128568217158 -7.59305584865 0.85242816293
1616648198.5 0.433508467999 0.166889302856 0.40282663703 0.128568217158 -7.59305584865 0.85242816293
1616648198.55 0.420175326048 0.186889292707 0.425949603319 0.135402396321 -7.6063484111 0.810430924681
1616648198.6 0.413508947627 0.196889287698 0.425949603319 0.135402396321 -7.6063484111 0.810430924681
1616648198.65 0.406842357669 0.206889283284 0.441162109375 0.144372269511 -7.619492742 0.768354345706
1616648198.7 0.413250050305 0.212929930491 0.441162109375 0.15974919498 -7.619492742 0.768354345706
1616648198.75 0.399916764412 0.232929921666 0.441162109375 0.15974919498 -7.63267201847 0.725494887503
1616648198.8 0.39325009708 0.242929922329 0.441162109375 0.179397508502 -7.63267201847 0.725494887503
1616648198.85 0.386586007838 0.252929833931 0.441162109375 0.179397508502 -7.6452039499 0.683955100312
1616648198.9 0.373260726659 0.272929762831 0.433251619339 0.200754359365 -7.6452039499 0.683955100312
1616648198.95 0.373260726659 0.272929762831 0.433251619339 0.200754359365 -7.6577244422 0.658302010752
1616648199.0 0.366594106744 0.282929762218 0.418039113283 0.223819732666 -7.6577244422 0.658302010752
1616648199.05 0.366171582247 0.302929756417 0.418039113283 0.223819732666 -7.6695053264 0.618266031449
1616648199.1 0.366171582247 0.302929756417 0.40282663703 0.244749456644 -7.6695053264 0.618266031449
1616648199.15 0.352838394001 0.322929751699 0.40282663703 0.244749456644 -7.68047200632 0.572401744196
1616648199.2 0.346171731098 0.332929706371 0.387614160776 0.266106307507 -7.68047200632 0.572401744196
1616648199.25 0.332838549087 0.35292969944 0.387614160776 0.266106307507 -7.69122553451 0.521032468938
1616648199.3 0.33385073768 0.372929629337 0.380312174559 0.287890285254 -7.69122553451 0.521032468938
1616648199.35 0.333622605901 0.38292962219 0.380312174559 0.287890285254 -7.7010406496 0.485010884747
1616648199.4 0.3269559396 0.39292960329 0.365099668503 0.314799904823 -7.7010406496 0.485010884747
1616648199.45 0.322518581077 0.402929550495 0.365099668503 0.314799904823 -7.71019760863 0.432217582046
1616648199.5 0.315673013913 0.42292394511 0.341976702213 0.340428113937 -7.71019760863 0.432217582046
1616648199.55 0.312524544688 0.442923941645 0.341976702213 0.340428113937 -7.71851958122 0.3994577126
1616648199.6 0.305857877397 0.452923941169 0.334674715996 0.366910606623 -7.71851958122 0.3994577126
1616648199.65 0.301681192045 0.472923883542 0.334674715996 0.366910606623 -7.7264303149 0.369840386557
1616648199.7 0.292579620696 0.492923660724 0.334674715996 0.394674509764 -7.7264303149 0.369840386557
1616648199.75 0.292382919327 0.502923661086 0.334674715996 0.394674509764 -7.72644710541 0.369777530432
1616648199.8 0.292318530105 0.508636305323 0.311551719904 0.42371982336 -7.72644710541 0.369777530432
1616648199.85 0.29231852904 0.508636222265 0.311551719904 0.42371982336 -7.73368643368 0.340130729241
1616648199.9 0.285651862292 0.49863623511 0.289037257433 0.453192263842 -7.73368643368 0.340130729241
1616648199.95 0.28299026799 0.504942061135 0.273824751377 0.471132010221 -7.7400145361 0.313153574787
1616648200.0 0.276323604418 0.494942099218 0.273824751377 0.471132010221 -7.7400145361 0.313153574787
1616648200.05 0.274273761061 0.500126792609 0.258612275124 0.481810420752 -7.74576107795 0.285889490204
1616648200.1 0.26599640067 0.480126826358 0.258612275124 0.481810420752 -7.74576107795 0.285889490204
1616648200.15 0.266187155251 0.470128352522 0.243399783969 0.487363219261 -7.75110234357 0.261058608592
1616648200.2 0.257718051983 0.450129028758 0.243399783969 0.487363219261 -7.75110234357 0.261058608592
1616648200.25 0.25788595161 0.440129249806 0.243399783969 0.487363219261 -7.75591878562 0.238414310533
1616648200.3 0.250819845832 0.420129568781 0.228187292814 0.486081808805 -7.75591878562 0.238414310533
1616648200.35 0.250981063533 0.410129750087 0.228187292814 0.486081808805 -7.76039628147 0.21646143582
1616648200.4 0.242661453664 0.390130041058 0.21297480166 0.47412198782 -7.76039628147 0.21646143582
1616648200.45 0.242793840218 0.380130159009 0.21297480166 0.47412198782 -7.76441786047 0.195921288587
1616648200.51 0.234577726691 0.360184548763 0.21297480166 0.453619420528 -7.76441786047 0.195921288587
1616648200.56 0.234676955962 0.355806913716 0.197762325406 0.427991181612 -7.77126869922 0.176044187857
1616648200.61 0.22134362882 0.335807125143 0.197762325406 0.427991181612 -7.77126869922 0.176044187857
1616648200.66 0.218140670817 0.325807136223 0.197762325406 0.399800151587 -7.77477413523 0.156263237113
1616648200.71 0.209059170918 0.305807160199 0.197762325406 0.399800151587 -7.77477413523 0.156263237113
1616648200.76 0.209101354176 0.295807356291 0.18985183537 0.370754867792 -7.77810691724 0.142647279529
1616648200.81 0.200755540449 0.275807469701 0.18985183537 0.370754867792 -7.77810691724 0.142647279529
1616648200.86 0.200476761204 0.265807520379 0.18985183537 0.340855240822 -7.78335940841 0.124262218382
1616648200.91 0.187143426985 0.245807528387 0.18985183537 0.340855240822 -7.78335940841 0.124262218382
1616648200.96 0.185001379821 0.235807563734 0.182549834251 0.312237083912 -7.78633758858 0.10581040113
1616648201.01 0.174117638849 0.215807685631 0.182549834251 0.312237083912 -7.78633758858 0.10581040113
1616648201.06 0.173732191999 0.205807778262 0.174639344215 0.282337486744 -7.79337768711 0.0880916514514
1616648201.11 0.160398858735 0.1858077923 0.174639344215 0.282337486744 -7.79337768711 0.0880916514514
1616648201.16 0.153732195254 0.175807848517 0.174639344215 0.253719329834 -7.79411171757 0.0710312922815
1616648201.21 0.14039886095 0.155807853912 0.174639344215 0.253719329834 -7.79411171757 0.0710312922815
1616648201.26 0.133732195741 0.145807906086 0.159426853061 0.225101158023 -7.79639362553 0.0547367827799
1616648201.31 0.120398864748 0.125807986742 0.159426853061 0.225101158023 -7.79639362553 0.0547367827799
1616648201.36 0.117327381159 0.11580798653 0.152124866843 0.197764381766 -7.79853111716 0.039477914165
1616648201.41 0.103994065776 0.0958085891834 0.152124866843 0.197764381766 -7.79853111716 0.039477914165
1616648201.46 0.100298353748 0.0858085899266 0.129001885653 0.170854762197 -7.80200360702 0.0128403901762
1616648201.51 0.0869650230809 0.0658087139928 0.129001885653 0.170854762197 -7.80200360702 0.0128403901762
1616648201.56 0.0736316962234 0.0458090274661 0.121699891984 0.143945142627 -7.80350074164 0.000931421129861
1616648201.61 0.0669650321186 0.0358091497509 0.121699891984 0.143945142627 -7.80350074164 0.000931421129861
1616648201.66 0.0602983671881 0.0258092800267 0.10648740083 0.117035515606 -7.80488695005 -0.0102038415477
1616648201.71 0.0469650379656 0.0058095853122 0.10648740083 0.117035515606 -7.80488695005 -0.0102038415477
1616648201.76 0.0336317114443 -0.0141894115617 0.10648740083 0.090125888586 -7.80489206314 -0.0102449161932
1616648201.81 0.0269650441117 -0.0241894121528 0.0912749171257 0.0627891272306 -7.80489206314 -0.0102449161932
1616648201.86 0.0136317279686 -0.0441873840114 0.0912749171257 0.0627891272306 -7.80597802672 -0.0191002328605
1616648201.91 0.00696506601843 -0.0541853012529 0.0760624334216 0.0367337763309 -7.80597802672 -0.0191002328605
1616648201.96 0.00029843859719 -0.0553864472362 0.0760624334216 0.0367337763309 -7.80696659127 -0.0272878644083
1616648202.01 -0.0130348365168 -0.0354040576181 0.0608499459922 0.0106784226373 -7.80696659127 -0.0272878644083
1616648202.06 -0.0263681647751 -0.0154046272346 0.0608499459922 0.0106784226373 -7.80767645965 -0.0332868051628
1616648202.11 -0.0330348297142 -0.0128770154492 0.0456374585629 -0.00341709540226 -7.80767645965 -0.0332868051628
1616648202.16 -0.0461290515471 -0.0196663409433 0.0456374585629 -0.00341709540226 -7.80811542295 -0.0418644812929
1616648202.21 -0.0527957187932 -0.0263595948186 0.0225144792348 -0.0106784226373 -7.80811542295 -0.0418644812929
1616648202.26 -0.0661290380463 -0.0365040978547 0.0225144792348 -0.0106784226373 -7.80838019948 -0.0441321751132
1616648202.31 -0.0727955935786 -0.0457806631592 -0.00730199320242 -0.0149497920647 -7.80838019948 -0.0441321751132
1616648202.36 -0.0861289138408 -0.0561986027424 -0.00730199320242 -0.0149497920647 -7.80829382201 -0.0454229093172
1616648202.41 -0.0927955811022 -0.0611225511585 -0.0152124864981 -0.0200754348189 -7.80829382201 -0.0454229093172
1616648202.46 -0.10530457306 -0.075819530671 -0.0152124864981 -0.0200754348189 -7.80811883355 -0.0547410924372
1616648202.51 -0.11197122954 -0.0801123835849 -0.0304249729961 -0.0269096251577 -7.80811883355 -0.0547410924372
1616648202.56 -0.125304548372 -0.0907913984265 -0.0304249729961 -0.0269096251577 -7.80776993779 -0.0518110287636
1616648202.61 -0.131965371281 -0.0976961970339 -0.0456374585629 -0.0371609143913 -7.80776993779 -0.0518110287636
1616648202.66 -0.145298690916 -0.109552471892 -0.0456374585629 -0.0371609143913 -7.80715934621 -0.046628101608
1616648202.71 -0.151965343528 -0.11285373002 -0.0529394522309 -0.0499750189483 -7.80715934621 -0.046628101608
1616648202.76 -0.165298662812 -0.124217885972 -0.0529394522309 -0.0499750189483 -7.80646108491 -0.0406951444023
1616648202.81 -0.171965307564 -0.129860644766 -0.0760624334216 -0.0649248063564 -7.80646108491 -0.0406951444023
1616648202.86 -0.185298623354 -0.142707758915 -0.0760624334216 -0.0649248063564 -7.80549963428 -0.0325064318561
1616648202.91 -0.191965275896 -0.145320732531 -0.0833644270897 -0.0807288736105 -7.80549963428 -0.0325064318561
1616648202.96 -0.198568658998 -0.157836568766 -0.10648740083 -0.0978143513203 -7.80437436396 -0.038490960419
1616648203.01 -0.205235268329 -0.163695993045 -0.10648740083 -0.0978143513203 -7.80437436396 -0.038490960419
1616648203.06 -0.211901921235 -0.165750898237 -0.129001885653 -0.114899836481 -7.80307487976 -0.0310365779632
1616648203.11 -0.225544574627 -0.179931899676 -0.129001885653 -0.114899836481 -7.80307487976 -0.0310365779632
1616648203.16 -0.219245701251 -0.189931899941 -0.152124866843 -0.132412448525 -7.80145184575 -0.0181348935391
1616648203.21 -0.232579014892 -0.19883664498 -0.152124866843 -0.132412448525 -7.80145184575 -0.0181348935391
1616648203.26 -0.231351201864 -0.208836620274 -0.174639344215 -0.15077932179 -7.79967229894 -0.00254763865496
1616648203.32 -0.23801782467 -0.210398074258 -0.174639344215 -0.15077932179 -7.79967229894 -0.00254763865496
1616648203.37 -0.231351414457 -0.222535319454 -0.174639344215 -0.169146209955 -7.79810789717 -0.00455723859341
1616648203.42 -0.218018152849 -0.232535315629 -0.174639344215 -0.169146209955 -7.79810789717 -0.00455723859341
1616648203.47 -0.23135146712 -0.240931769147 -0.18985183537 -0.186231702566 -7.79810142517 -0.00456589832902
1616648203.52 -0.238018115726 -0.242640406656 -0.18985183537 -0.186231702566 -7.79810142517 -0.00456589832902
1616648203.57 -0.251350656728 -0.259073773126 -0.21297480166 -0.204171448946 -7.79653126598 0.0154418531383
1616648203.62 -0.264683917057 -0.26299228779 -0.21297480166 -0.204171448946 -7.79653126598 0.0154418531383
1616648203.67 -0.271350583299 -0.252992290328 -0.220276802778 -0.222538337111 -7.79679010979 0.0369203690082
1616648203.72 -0.278017230681 -0.242992347462 -0.220276802778 -0.222538337111 -7.79679010979 0.0369203690082
1616648203.77 -0.271350507356 -0.24893474241 -0.228187292814 -0.236633852124 -7.7943611351 0.0592536831008
1616648203.82 -0.284683660098 -0.258540247475 -0.228187292814 -0.236633852124 -7.7943611351 0.0592536831008
1616648203.87 -0.271371346073 -0.268538607771 -0.235489279032 -0.244322314858 -7.79120845981 0.0992027652113
1616648203.92 -0.284704641621 -0.273287006541 -0.235489279032 -0.244322314858 -7.79120845981 0.0992027652113
1616648203.97 -0.291371268768 -0.263287066401 -0.250701785088 -0.251583635807 -7.79053459089 0.124521000137
1616648204.02 -0.304704520385 -0.245448137763 -0.250701785088 -0.251583635807 -7.79053459089 0.124521000137
1616648204.07 -0.311371166766 -0.242218726742 -0.258612275124 -0.258844971657 -7.78839927221 0.14942188749
1616648204.12 -0.32470446395 -0.243668599655 -0.258612275124 -0.258844971657 -7.78839927221 0.14942188749
1616648204.17 -0.331371130833 -0.233668599331 -0.265914261341 -0.261407792568 -7.78600638764 0.197266807138
1616648204.22 -0.344704401872 -0.213668719006 -0.265914261341 -0.261407792568 -7.78600638764 0.197266807138
1616648204.27 -0.351370894563 -0.211131691141 -0.281126767397 -0.261834919453 -7.78599739075 0.197447106242
1616648204.32 -0.358037531279 -0.211874343128 -0.281126767397 -0.261834919453 -7.78599739075 0.197447106242
1616648204.37 -0.369356098614 -0.210869202642 -0.281126767397 -0.258417844772 -7.78597413706 0.197733222906
1616648204.42 -0.369356099789 -0.210869201621 -0.281126767397 -0.258417844772 -7.78597413706 0.197733222906
1616648204.47 -0.373128583018 -0.200869206635 -0.29633924365 -0.250729352236 -7.7836240946 0.251918991866
1616648204.52 -0.37770671344 -0.190869258312 -0.29633924365 -0.250729352236 -7.7836240946 0.251918991866
1616648204.57 -0.365996793314 -0.177934245133 -0.311551719904 -0.242186620831 -7.78128265366 0.284696852401
1616648204.62 -0.365996887405 -0.17793414296 -0.311551719904 -0.242186620831 -7.78128265366 0.284696852401
1616648204.67 -0.365996887405 -0.17793414296 -0.334674715996 -0.22809112072 -7.77932871343 0.340308834638
1616648204.72 -0.372663544599 -0.167934146683 -0.334674715996 -0.22809112072 -7.77932871343 0.340308834638
1616648204.77 0.0 0.0 -0.341976702213 -0.213141337037 -7.77754140684 0.375473905916
1616648204.82 0.0 0.0 -0.341976702213 -0.213141337037 -7.77754140684 0.375473905916
1616648204.87 0.0 0.0 -0.341976702213 -0.170854762197 -7.77595135217 0.410438713366
1616648204.92 0.0 0.0 -0.341976702213 -0.170854762197 -7.77595135217 0.410438713366
1616648204.97 0.0 0.0 -0.357189178467 -0.0948243960738 -7.77436633529 0.395533464514
1616648205.02 0.0 0.0 -0.31946220994 -0.0948243960738 -7.77436633529 0.395533464514
1616648205.07 0.0 0.0 -0.31946220994 -0.0465579256415 -7.77527293545 0.426677675007
1616648205.12 0.0 0.0 -0.311551719904 -0.0217839833349 -7.77527293545 0.426677675007
1616648205.17 0.0 0.0 -0.311551719904 -0.0217839833349 -7.77454220836 0.491258953576
1616648205.22 0.0 0.0 -0.250701785088 -0.00896987505257 -7.77454220836 0.491258953576
1616648205.27 0.0 0.0 -0.250701785088 -0.00896987505257 -7.773974978 0.511836931828
1616648205.32 0.0 0.0 -0.18985183537 -0.00213568471372 -7.773974978 0.511836931828
1616648205.37 0.0 0.0 -0.18985183537 -0.00213568471372 -7.77362305161 0.524472682492
1616648205.42 0.0 0.0 -0.129001885653 0.000854273850564 -7.77362305161 0.524472682492
1616648205.47 0.0 0.0 -0.129001885653 0.000854273850564 -7.77342988486 0.532808216483
1616648205.52 0.0 0.0 -0.0760624334216 0.00170854770113 -7.77342988486 0.532808216483
1616648205.57 0.0 0.0 -0.0760624334216 0.00170854770113 -7.77330809099 0.575825649316
1616648205.62 0.0 0.0 -0.0760624334216 0.00170854770113 -7.77330809099 0.575825649316
1616648205.67 0.0 0.0 -0.0760624334216 0.00170854770113 -7.77330780029 0.575929045677
1616648205.72 0.0 0.0 -0.0304249729961 0.00213568471372 -7.77330780029 0.575929045677
1616648205.77 0.0 0.0 -0.0304249729961 0.00213568471372 -7.77323681005 0.578896142097
1616648205.82 0.0 0.0 -0.00730199320242 0.00213568471372 -7.77323681005 0.578896142097
1616648205.87 0.0 0.0 -0.00730199320242 0.00213568471372 -7.77316550241 0.581896356689
1616648205.92 0.0 0.0 0.0 0.00213568471372 -7.77316550241 0.581896356689
1616648205.97 0.0 0.0 0.0 0.00213568471372 -7.77316522598 0.581907987595
1616648206.03 0.0 0.0 0.0 0.00213568471372 -7.77316522598 0.581907987595
1616648206.08 0.0 0.0 0.0 0.00213568471372 -7.77316522598 0.581907987595
1616648206.13 0.0 0.0 0.0 0.00213568471372 -7.77316522598 0.581907987595
1616648206.18 0.0 0.0 0.0 0.00170854770113 -7.77316522598 0.581907987595
1616648206.23 0.0 0.0 0.0 0.00170854770113 -7.77316522598 0.581907987595
1616648206.28 0.0 0.0 0.0 0.00128141080495 -7.77316522598 0.581907987595
1616648206.33 0.0 0.0 0.0 0.00128141080495 -7.77316522598 0.581907987595
1616648206.38 0.0 0.0 0.0 0.00128141080495 -7.77316522598 0.581907987595
1616648206.43 0.0 0.0 0.0 0.00128141080495 -7.77316522598 0.581907987595
1616648206.48 0.0 0.0 0.0 0.00128141080495 -7.77316522598 0.581907987595
1616648206.53 0.0 0.0 0.0 0.00128141080495 -7.77316522598 0.581907987595
1616648206.58 0.0 0.0 0.0 0.00128141080495 -7.77316522598 0.581907987595
1616648206.63 0.0 0.0 0.0 0.00128141080495 -7.77316522598 0.581907987595
1616648206.68 0.0 0.0 0.0 0.00128141080495 -7.77316522598 0.581907987595
1616648206.73 0.0 0.0 0.0 0.00128141080495 -7.77316522598 0.581907987595
1616648206.78 0.0 0.0 0.0 0.00128141080495 -7.77316522598 0.581907987595
1616648206.83 0.0 0.0 0.0 0.00128141080495 -7.77316522598 0.581907987595
1616648206.88 0.0 0.0 0.0 0.00128141080495 -7.77316522598 0.581907987595
1616648206.93 0.0 0.0 0.0 0.00128141080495 -7.77316522598 0.581907987595
1616648206.98 0.0 0.0 0.0 0.00128141080495 -7.77316522598 0.581907987595
1616648207.03 0.0 0.0 0.0 0.00128141080495 -7.77316522598 0.581907987595
1616648207.08 0.0 0.0 0.0 0.00128141080495 -7.77316522598 0.581907987595
1616648207.13 0.0 0.0 0.0 0.00128141080495 -7.77316522598 0.581907987595
1616648207.18 0.0 0.0 0.0 0.00128141080495 -7.77316522598 0.581907987595
1616648207.23 0.0 0.0 0.0 0.00128141080495 -7.77316522598 0.581907987595
1616648207.28 0.0 0.0 0.0 0.000854273850564 -7.77316522598 0.581907987595
1616648207.33 0.0 0.0 0.0 0.000854273850564 -7.77316522598 0.581907987595
1616648207.38 0.0 0.0 0.0 0.000854273850564 -7.77316522598 0.581907987595
1616648207.43 0.0 0.0 0.0 0.000427136925282 -7.77316522598 0.581907987595
1616648207.48 0.0 0.0 0.0 0.000427136925282 -7.77316522598 0.581907987595
1616648207.53 0.0 0.0 0.0 0.000427136925282 -7.77316522598 0.581907987595
1616648207.58 0.0 0.0 0.0 -0.000427136925282 -7.77316522598 0.581907987595
1616648207.63 0.0 0.0 0.0 -0.000427136925282 -7.77316522598 0.581907987595
1616648207.68 0.0 0.0 0.0 -0.00128141080495 -7.77316522598 0.581907987595
1616648207.73 0.0 0.0 0.0 -0.00128141080495 -7.77316522598 0.581907987595
1616648207.78 0.0 0.0 0.0 -0.00128141080495 -7.77316522598 0.581907987595
