210325_101702
x		y
-7.93799448013 -11.2862377167
-7.93802261353 -11.0862379074
-7.93805074692 -10.8862380981
-7.93807888031 -10.6862382889
-7.9381070137 -10.4862384796
-7.93813514709 -10.2862386703
-7.93816328049 -10.0862388611
-7.93819141388 -9.88623905182
-7.93157911301 -9.50302219391
-7.91164016724 -9.3040189743
-7.87848854065 -9.10678577423
-7.83227157593 -8.91219902039
-7.77319431305 -8.72112369537
-7.70151948929 -8.53440856934
-7.61756515503 -8.35288238525
-7.52170467377 -8.17735290527
-7.41436386108 -8.00859928131
-7.29601955414 -7.84737110138
-7.16719722748 -7.69438457489
-7.02846956253 -7.55031967163
-6.88045310974 -7.41581630707
-6.72380495071 -7.291472435
-6.5592212677 -7.17784023285
-6.3874335289 -7.07542467117
-6.20920467377 -6.98468065262
-6.02532672882 -6.90601110458
-5.83661651611 -6.83976602554
-5.64391231537 -6.78623914719
-5.44807052612 -6.74566888809
-5.24996089935 -6.71823501587
-5.05046367645 -6.70405960083
-5.12292385101 -6.70151090622
-5.32292127609 -6.70049142838
-5.52291870117 -6.69947195053
-5.72291612625 -6.69845247269
-5.92291355133 -6.69743299484
-6.12291097641 -6.696413517
-6.32290840149 -6.69539403915
-6.52290582657 -6.69437456131
-6.72290325165 -6.69335508347
-6.86314582825 -6.69264221191
