210325_115337
time	cmd_vx	cmd_phi	fb_vx	fb_phi	odom_x	odom_y
1616648022.68 -0.069218718228 -0.048410298249 0.0 -0.00341709540226 -7.88023996353 0.618764579296
1616648022.73 -0.0425520541149 -0.0503318569624 0.0 -0.00341709540226 -7.88023996353 0.618764579296
1616648022.78 -0.0158853900189 -0.0507002819371 0.0 -0.00384423229843 -7.88023996353 0.618764579296
1616648022.83 -0.00255207473668 -0.0501075533865 0.0 -0.00384423229843 -7.88023996353 0.618764579296
1616648022.88 0.024114548704 -0.0479856429195 0.0 -0.00896987505257 -7.88023996353 0.618764579296
1616648022.93 0.0507810885283 -0.0385178878727 0.0 -0.00896987505257 -7.88023996353 0.618764579296
1616648022.98 0.0641143794297 -0.0376778131745 0.0 -0.0153769291937 -7.88023996353 0.618764579296
1616648023.03 0.0774477130139 -0.0347567334968 0.0 -0.0153769291937 -7.88023996353 0.618764579296
1616648023.08 0.104114359147 -0.0305131923496 0.0 -0.0205025728792 -7.88023996353 0.618764579296
1616648023.13 0.117446294042 -0.0272085768031 0.0 -0.0205025728792 -7.88023996353 0.618764579296
1616648023.19 0.144112949211 -0.023934232644 0.0 -0.0234925299883 -7.88023996353 0.618764579296
1616648023.24 0.157446247437 -0.023041326151 0.0 -0.0234925299883 -7.88023996353 0.618764579296
1616648023.29 0.184112906441 -0.0172173159747 0.00730199320242 -0.0260553527623 -7.8802309205 0.618018469508
1616648023.34 0.210779537861 -0.0120698266654 0.00730199320242 -0.0260553527623 -7.8802309205 0.618018469508
1616648023.39 0.224112860929 -0.0113899838759 0.00730199320242 -0.027336763218 -7.88022186354 0.617271210938
1616648023.44 0.250779494161 -0.00995363893703 0.00730199320242 -0.027336763218 -7.88022186354 0.617271210938
1616648023.49 0.264112812392 -0.00907087819126 0.0152124864981 -0.0281910356134 -7.88020430869 0.615783659228
1616648023.54 0.27744610751 -0.00674712331912 0.0152124864981 -0.0281910356134 -7.88020430869 0.615783659228
1616648023.59 0.304112718064 -0.00542009362567 0.0304249729961 -0.0281910356134 -7.88018657936 0.614281278229
1616648023.64 0.330779320642 -0.0044691374303 0.0304249729961 -0.0281910356134 -7.88018657936 0.614281278229
1616648023.69 0.34411264114 -0.00343347097287 0.0456374585629 -0.0286181736737 -7.88015137757 0.611298343205
1616648023.74 0.370777668952 -0.00266240986648 0.0456374585629 -0.0286181736737 -7.88015137757 0.611298343205
1616648023.79 0.384109848704 -0.00212617698484 0.0608499459922 -0.0286181736737 -7.88009888274 0.606809639139
1616648023.84 0.410776488236 -0.00136223218201 0.0608499459922 -0.0286181736737 -7.88009888274 0.606809639139
1616648023.89 0.424108064872 -0.00103805566613 0.0833644270897 -0.0294724479318 -7.88002976665 0.600942894817
1616648023.94 0.450774664186 0.000438864733404 0.0833644270897 -0.0294724479318 -7.88002976665 0.600942894817
1616648023.99 0.464107909298 0.000556507877324 0.10648740083 -0.0290453098714 -7.8799262043 0.595967458605
1616648024.04 0.490774352485 0.000889430304647 0.10648740083 -0.0290453098714 -7.87979890957 0.584775491596
1616648024.09 0.50410768095 0.00129084224135 0.136912375689 -0.0290453098714 -7.87979890957 0.584775491596
1616648024.14 0.530774345945 0.00174404554682 0.136912375689 -0.0290453098714 -7.87964533495 0.590443754159
1616648024.19 0.544107651289 0.001842429033 0.136912375689 -0.0290453098714 -7.87964533495 0.590443754159
1616648024.24 0.570773157471 0.00163032868661 0.182549834251 -0.0277639012784 -7.8792510582 0.554714510108
1616648024.29 0.584101486917 0.00257014963486 0.182549834251 -0.0277639012784 -7.8792510582 0.554714510108
1616648024.34 0.59999973298 0.00305838161102 0.220276802778 -0.024346806109 -7.87900256198 0.537559623669
1616648024.39 0.599999943641 0.00304368017956 0.220276802778 -0.024346806109 -7.87900256198 0.537559623669
1616648024.44 0.599999943684 0.00309257914044 0.220276802778 -0.0213568452746 -7.87900161743 0.537494540215
1616648024.49 0.599999943603 0.0031921582254 0.220276802778 -0.0213568452746 -7.87900161743 0.537494540215
1616648024.54 0.599999943604 0.00323915669056 0.235489279032 -0.0183668881655 -7.8787396883 0.512901843234
1616648024.59 0.599999942222 0.00347183987638 0.235489279032 -0.0183668881655 -7.8787396883 0.512901843234
1616648024.64 0.599999954338 0.00472357715552 0.258612275124 -0.0153769291937 -7.87845394648 0.514010043378
1616648024.69 0.599999991236 0.00457353489257 0.258612275124 -0.0153769291937 -7.87845394648 0.514010043378
1616648024.74 0.599999813802 0.00491330860793 0.281126767397 -0.012814107351 -7.87816445554 0.472961357421
1616648024.79 0.599999645106 0.0071807536799 0.281126767397 -0.012814107351 -7.87816445554 0.472961357421
1616648024.84 0.59999991103 0.00774932317749 0.311551719904 -0.0102512864396 -7.87786216023 0.441523615944
1616648024.89 0.599999996744 0.00828347162036 0.311551719904 -0.0102512864396 -7.87786216023 0.441523615944
1616648024.94 0.59999993309 0.010320244695 0.32676422596 -0.00854273885489 -7.87753959631 0.424578105876
1616648024.99 0.599999664301 0.010833963798 0.32676422596 -0.00854273885489 -7.87753959631 0.424578105876
1616648025.04 0.6 0.0124705291742 0.357189178467 -0.0064070536755 -7.87721336206 0.388817257717
1616648025.09 0.599997829187 0.0123652879524 0.357189178467 -0.0064070536755 -7.87721336206 0.388817257717
1616648025.14 0.599999975935 0.012910110065 0.37240165472 -0.00427136942744 -7.8768653526 0.349850283579
1616648025.19 0.599999959797 0.0127400958344 0.37240165472 -0.00427136942744 -7.8768653526 0.349850283579
1616648025.24 0.599999784409 0.0157812874956 0.40282663703 -0.00213568471372 -7.87650467827 0.308877429684
1616648025.29 0.599994091634 0.0151551413005 0.418039113283 -0.000427136925282 -7.87650467827 0.308877429684
1616648025.34 0.599999951496 0.0176286167315 0.418039113283 -0.000427136925282 -7.87612539582 0.265498540664
1616648025.39 0.599999905504 0.018412396591 0.441162109375 0.00170854770113 -7.87612539582 0.265498540664
1616648025.44 0.599999902464 0.0188934358046 0.441162109375 0.00170854770113 -7.87572714529 0.247426086145
1616648025.49 0.59999877287 0.019095631953 0.456374585629 0.00384423229843 -7.87572714529 0.247426086145
1616648025.54 0.599999477796 0.0186836426448 0.456374585629 0.00384423229843 -7.87531186078 0.159972966643
1616648025.59 0.590150967503 0.020214128285 0.486799567938 0.00555277988315 -7.87531186078 0.159972966643
1616648025.64 0.599999946174 0.0230248816105 0.486799567938 0.00555277988315 -7.87486460843 0.110001113808
1616648025.69 0.599999796932 0.0197112649804 0.502012014389 0.00726132746786 -7.87486460843 0.110001113808
1616648025.74 0.599999867136 0.0214032739642 0.502012014389 0.00726132746786 -7.87440260469 0.0754288627539
1616648025.79 0.59999999223 0.022433158817 0.524526536465 0.00896987505257 -7.87440260469 0.0754288627539
1616648025.84 0.599999819368 0.0228051938553 0.524526536465 0.00896987505257 -7.87390694591 0.0217551738785
1616648025.89 0.599999171422 0.0212057052772 0.554951488972 0.0102512864396 -7.87390694591 0.0217551738785
1616648025.94 0.599999078515 0.0214790631723 0.554951488972 0.0102512864396 -7.87340226793 0.0149104873984
1616648025.99 0.599999549697 0.0213507029043 0.562862038612 0.0111055597663 -7.87340226793 0.0149104873984
1616648026.04 0.599999965013 0.0214931088943 0.562862038612 0.0111055597663 -7.8731640913 -0.107895318296
1616648026.09 0.586666667582 0.0210559633817 0.562862038612 0.0111055597663 -7.8731640913 -0.107895318296
1616648026.14 0.599999923278 0.0197729230807 0.585376441479 0.0119598340243 -7.87256536259 -0.168644725779
1616648026.19 0.59999922962 0.0183528089699 0.585376441479 0.0119598340243 -7.87256536259 -0.168644725779
1616648026.24 0.59999992759 0.0219216738738 0.608499467373 0.0119598340243 -7.87194971906 -0.19201153489
1616648026.29 0.599998507511 0.0204162925507 0.608499467373 0.0119598340243 -7.87194971906 -0.19201153489
1616648026.34 0.59999881388 0.0211288304167 0.623711943626 0.0119598340243 -7.87129202576 -0.254658918893
1616648026.39 0.599999694137 0.0164621403972 0.623711943626 0.0119598340243 -7.87129202576 -0.254658918893
1616648026.44 0.599999942398 0.0192015426024 0.623711943626 0.0119598340243 -7.87128973007 -0.254877984524
1616648026.49 0.599999813529 0.0212589661896 0.631013929844 0.0119598340243 -7.87128973007 -0.254877984524
1616648026.54 0.599996114119 0.0211081438925 0.631013929844 0.0119598340243 -7.87059635349 -0.325244456628
1616648026.59 0.593629876778 0.0156370144878 0.63892441988 0.0119598340243 -7.87059635349 -0.325244456628
1616648026.64 0.599999976908 0.0173544609501 0.63892441988 0.0119598340243 -7.86987382675 -0.402999634041
1616648026.69 0.599730430695 0.0154042128264 0.63892441988 0.0119598340243 -7.86987382675 -0.402999634041
1616648026.74 0.599998996293 0.0154913407569 0.63892441988 0.0119598340243 -7.86831470884 -0.500969318576
1616648026.8 0.58666569208 0.0124147333368 0.63892441988 0.0119598340243 -7.86831470884 -0.500969318576
1616648026.85 0.599999963782 0.00613142278788 0.63892441988 0.0119598340243 -7.86748260134 -0.564789366741
1616648026.9 0.599999919779 0.00421655374152 0.63892441988 0.0115326968953 -7.86748260134 -0.564789366741
1616648026.95 0.599999915206 0.00400744267357 0.63892441988 0.0115326968953 -7.86748123169 -0.564894556999
1616648027.0 0.599999918986 0.00442262472318 0.631013929844 0.00811560079455 -7.86748123169 -0.564894556999
1616648027.05 0.599999582855 0.00450268421392 0.631013929844 0.00811560079455 -7.8666504923 -0.642145057873
1616648027.1 0.58913445442 0.0054526557546 0.63892441988 0.0051256432198 -7.8666504923 -0.642145057873
1616648027.15 0.599999975842 0.00465991608647 0.63892441988 0.0051256432198 -7.86580258521 -0.71742069291
1616648027.2 0.599999870975 0.000965574958966 0.631013929844 0.0025628216099 -7.86580258521 -0.71742069291
1616648027.25 0.599999922995 0.000744853993153 0.631013929844 0.0025628216099 -7.86493601126 -0.780899917726
1616648027.3 0.6 -0.000216425887754 0.63892441988 0.000854273850564 -7.86493601126 -0.780899917726
1616648027.35 0.599999192251 -0.000477997355184 0.63892441988 0.000854273850564 -7.86408049331 -0.809839371393
1616648027.4 0.599999999515 -0.00176530684961 0.631013929844 -0.000427136925282 -7.86408049331 -0.809839371393
1616648027.45 0.59999867344 -0.00249859653068 0.631013929844 -0.000427136925282 -7.86320648088 -0.873837747781
1616648027.5 0.59999861241 -0.00366884197043 0.631013929844 -0.00298995850608 -7.86320648088 -0.873837747781
1616648027.55 0.599999771132 -0.00453613009382 0.631013929844 -0.00298995850608 -7.86720591058 -0.960538310509
1616648027.6 0.586678649908 0.00545910466195 0.631013929844 -0.00555277988315 -7.86720591058 -0.960538310509
1616648027.65 0.599999522908 0.0179039274153 0.631013929844 -0.00555277988315 -7.86634578349 -1.03718363229
1616648027.7 0.587649594155 0.0279006888865 0.63892441988 -0.00768846459687 -7.86634578349 -1.03718363229
1616648027.75 0.599999874723 0.0346245451394 0.63892441988 -0.00768846459687 -7.86550519537 -1.10078164273
1616648027.8 0.599999517274 0.0444785381093 0.631013929844 -0.00597991701216 -7.86550519537 -1.10078164273
1616648027.85 0.599999902997 0.0415305216025 0.631013929844 -0.00597991701216 -7.86468843464 -1.13253065234
1616648027.9 0.599999630544 0.0409625665235 0.623711943626 0.0025628216099 -7.86468843464 -1.13253065234
1616648027.95 0.599998227463 0.0415584783674 0.623711943626 0.0025628216099 -7.86387632235 -1.19536176091
1616648028.0 0.599999589141 0.0377717706485 0.623711943626 0.0111055597663 -7.86387632235 -1.19536176091
1616648028.05 0.6 0.0477612610492 0.623711943626 0.0111055597663 -7.86306507747 -1.25798020059
1616648028.1 0.599997131077 0.0394846979359 0.623711943626 0.0175126139075 -7.86306507747 -1.25798020059
1616648028.15 0.6 0.0494838960127 0.623711943626 0.0175126139075 -7.86222091037 -1.3495659985
1616648028.2 0.592262538001 0.0557622764835 0.61580145359 0.0230653937906 -7.86222091037 -1.3495659985
1616648028.25 0.59999971751 0.0443754528765 0.61580145359 0.0230653937906 -7.86133310411 -1.41185343051
1616648028.3 0.599999940642 0.0359744079242 0.623711943626 0.0286181736737 -7.86133310411 -1.41185343051
1616648028.35 0.599999803724 0.0346143774161 0.623711943626 0.0286181736737 -7.86036937891 -1.4457492527
1616648028.4 0.599999848698 0.0235005326636 0.623711943626 0.0311809964478 -7.86036937891 -1.4457492527
1616648028.45 0.599999778238 0.0219922582107 0.623711943626 0.0311809964478 -7.85941135972 -1.5078608867
1616648028.5 0.599999880475 0.0116732376567 0.623711943626 0.0311809964478 -7.85941135972 -1.5078608867
1616648028.55 0.599999863315 0.0117379583223 0.61580145359 0.0307538583875 -7.85843088482 -1.5779402257
1616648028.6 0.599999958729 0.00750256101301 0.61580145359 0.0307538583875 -7.85843088482 -1.5779402257
1616648028.65 0.59999998249 0.00810254366485 0.623711943626 0.0260553527623 -7.85734731391 -1.65850883205
1616648028.7 0.59999942511 0.00199736673128 0.61580145359 0.0187940243632 -7.85734731391 -1.65850883205
1616648028.75 0.599999926807 0.00140693938735 0.61580145359 0.0187940243632 -7.85618831535 -1.72088149155
1616648028.8 0.59999977812 -0.00878783619825 0.61580145359 0.0115326968953 -7.85618831535 -1.72088149155
1616648028.85 0.599999845963 -0.010755740014 0.623711943626 0.0115326968953 -7.85829420525 -1.75789117453
1616648028.9 0.599999962596 -0.007612970724 0.61580145359 0.00298995850608 -7.85829420525 -1.75789117453
1616648028.95 0.599999870143 0.00263692526127 0.61580145359 0.00298995850608 -7.85709349022 -1.81975477808
1616648029.0 0.599999930192 -0.000359679181141 0.623711943626 -0.0025628216099 -7.85709349022 -1.81975477808
1616648029.05 0.599999930106 0.000373505732429 0.623711943626 -0.0025628216099 -7.85586151392 -1.89110925641
1616648029.1 0.599996487291 -0.00500433884596 0.608499467373 -0.00469850609079 -7.85586151392 -1.89110925641
1616648029.15 0.599999946735 -0.00558027559526 0.608499467373 -0.00469850609079 -7.85460637965 -1.96099917218
1616648029.2 0.599999841775 -0.00701632027219 0.61580145359 -0.00726132746786 -7.85460637965 -1.96099917218
1616648029.25 0.59999985483 -0.00713863457149 0.61580145359 -0.00726132746786 -7.85337583683 -2.02237962372
1616648029.3 0.599999868955 -0.00809797675223 0.61580145359 -0.00939701218158 -7.85337583683 -2.02237962372
1616648029.35 0.599999842399 -0.0097497859746 0.61580145359 -0.00939701218158 -7.85205288288 -2.0612136309
1616648029.4 0.599999194446 -0.0171956914234 0.608499467373 -0.0115326968953 -7.85205288288 -2.0612136309
1616648029.46 0.59999999848 -0.0211950523579 0.608499467373 -0.0115326968953 -7.85076034869 -2.12309221215
1616648029.51 0.599999760004 -0.0272174712284 0.61580145359 -0.0145226549357 -7.85076034869 -2.12309221215
1616648029.56 0.599999011974 -0.0290091935633 0.61580145359 -0.0145226549357 -7.84949974746 -2.18516047954
1616648029.61 0.6 -0.0274598629518 0.61580145359 -0.0200754348189 -7.84949974746 -2.18516047954
1616648029.66 0.599999993423 -0.0313084582868 0.61580145359 -0.0200754348189 -7.84825715618 -2.26098379394
1616648029.71 0.599999733768 -0.0258908899915 0.61580145359 -0.0252010785043 -7.84825715618 -2.26098379394
1616648029.76 0.6 -0.0298843510422 0.608499467373 -0.0290453098714 -7.8470869843 -2.32249133134
1616648029.81 0.599999762516 -0.0246635562174 0.608499467373 -0.0290453098714 -7.8470869843 -2.32249133134
1616648029.86 0.599999583522 -0.0261347403057 0.61580145359 -0.0320352688432 -7.84588712513 -2.36047025107
1616648029.91 0.599997971238 -0.0299113719351 0.61580145359 -0.0320352688432 -7.84588712513 -2.36047025107
1616648029.96 0.599999744151 -0.0310693777944 0.61580145359 -0.0333166792989 -7.84470485161 -2.42163413258
1616648030.01 0.599999936739 -0.0316809504805 0.61580145359 -0.0333166792989 -7.84470485161 -2.42163413258
1616648030.06 0.599999587857 -0.0389704976105 0.608499467373 -0.03545236215 -7.84470129013 -2.4218184948
1616648030.11 0.599999902593 -0.0399093351295 0.608499467373 -0.03545236215 -7.84470129013 -2.4218184948
1616648030.16 0.599999906685 -0.0402069005228 0.608499467373 -0.0380151830614 -7.84361442653 -2.48432861029
1616648030.21 0.599998364366 -0.0312214248699 0.608499467373 -0.0380151830614 -7.84361442653 -2.48432861029
1616648030.26 0.599999905262 -0.0324174300246 0.61580145359 -0.0410051457584 -7.84174142453 -2.62651715117
1616648030.31 0.599999942354 -0.0241731754723 0.61580145359 -0.0410051457584 -7.84174142453 -2.62651715117
1616648030.36 0.6 -0.0176179581208 0.608499467373 -0.0418594181538 -7.84085372246 -2.65611754048
1616648030.41 0.599999200817 -0.0176001608364 0.608499467373 -0.0418594181538 -7.84085372246 -2.65611754048
1616648030.46 0.599999926392 -0.0174026193419 0.61580145359 -0.0418594181538 -7.84085178375 -2.65618157387
1616648030.51 0.599999917468 -0.0171349679363 0.61580145359 -0.0418594181538 -7.84085178375 -2.65618157387
1616648030.56 0.599999908498 -0.0173307810276 0.608499467373 -0.0410051457584 -7.84008090269 -2.71731348806
1616648030.61 0.599999874823 -0.00708165362405 0.608499467373 -0.0410051457584 -7.84008090269 -2.71731348806
1616648030.66 0.599999968566 -0.00155297551878 0.61580145359 -0.0380151830614 -7.83942742486 -2.7901682737
1616648030.71 0.599999963273 0.00260072331279 0.61580145359 -0.0380151830614 -7.83942742486 -2.7901682737
1616648030.76 0.599999995251 0.00667866911307 0.608499467373 -0.0311809964478 -7.83854711395 -2.998574278
1616648030.81 0.58666666676 0.016658548685 0.608499467373 -0.0311809964478 -7.83854711395 -2.998574278
1616648030.86 0.573644931701 0.0266560658089 0.608499467373 -0.0226382557303 -7.83825221344 -3.05995765721
1616648030.91 0.576582122669 0.0383498195873 0.608499467373 -0.0226382557303 -7.83825221344 -3.05995765721
1616648030.96 0.599999835887 0.0411781062089 0.608499467373 -0.0111055597663 -7.83799555013 -3.03341940764
1616648031.01 0.6 0.0511675153485 0.608499467373 -0.0111055597663 -7.83799555013 -3.03341940764
1616648031.06 0.599999914687 0.0609785114436 0.608499467373 0.00427136942744 -7.83777298365 -3.09370300853
1616648031.11 0.599999871964 0.0553829246123 0.608499467373 0.00427136942744 -7.83777298365 -3.09370300853
1616648031.16 0.599999736295 0.0596952530151 0.608499467373 0.0205025728792 -7.83772192882 -3.23600763198
1616648031.21 0.58744821816 0.069692089985 0.608499467373 0.0205025728792 -7.83772192882 -3.23600763198
1616648031.26 0.599999504447 0.0890597874054 0.608499467373 0.0328895412385 -7.83761354098 -3.29735678423
1616648031.31 0.599999853226 0.0968039174921 0.61580145359 0.0469850599766 -7.83761354098 -3.29735678423
1616648031.36 0.599998247076 0.0839615749446 0.61580145359 0.0469850599766 -7.83740230774 -3.35938166861
1616648031.41 0.599999669412 0.0852489326382 0.61580145359 0.0615077167749 -7.83740230774 -3.35938166861
1616648031.46 0.599999289023 0.0771920980376 0.61580145359 0.0615077167749 -7.83732208406 -3.3281787095
1616648031.51 0.599999951259 0.0856101579961 0.61580145359 0.0687690451741 -7.83732208406 -3.3281787095
1616648031.56 0.599993555308 0.0852635027578 0.61580145359 0.0687690451741 -7.83707550518 -3.46639150149
1616648031.61 0.589364347602 0.0859700539192 0.623711943626 0.0726132765412 -7.83707550518 -3.46639150149
1616648031.66 0.599999947643 0.0875116974493 0.623711943626 0.0726132765412 -7.83668170389 -3.53457842713
1616648031.71 0.599999264337 0.082755518519 0.623711943626 0.0751760974526 -7.83668170389 -3.53457842713
1616648031.76 0.599998750451 0.0733263700558 0.623711943626 0.0751760974526 -7.83668041229 -3.53480172157
1616648031.81 0.599999667575 0.0725032271549 0.623711943626 0.0764575079083 -7.83668041229 -3.53480172157
1616648031.86 0.59999998786 0.0624970434573 0.623711943626 0.0764575079083 -7.83606550253 -3.59747635178
1616648031.91 0.599999388567 0.0575924630829 0.623711943626 0.0760303661227 -7.83606550253 -3.59747635178
1616648031.96 0.5999998585 0.0600133460807 0.623711943626 0.0760303661227 -7.83523444075 -3.65943995936
1616648032.01 0.599998704317 0.0451140768903 0.623711943626 0.0747489631176 -7.83523444075 -3.65943995936
1616648032.06 0.599999929061 0.0372841726134 0.608499467373 0.0674876347184 -7.83463661317 -3.63113528859
1616648032.11 0.59999970098 0.0439852230509 0.608499467373 0.0674876347184 -7.83463661317 -3.63113528859
1616648032.16 0.599999935655 0.0502976704073 0.608499467373 0.0568092092872 -7.83359470373 -3.76526088523
1616648032.21 0.586873865044 0.0403349448587 0.608499467373 0.0568092092872 -7.83359470373 -3.76526088523
1616648032.26 0.599999662799 0.0240648526357 0.600588917732 0.0504021570086 -7.83233110241 -3.84945025677
1616648032.31 0.599999999797 0.00451755142699 0.600588917732 0.0504021570086 -7.83233110241 -3.84945025677
1616648032.36 0.599999974679 -0.00332427345825 0.600588917732 0.0397237353027 -7.83088368518 -3.91089734335
1616648032.41 0.599999988611 -0.013323741831 0.600588917732 0.0397237353027 -7.83088368518 -3.91089734335
1616648032.46 0.5999998289 -0.0256380101645 0.600588917732 0.0213568452746 -7.82931857423 -3.97146712567
1616648032.51 0.599999941725 -0.043353090508 0.600588917732 0.0213568452746 -7.82931857423 -3.97146712567
1616648032.57 0.599999695881 -0.0468148129066 0.600588917732 -0.00128141080495 -7.82769965429 -3.94522118241
1616648032.62 0.599999929282 -0.0668029571028 0.600588917732 -0.00128141080495 -7.82769965429 -3.94522118241
1616648032.67 0.5999995302 -0.0690744656233 0.600588917732 -0.024773940444 -7.8180179443 -4.15132478748
1616648032.72 0.586666205148 -0.0790737478249 0.600588917732 -0.024773940444 -7.8180179443 -4.15132478748
1616648032.77 0.586778141158 -0.0990585685206 0.600588917732 -0.0465579256415 -7.81593621726 -4.21256037626
1616648032.82 0.599999820242 -0.119018089679 0.600588917732 -0.0465579256415 -7.81593621726 -4.21256037626
1616648032.87 0.599999101476 -0.124021962434 0.608499467373 -0.0683419108391 -7.81406763188 -4.27231748951
1616648032.92 0.599999925745 -0.133443303606 0.608499467373 -0.0935429781675 -7.81406763188 -4.27231748951
1616648032.97 0.599999941374 -0.133562489083 0.608499467373 -0.0935429781675 -7.81406116486 -4.27252435684
1616648033.02 0.599999910375 -0.133569557818 0.600588917732 -0.11404556036 -7.81406116486 -4.27252435684
1616648033.07 0.599999913323 -0.133581193349 0.600588917732 -0.11404556036 -7.81193772535 -4.32185049287
1616648033.12 0.599988478284 -0.143580727042 0.608499467373 -0.127713933587 -7.81193772535 -4.32185049287
1616648033.17 0.599999998099 -0.145240788607 0.608499467373 -0.127713933587 -7.80998766733 -4.38308233856
1616648033.22 0.6 -0.137413050436 0.61580145359 -0.137965232134 -7.80998766733 -4.38308233856
1616648033.27 0.599997065648 -0.127104866202 0.61580145359 -0.137965232134 -7.80824318719 -4.4543408796
1616648033.32 0.599999944563 -0.129457573099 0.608499467373 -0.143090859056 -7.80824318719 -4.4543408796
1616648033.37 0.599999918029 -0.129058171018 0.608499467373 -0.143090859056 -7.80691970995 -4.5148860662
1616648033.42 0.599999977096 -0.113169850807 0.608499467373 -0.144372269511 -7.80691970995 -4.5148860662
1616648033.47 0.599999618142 -0.103127117058 0.608499467373 -0.144372269511 -7.80598111253 -4.57615820736
1616648033.52 0.599999975154 -0.093764935571 0.608499467373 -0.144372269511 -7.80598111253 -4.57615820736
1616648033.57 0.599999995188 -0.0938140816711 0.600588917732 -0.143518000841 -7.80507173697 -4.62949889864
1616648033.62 0.599997422223 -0.0885835284286 0.600588917732 -0.143518000841 -7.80507173697 -4.62949889864
1616648033.67 0.599999886911 -0.0908033566714 0.593286991119 -0.133266717196 -7.80456042868 -4.68929630776
1616648033.72 0.599999989178 -0.0708111574418 0.593286991119 -0.122161157429 -7.80456042868 -4.68929630776
1616648033.77 0.599999929474 -0.0664312125023 0.593286991119 -0.122161157429 -7.80448454508 -4.75191296303
1616648033.82 0.6 -0.0464324449064 0.593286991119 -0.107638500631 -7.80448454508 -4.75191296303
1616648033.87 0.599999911651 -0.0265710043267 0.593286991119 -0.107638500631 -7.80474805631 -4.81165269961
1616648033.92 0.6 -0.0165715431983 0.585376441479 -0.0832917019725 -7.80474805631 -4.81165269961
1616648033.97 0.6 -0.00657407188684 0.585376441479 -0.0832917019725 -7.8052990547 -4.87079794066
1616648034.02 0.599998461004 0.0130128905558 0.593286991119 -0.0572363473475 -7.8052990547 -4.87079794066
1616648034.07 0.599999855296 0.0229866255773 0.593286991119 -0.0572363473475 -7.80419001927 -4.91347659527
1616648034.12 0.6 0.0429752248998 0.600588917732 -0.0281910356134 -7.80419001927 -4.91347659527
1616648034.17 0.599999597719 0.0492024606719 0.600588917732 -0.0281910356134 -7.79962766287 -4.97331693876
1616648034.22 0.599999973341 0.0691989379585 0.593286991119 0.00128141080495 -7.79962766287 -4.97331693876
1616648034.27 0.599999637308 0.0729022084583 0.593286991119 0.00128141080495 -7.80636457083 -5.05194608465
1616648034.32 0.6 0.0928999786794 0.600588917732 0.0294724479318 -7.80636457083 -5.05194608465
1616648034.37 0.6 0.102899825409 0.600588917732 0.0294724479318 -7.80813600134 -5.11473503878
1616648034.42 0.6 0.122899206986 0.600588917732 0.0538192503154 -7.80813600134 -5.11473503878
1616648034.47 0.599999908262 0.142890509699 0.600588917732 0.0538192503154 -7.8098004117 -5.17454143821
1616648034.52 0.599998849051 0.152748421071 0.608499467373 0.0798745974898 -7.8098004117 -5.17454143821
1616648034.57 0.599998983855 0.171658916034 0.608499467373 0.0798745974898 -7.81156263335 -5.21769376969
1616648034.62 0.6 0.172129200759 0.608499467373 0.109774187207 -7.81156263335 -5.21769376969
1616648034.67 0.599999908189 0.174133045743 0.608499467373 0.109774187207 -7.81328944352 -5.27891392282
1616648034.72 0.599999980178 0.1743268851 0.608499467373 0.135829538107 -7.81328944352 -5.27891392282
1616648034.77 0.599999999702 0.17436071368 0.608499467373 0.135829538107 -7.81489360772 -5.34467843926
1616648034.82 0.599999950736 0.171604413296 0.608499467373 0.152487874031 -7.81489360772 -5.34467843926
1616648034.87 0.599994873833 0.161936782958 0.608499467373 0.162312030792 -7.81610432309 -5.42746331264
1616648034.92 0.6 0.159662613556 0.608499467373 0.162312030792 -7.81610432309 -5.42746331264
1616648034.97 0.599999691105 0.159258033292 0.600588917732 0.165301993489 -7.81686232555 -5.48786209025
1616648035.02 0.599995613172 0.141657448384 0.600588917732 0.165301993489 -7.81686232555 -5.48786209025
1616648035.07 0.599999752405 0.153148260589 0.600588917732 0.165301993489 -7.81788854978 -5.50577438901
1616648035.12 0.599999883851 0.15730602675 0.600588917732 0.165301993489 -7.81788854978 -5.50577438901
1616648035.17 0.599999935983 0.15733228752 0.600588917732 0.164020583034 -7.8178896904 -5.50579404831
1616648035.22 0.599999932511 0.157332513927 0.600588917732 0.164020583034 -7.8178896904 -5.50579404831
1616648035.27 0.586666672471 0.147332317123 0.593286991119 0.163166299462 -7.81894015237 -5.62439410246
1616648035.32 0.599995370781 0.137340194727 0.593286991119 0.163166299462 -7.81894015237 -5.62439410246
1616648035.37 0.599999353935 0.127751236832 0.585376441479 0.160603478551 -7.8104339648 -5.70480424738
1616648035.42 0.573332941994 0.107751242787 0.585376441479 0.151206463575 -7.8104339648 -5.70480424738
1616648035.47 0.586666060189 0.0977558061179 0.585376441479 0.151206463575 -7.80959105663 -5.76488240311
1616648035.52 0.586665907189 0.0777593129954 0.585376441479 0.133693858981 -7.80959105663 -5.76488240311
1616648035.57 0.59999824602 0.0581503216049 0.585376441479 0.133693858981 -7.81243552492 -5.79160341849
1616648035.62 0.599999998545 0.0481536977594 0.570163965225 0.107211366296 -7.81243552492 -5.79160341849
1616648035.68 0.6 0.0381585307616 0.570163965225 0.107211366296 -7.78778946415 -5.84892129548
1616648035.73 0.586666667705 0.0281585303817 0.578074514866 0.0785931944847 -7.78778946415 -5.84892129548
1616648035.78 0.573333334217 0.0181585297693 0.578074514866 0.0785931944847 -7.8044774871 -5.91898667421
1616648035.83 0.599999722006 -0.00183726159231 0.562862038612 0.0529649779201 -7.8044774871 -5.91898667421
1616648035.88 0.599999687404 -0.0217994345154 0.562862038612 0.0529649779201 -7.80206562752 -5.97921458034
1616648035.93 0.599999840918 -0.031796942478 0.562862038612 0.027336763218 -7.80206562752 -5.97921458034
1616648035.98 0.59999832866 -0.0517250852181 0.562862038612 0.027336763218 -7.79972657144 -6.03598557519
1616648036.03 0.599998830569 -0.0716717631208 0.570163965225 -0.00128141080495 -7.79972657144 -6.03598557519
1616648036.08 0.599960185571 -0.0816347138773 0.570163965225 -0.00128141080495 -7.79529907513 -6.07068902343
1616648036.13 0.59999934582 -0.101587534846 0.570163965225 -0.0303267203271 -7.79529907513 -6.07068902343
1616648036.18 0.59999934582 -0.101587534846 0.570163965225 -0.0303267203271 -7.79308533635 -6.12965625842
1616648036.23 0.573332700848 -0.121587533688 0.570163965225 -0.0589448958635 -7.79308533635 -6.12965625842
1616648036.28 0.54666699684 -0.141587516741 0.570163965225 -0.0589448958635 -7.79308080673 -6.12977743149
1616648036.33 0.559991391178 -0.15158750081 0.578074514866 -0.0862816572189 -7.79308080673 -6.12977743149
1616648036.38 0.559991095881 -0.171587490282 0.578074514866 -0.0862816572189 -7.79007289338 -6.19363053687
1616648036.43 0.561892968437 -0.181587490882 0.593286991119 -0.115754105151 -7.79007289338 -6.19363053687
1616648036.48 0.572712492754 -0.191587491403 0.593286991119 -0.143090859056 -7.78705258827 -6.25898710043
1616648036.53 0.546046156398 -0.211587268725 0.593286991119 -0.143090859056 -7.78705258827 -6.25898710043
1616648036.58 0.519379518687 -0.227038533811 0.585376441479 -0.171281903982 -7.78431014779 -6.31876253706
1616648036.63 0.506046185981 -0.231958316532 0.585376441479 -0.171281903982 -7.78431014779 -6.31876253706
1616648036.68 0.492712906404 -0.235001577494 0.578074514866 -0.198191523552 -7.78143876109 -6.34266927242
1616648036.73 0.452713884645 -0.265001555974 0.578074514866 -0.198191523552 -7.78143876109 -6.34266927242
1616648036.78 0.439380550673 -0.270326055923 0.578074514866 -0.220402657986 -7.77887991399 -6.40653040632
1616648036.83 0.426047217882 -0.27656696539 0.578074514866 -0.220402657986 -7.77887991399 -6.40653040632
1616648036.88 0.399380570887 -0.280995014503 0.554951488972 -0.243040904403 -7.77667146185 -6.4685592572
1616648036.93 0.386047252767 -0.288608845985 0.554951488972 -0.243040904403 -7.77667146185 -6.4685592572
1616648036.98 0.359380612803 -0.288461386131 0.547649502754 -0.263116329908 -7.77491140886 -6.54364829139
1616648037.03 0.354307926717 -0.288186845323 0.547649502754 -0.263116329908 -7.77491140886 -6.54364829139
1616648037.08 0.34097464909 -0.278186885761 0.524526536465 -0.278066128492 -7.77375392015 -6.59820598302
1616648037.13 0.334410757524 -0.272673430255 0.524526536465 -0.278066128492 -7.77375392015 -6.59820598302
1616648037.18 0.328595805208 -0.280683066653 0.502012014389 -0.285327464342 -7.77267575563 -6.62756985592
1616648037.23 0.316439735365 -0.287340265288 0.502012014389 -0.285327464342 -7.77267575563 -6.62756985592
1616648037.28 0.316439735365 -0.287340265288 0.478889077902 -0.287463128567 -7.77274503398 -6.73594813625
1616648037.33 0.289773079161 -0.267340282771 0.478889077902 -0.287463128567 -7.77274503398 -6.73594813625
1616648037.38 0.263106466753 -0.247340348861 0.448464095592 -0.29002597928 -7.77331649264 -6.78370385608
1616648037.43 0.249773134027 -0.237340349778 0.448464095592 -0.29002597928 -7.77331649264 -6.78370385608
1616648037.48 0.223106482278 -0.217340364253 0.448464095592 -0.29002597928 -7.77398819025 -6.82676756851
1616648037.53 0.209773182297 -0.207340382823 0.425949603319 -0.283191770315 -7.77398819025 -6.82676756851
1616648037.58 0.183106616993 -0.187340428886 0.425949603319 -0.283191770315 -7.77501041705 -6.86856268461
1616648037.63 0.169773283335 -0.177340428407 0.380312174559 -0.263116329908 -7.77501041705 -6.86856268461
1616648037.68 0.143106630285 -0.157340437323 0.357189178467 -0.236206710339 -7.77593400816 -6.8712999959
1616648037.73 0.116440023015 -0.137340442846 0.357189178467 -0.236206710339 -7.77593400816 -6.8712999959
1616648037.78 0.116440023015 -0.137340442846 0.334674715996 -0.207161396742 -7.79488863677 -6.95643101387
1616648037.83 0.0897734019422 -0.137345191906 0.334674715996 -0.207161396742 -7.79488863677 -6.95643101387
1616648037.88 0.0631067363448 -0.157345101571 0.311551719904 -0.178970366716 -7.79659228212 -6.9887527034
1616648037.93 0.049773404044 -0.167345082637 0.311551719904 -0.178970366716 -7.79659228212 -6.9887527034
1616648037.98 0.0364401395993 -0.177344719021 0.281126767397 -0.166156262159 -7.77034829806 -7.01937238831
1616648038.03 -0.00355848772799 -0.147344752396 0.281126767397 -0.166156262159 -7.77034829806 -7.01937238831
1616648038.08 -0.0168918143002 -0.137344758295 0.250701785088 -0.161457747221 -7.77216439433 -7.04696268377
1616648038.13 -0.0435584649168 -0.117344759732 0.250701785088 -0.161457747221 -7.77216439433 -7.04696268377
1616648038.18 -0.0435584649168 -0.117344759732 0.228187292814 -0.155904978514 -7.78942804333 -7.04649570302
1616648038.23 -0.0835584334999 -0.147344636172 0.228187292814 -0.155904978514 -7.78942804333 -7.04649570302
1616648038.28 -0.0968917523938 -0.157344596008 0.18985183537 -0.14907078445 -7.79921063433 -7.10802520227
1616648038.33 -0.123557955398 -0.177343330725 0.18985183537 -0.14907078445 -7.79921063433 -7.10802520227
1616648038.38 -0.13689128742 -0.18734332678 0.113789394498 -0.147789373994 -7.80070500867 -7.12528688774
1616648038.43 -0.150224618333 -0.197343314539 0.113789394498 -0.147789373994 -7.80070500867 -7.12528688774
1616648038.48 -0.176891281597 -0.197343316611 0.113789394498 -0.147789373994 -7.78908664454 -7.13423660004
1616648038.53 -0.203557454947 -0.177343932632 0.0304249729961 -0.149497926235 -7.78908664454 -7.13423660004
1616648038.58 -0.216890627523 -0.167344404848 0.0304249729961 -0.149497926235 -7.78900957108 -7.13429546356
1616648038.63 -0.243556732795 -0.165884130245 -0.0456374585629 -0.154196426272 -7.78900957108 -7.13429546356
1616648038.68 -0.2568900116 -0.169845542941 -0.0456374585629 -0.154196426272 -7.78841012168 -7.15758937292
1616648038.73 -0.28355643213 -0.169209763929 -0.0912749171257 -0.156759247184 -7.78841012168 -7.15758937292
1616648038.78 -0.28449123653 -0.159209791282 -0.0912749171257 -0.156759247184 -7.78741711415 -7.16304503942
1616648038.83 -0.285939782923 -0.139212864719 -0.129001885653 -0.158894941211 -7.78741711415 -7.16304503942
1616648038.88 -0.277748377442 -0.129212883256 -0.129001885653 -0.158894941211 -7.78618108428 -7.1489732834
1616648038.93 -0.279092214618 -0.109216870224 -0.129001885653 -0.158894941211 -7.78618108428 -7.1489732834
1616648038.98 -0.279782066106 -0.0992290578951 -0.152124866843 -0.158894941211 -7.78617525101 -7.14890670776
1616648039.03 -0.280979708075 -0.0842453668466 -0.152124866843 -0.158894941211 -7.78617525101 -7.14890670776
1616648039.08 -0.276711062986 -0.0876444089177 -0.174639344215 -0.152487874031 -7.78464558555 -7.15741371959
1616648039.14 -0.276711064174 -0.0876444144858 -0.174639344215 -0.152487874031 -7.78464558555 -7.15741371959
1616648039.19 -0.264398633365 -0.0776445379299 -0.197762325406 -0.14010091126 -7.78294312429 -7.1389450728
1616648039.24 -0.265051905814 -0.0700823133598 -0.197762325406 -0.14010091126 -7.78294312429 -7.1389450728
1616648039.29 -0.268061167639 -0.0800823092646 -0.21297480166 -0.127713933587 -7.78455929979 -7.11882060284
1616648039.34 -0.267784093078 -0.0822861864383 -0.21297480166 -0.127713933587 -7.78455929979 -7.11882060284
1616648039.39 -0.254452046305 -0.0723100263826 -0.228187292814 -0.113618418574 -7.78270796854 -7.09644400676
1616648039.44 -0.251452335073 -0.0807876275923 -0.250701785088 -0.104221411049 -7.78270796854 -7.09644400676
1616648039.49 -0.257291159142 -0.0807878331388 -0.250701785088 -0.104221411049 -7.78412677218 -7.05931309979
1616648039.54 -0.255163225498 -0.100786224853 -0.258612275124 -0.0969600826502 -7.78412677218 -7.05931309979
1616648039.59 -0.241829895632 -0.0907862926166 -0.258612275124 -0.0969600826502 -7.78215947435 -7.02019585153
1616648039.64 -0.236972160869 -0.100465244584 -0.258612275124 -0.0939701199532 -7.78215947435 -7.02019585153
1616648039.69 -0.223638911969 -0.090466216339 -0.258612275124 -0.0939701199532 -7.78016455287 -6.99331501132
1616648039.74 -0.217195893375 -0.0826455064952 -0.258612275124 -0.0939701199532 -7.78016455287 -6.99331501132
1616648039.79 -0.217116276112 -0.0826317063768 -0.265914261341 -0.092688716948 -7.78015708923 -6.99321460724
1616648039.84 -0.217116289931 -0.0826321568607 -0.265914261341 -0.0909801647067 -7.78015708923 -6.99321460724
1616648039.89 -0.204449301435 -0.0915797844644 -0.265914261341 -0.0909801647067 -7.78087091034 -6.96641348011
1616648039.94 -0.204448770801 -0.0960562246778 -0.265914261341 -0.0909801647067 -7.77921350412 -6.94033847991
1616648039.99 -0.191115582615 -0.0924877274752 -0.250701785088 -0.0909801647067 -7.77921350412 -6.94033847991
1616648040.04 -0.18112069929 -0.0724881604226 -0.250701785088 -0.0909801647067 -7.7775756657 -6.91572797587
1616648040.09 -0.172256009347 -0.062488225436 -0.250701785088 -0.0909801647067 -7.7775756657 -6.91572797587
1616648040.14 -0.170725949363 -0.0424882336243 -0.250701785088 -0.0909801647067 -7.77614214481 -6.87730771237
1616648040.19 -0.157392618336 -0.0391923769714 -0.243399783969 -0.0871359333396 -7.77614214481 -6.87730771237
1616648040.24 -0.130726003523 -0.0363696953113 -0.243399783969 -0.0871359333396 -7.77483787904 -6.85415728367
1616648040.29 -0.117392713241 -0.0299385557039 -0.228187292814 -0.0785931944847 -7.77483787904 -6.85415728367
1616648040.34 -0.0907260855755 -0.0165161998588 -0.228187292814 -0.0785931944847 -7.77354353424 -6.83753302622
1616648040.39 -0.0773927877972 -0.00865348753417 -0.220276802778 -0.0687690451741 -7.77354353424 -6.83753302622
1616648040.44 -0.0507261625746 0.0088049813226 -0.220276802778 -0.0687690451741 -7.77236944666 -6.8166797969
1616648040.49 -0.0373929940258 0.0174698836372 -0.205064311624 -0.0555278025568 -7.77236944666 -6.8166797969
1616648040.54 -0.0107263415014 0.0335717422804 -0.205064311624 -0.0555278025568 -7.77130034687 -6.79725641383
1616648040.59 0.00260683715511 0.0421512053489 -0.197762325406 -0.0384423211217 -7.77130034687 -6.79725641383
1616648040.64 0.0292734227034 0.0576689964585 -0.197762325406 -0.0384423211217 -7.77036920548 -6.768474945
1616648040.69 0.042606716758 0.0671120722231 -0.167337357998 -0.0179397501051 -7.77036920548 -6.768474945
1616648040.74 0.0692733164959 0.0710784618567 -0.167337357998 -0.0179397501051 -7.76961015506 -6.75425576975
1616648040.79 0.082606449586 0.0789125806206 -0.136912375689 0.0025628216099 -7.76961015506 -6.75425576975
1616648040.84 0.109273039974 0.0814377580961 -0.136912375689 0.0025628216099 -7.76906654017 -6.74892091223
1616648040.89 0.122606291815 0.0870505683344 -0.0912749171257 0.0196482986212 -7.76906654017 -6.74892091223
1616648040.94 0.149272926354 0.0862381500119 -0.0912749171257 0.0196482986212 -7.76879659327 -6.74370942744
1616648040.99 0.162606247489 0.0862293729676 0.0456374585629 0.0324624031782 -7.76879659327 -6.74370942744
1616648041.04 0.189272744331 0.0920794585995 0.0456374585629 0.0324624031782 -7.76879549026 -6.73527577485
1616648041.09 0.21593836537 0.0825760739775 0.0 0.0431408286095 -7.76879549026 -6.73527577485
1616648041.14 0.229271626906 0.0745654364926 0.0 0.0431408286095 -7.76905379874 -6.72457705738
1616648041.19 0.255936935417 0.0734836521685 0.0529394522309 0.0525378398597 -7.76905379874 -6.72457705738
1616648041.24 0.269270137759 0.0725949449576 0.0985769107938 0.0589448958635 -7.76942236742 -6.73199586471
1616648041.29 0.295926230809 0.0739480007413 0.0985769107938 0.0589448958635 -7.76942236742 -6.73199586471
1616648041.34 0.309259190351 0.0829017436596 0.0985769107938 0.0589448958635 -7.76997148374 -6.74317219608
1616648041.39 0.335925404921 0.0827238136468 0.129001885653 0.0640705376863 -7.76997148374 -6.74317219608
1616648041.44 0.349258445387 0.0917240838614 0.144214376807 0.0679147690535 -7.77058830724 -6.739001092
1616648041.49 0.375922967061 0.0994584877127 0.144214376807 0.0679147690535 -7.77058830724 -6.739001092
1616648041.54 0.389255963299 0.108892545263 0.174639344215 0.0726132765412 -7.77043588863 -6.75829227419
1616648041.59 0.415921750245 0.0888926287707 0.174639344215 0.0726132765412 -7.77043588863 -6.75829227419
1616648041.65 0.429254909813 0.0812737061428 0.182549834251 0.077738918364 -7.77132690592 -6.77777276296
1616648041.7 0.455919644873 0.0774115325789 0.182549834251 0.077738918364 -7.77132690592 -6.77777276296
1616648041.75 0.463096285397 0.07746379107 0.21297480166 0.0798745974898 -7.77227540867 -6.79800887672
1616648041.8 0.455253641088 0.0829645658022 0.21297480166 0.0798745974898 -7.77227540867 -6.79800887672
1616648041.85 0.455253905645 0.0833834671768 0.228187292814 0.0798745974898 -7.7733513043 -6.82119219731
1616648041.9 0.455253905645 0.0833834671768 0.228187292814 0.0798745974898 -7.7733513043 -6.82119219731
1616648041.95 0.455253905645 0.0833834671768 0.228187292814 0.0798745974898 -7.77335309982 -6.82123088837
1616648042.0 0.0 0.0 0.228187292814 0.0798745974898 -7.77335309982 -6.82123088837
1616648042.05 0.0 0.0 0.228187292814 0.0798745974898 -7.77335309982 -6.82123088837
1616648042.1 0.459216816208 0.0713315871431 0.273824751377 0.0726132765412 -7.77335309982 -6.82123088837
1616648042.15 0.458444436389 0.0727992605794 0.273824751377 0.0726132765412 -7.7757532285 -6.86976048176
1616648042.2 0.458444436389 0.0727992605794 0.273824751377 0.0657790824771 -7.7757532285 -6.86976048176
1616648042.25 0.458444436389 0.0727992605794 0.273824751377 0.0657790824771 -7.77694565724 -6.89741818458
1616648042.3 0.445111108564 0.0827992364097 0.273824751377 0.0657790824771 -7.77694565724 -6.89741818458
1616648042.35 0.43177778166 0.092799217207 0.273824751377 0.0657790824771 -7.77694988251 -6.89751625061
1616648042.4 0.418444447674 0.102799217834 0.258612275124 0.0657790824771 -7.77694988251 -6.89751625061
1616648042.45 0.405111246698 0.112799072337 0.258612275124 0.0657790824771 -7.77909639647 -6.92290413263
1616648042.5 0.418444574946 0.102799073316 0.258612275124 0.0683419108391 -7.77909639647 -6.92290413263
1616648042.55 0.418444574946 0.102799073316 0.258612275124 0.0683419108391 -7.78014102638 -6.95792107622
1616648042.6 0.418444574946 0.102799073316 0.258612275124 0.0730404108763 -7.78014102638 -6.95792107622
1616648042.65 0.418444574946 0.102799073316 0.258612275124 0.0730404108763 -7.78102170332 -6.98761459431
1616648042.7 0.391777911274 0.122799074155 0.265914261341 0.0768846422434 -7.78102170332 -6.98761459431
1616648042.75 0.378444577291 0.132799074819 0.265914261341 0.0768846422434 -7.78188821125 -7.01454104895
1616648042.8 0.385285641882 0.126090452491 0.289037257433 0.0841459706426 -7.78188821125 -7.01454104895
1616648042.85 0.385285641882 0.126090452491 0.289037257433 0.0841459706426 -7.78177451925 -7.04025672113
1616648042.9 0.385285641882 0.126090452491 0.31946220994 0.0943972542882 -7.78177451925 -7.04025672113
1616648042.95 0.385285641882 0.126090452491 0.31946220994 0.0943972542882 -7.78287772561 -7.07239860204
1616648043.0 0.361828615212 0.145975141307 0.334674715996 0.102085724473 -7.78287772561 -7.07239860204
1616648043.05 0.34849537723 0.155975137537 0.334674715996 0.109347052872 -7.78392491553 -7.10746911646
1616648043.1 0.321828723991 0.17597513874 0.357189178467 0.109347052872 -7.78392491553 -7.10746911646
1616648043.15 0.295162532679 0.195975137888 0.357189178467 0.123869709671 -7.78498153826 -7.14482406557
1616648043.2 0.281829201182 0.205975138429 0.357189178467 0.123869709671 -7.78498153826 -7.14482406557
1616648043.25 0.255167518143 0.225975109156 0.37240165472 0.147789373994 -7.7849855423 -7.14496564865
1616648043.3 0.242896776802 0.23597508321 0.37240165472 0.147789373994 -7.7849855423 -7.14496564865
1616648043.35 0.239199847114 0.255974999802 0.37240165472 0.175980418921 -7.78593498572 -7.18291110449
1616648043.4 0.0 0.0 0.37240165472 0.175980418921 -7.78593498572 -7.18291110449
1616648043.45 0.0 0.0 0.365099668503 0.179824635386 -7.78698910247 -7.20212479259
1616648043.5 0.0 0.0 0.365099668503 0.179824635386 -7.78698910247 -7.20212479259
1616648043.55 0.0 0.0 0.357189178467 0.113618418574 -7.78776357384 -7.2191357869
1616648043.6 0.0 0.0 0.357189178467 0.113618418574 -7.78776357384 -7.2191357869
1616648043.65 0.0 0.0 0.32676422596 0.0610805787146 -7.7890143398 -7.32050287679
1616648043.7 0.0 0.0 0.32676422596 0.0610805787146 -7.7890143398 -7.32050287679
1616648043.75 0.0 0.0 0.281126767397 0.0328895412385 -7.78939258234 -7.34465608042
1616648043.8 0.0 0.0 0.281126767397 0.0328895412385 -7.78939258234 -7.34465608042
1616648043.85 0.0 0.0 0.21297480166 0.0166583396494 -7.78794453133 -7.35198026498
1616648043.9 0.0 0.0 0.21297480166 0.0166583396494 -7.78794453133 -7.35198026498
1616648043.95 0.0 0.0 0.144214376807 0.00854273885489 -7.78800745213 -7.37239924744
1616648044.0 0.0 0.0 0.144214376807 0.00854273885489 -7.78800745213 -7.37239924744
1616648044.05 0.0 0.0 0.0912749171257 0.00384423229843 -7.78804713374 -7.41255766299
1616648044.1 0.0 0.0 0.0912749171257 0.00384423229843 -7.78804713374 -7.41255766299
1616648044.15 0.0 0.0 0.0529394522309 0.000854273850564 -7.78806584054 -7.44138273774
1616648044.2 0.0 0.0 0.0529394522309 0.000854273850564 -7.78806584054 -7.44138273774
1616648044.25 0.0 0.0 0.0377269648015 -0.000854273850564 -7.78807540534 -7.44372339916
1616648044.3 0.0 0.0 0.0377269648015 -0.000854273850564 -7.78807540534 -7.44372339916
1616648044.35 0.0 0.0 0.0377269648015 -0.000854273850564 -7.78807544708 -7.44373321533
1616648044.4 0.0 0.0 0.0225144792348 -0.00170854770113 -7.78807544708 -7.44373321533
1616648044.45 0.0 0.0 0.0225144792348 -0.00170854770113 -7.78808495503 -7.44596900803
1616648044.5 0.0 0.0 -0.00730199320242 -0.0025628216099 -7.78808495503 -7.44596900803
1616648044.55 0.0 0.0 -0.00730199320242 -0.0025628216099 -7.78808498383 -7.44799362207
1616648044.61 0.0 0.0 -0.00730199320242 -0.0025628216099 -7.78808498383 -7.44799362207
1616648044.66 0.0 0.0 0.00730199320242 -0.0025628216099 -7.78808498383 -7.44800280604
1616648044.71 0.0 0.0 0.00730199320242 -0.0025628216099 -7.78808498383 -7.44800280604
1616648044.76 0.0 0.0 0.0 -0.0025628216099 -7.78808498383 -7.44800281525
1616648044.81 0.0 0.0 0.0 -0.0025628216099 -7.78808498383 -7.44800281525
1616648044.86 0.0 0.0 0.0 -0.0025628216099 -7.78808498383 -7.44800281525
1616648044.91 0.0 0.0 0.0 -0.0025628216099 -7.78808498383 -7.44800281525
1616648044.96 0.0 0.0 0.0 -0.0025628216099 -7.78808498383 -7.44801327939
1616648045.01 0.0 0.0 0.0 -0.0025628216099 -7.78808498383 -7.44801327939
1616648045.06 0.0 0.0 0.0 -0.0025628216099 -7.78808498383 -7.44801330566
1616648045.11 0.0 0.0 0.0 -0.0025628216099 -7.78808498383 -7.44801330566
1616648045.16 0.0 0.0 0.0 -0.0025628216099 -7.78808498383 -7.44801330566
1616648045.21 0.0 0.0 0.0 -0.0025628216099 -7.78808498383 -7.44801330566
1616648045.26 0.0 0.0 0.0 -0.0025628216099 -7.78808498383 -7.44801330566
1616648045.31 0.0 0.0 0.0 -0.0025628216099 -7.78808498383 -7.44801330566
1616648045.36 0.0 0.0 0.0 -0.0025628216099 -7.78808498383 -7.44801330566
1616648045.41 0.0 0.0 0.0 -0.0025628216099 -7.78808498383 -7.44801330566
1616648045.46 0.0 0.0 0.0 -0.0025628216099 -7.78808498383 -7.44801330566
1616648045.51 0.0 0.0 0.0 -0.0025628216099 -7.78808498383 -7.44801330566
1616648045.56 0.0 0.0 0.0 -0.0025628216099 -7.78808498383 -7.44801330566
1616648045.61 0.0 0.0 0.0 -0.0025628216099 -7.78808498383 -7.44801330566
1616648045.66 0.0 0.0 0.0 -0.0025628216099 -7.78808498383 -7.44801330566
1616648045.71 0.0 0.0 0.0 -0.0025628216099 -7.78808498383 -7.44801330566
1616648045.76 0.0 0.0 0.0 -0.0025628216099 -7.78808498383 -7.44801330566
1616648045.81 0.0 0.0 0.0 -0.0025628216099 -7.78808498383 -7.44801330566
1616648045.86 0.0 0.0 0.0 -0.0025628216099 -7.78808498383 -7.44801330566
1616648045.91 0.0 0.0 0.0 -0.0025628216099 -7.78808498383 -7.44801330566
1616648045.96 0.0 0.0 0.0 -0.0025628216099 -7.78808498383 -7.44801330566
1616648046.01 0.0 0.0 0.0 -0.0025628216099 -7.78808498383 -7.44801330566
1616648046.06 0.0 0.0 0.0 -0.0025628216099 -7.78808498383 -7.44801330566
1616648046.11 0.0 0.0 0.0 -0.0025628216099 -7.78808498383 -7.44801330566
1616648046.16 0.0 0.0 0.0 -0.0025628216099 -7.78808498383 -7.44801330566
1616648046.21 0.0 0.0 0.0 -0.0025628216099 -7.78808498383 -7.44801330566
1616648046.26 0.0 0.0 0.0 -0.00213568471372 -7.78808498383 -7.44801330566
1616648046.31 0.0 0.0 0.0 -0.00213568471372 -7.78808498383 -7.44801330566
1616648046.36 0.0 0.0 0.0 -0.00213568471372 -7.78808498383 -7.44801330566
1616648046.41 0.0 0.0 0.0 -0.00213568471372 -7.78808498383 -7.44801330566
