210325_103446
time	cmd_vx	cmd_phi	fb_vx	fb_phi	odom_x	odom_y
1616643298.42 0.0227732592374 -0.191437911947 0.0 -0.00384423229843 -15.1230010986 -0.42884105444
1616643298.47 0.00943992921045 -0.18146921322 0.0 -0.00384423229843 -15.1230010986 -0.42884105444
1616643298.52 -0.00389340260307 -0.171474427055 0.0 -0.00384423229843 -15.1230010986 -0.42884105444
1616643298.57 -0.0172267360072 -0.161475973552 0.0 -0.0298995841295 -15.1230010986 -0.42884105444
1616643298.62 -0.0172267360072 -0.161475973552 0.0 -0.0298995841295 -15.1230010986 -0.42884105444
1616643298.67 -0.030560069768 -0.15147729894 0.0 -0.0704775899649 -15.1230010986 -0.42884105444
1616643298.72 -0.0438934033646 -0.141490858483 0.0 -0.0973872244358 -15.1230010986 -0.42884105444
1616643298.77 -0.0572267357927 -0.131495604254 0.0 -0.0973872244358 -15.1230010986 -0.42884105444
1616643298.82 -0.0838933846143 -0.11322371581 0.0 -0.111482731998 -15.1230010986 -0.42884105444
1616643298.87 -0.0972267174656 -0.103228652184 0.0 -0.111482731998 -15.1230010986 -0.42884105444
1616643298.93 -0.123893363049 -0.0874973739542 0.0 -0.117462649941 -15.1230010986 -0.42884105444
1616643298.98 -0.137226655057 -0.0832869984239 0.0 -0.117462649941 -15.1230010986 -0.42884105444
1616643299.03 -0.150559988804 -0.0732894537491 -0.0152124864981 -0.118316926062 -15.1230010986 -0.42884105444
1616643299.08 -0.163893322781 -0.0633406372394 -0.0152124864981 -0.118316926062 -15.1222567752 -0.428839867699
1616643299.13 -0.190559987771 -0.0451509338998 -0.0152124864981 -0.118316926062 -15.1222567752 -0.428839867699
1616643299.18 -0.2172266468 -0.039659873422 -0.0456374585629 -0.117462649941 -15.1207643977 -0.428837399243
1616643299.23 -0.230559934106 -0.0369872142389 -0.0456374585629 -0.117462649941 -15.1207643977 -0.428837399243
1616643299.28 -0.243893259315 -0.0308852530239 -0.0608499459922 -0.0999500378966 -15.1133118055 -0.428821982594
1616643299.33 -0.270559911917 -0.0229413286422 -0.0608499459922 -0.0999500378966 -15.1133118055 -0.428821982594
1616643299.38 -0.283893241329 -0.0207918922038 -0.0833644270897 -0.0918344408274 -15.1065908018 -0.428804226598
1616643299.43 -0.310559902436 -0.0168902234941 -0.0833644270897 -0.0918344408274 -15.1065908018 -0.428804226598
1616643299.48 -0.323892565498 -0.0138156438906 -0.0985769107938 -0.0803017392755 -15.1087657066 -0.42878224744
1616643299.53 -0.350559231163 -0.00507948225209 -0.0985769107938 -0.0803017392755 -15.1087657066 -0.42878224744
1616643299.58 -0.377225881734 -0.00293141043213 -0.0985769107938 -0.0666333585978 -15.1055515279 -0.428752569183
1616643299.63 -0.39055913697 -0.0011104627807 -0.0985769107938 -0.0666333585978 -15.1055515279 -0.428752569183
1616643299.68 -0.417225794526 0.000971811199024 -0.121699891984 -0.0521107055247 -15.1055355072 -0.428752422333
1616643299.73 -0.430559076798 0.00210658926766 -0.121699891984 -0.0521107055247 -15.1055355072 -0.428752422333
1616643299.78 -0.443892375928 0.0037165407513 -0.152124866843 -0.038869459182 -15.0963372717 -0.42871425255
1616643299.83 -0.470559003379 0.00689095293557 -0.167337357998 -0.0260553527623 -15.0963372717 -0.42871425255
1616643299.88 -0.483892336101 0.00813661592729 -0.167337357998 -0.0260553527623 -15.0880944049 -0.428660094476
1616643299.93 -0.510558694774 0.010320659723 -0.18985183537 -0.0162312015891 -15.0880944049 -0.428660094476
1616643299.98 -0.523892022008 0.0114420714898 -0.18985183537 -0.0162312015891 -15.0709614397 -0.428588752934
1616643300.03 -0.550553124299 0.0123169958835 -0.205064311624 -0.00726132746786 -15.0709614397 -0.428588752934
1616643300.08 -0.577217749848 0.0152573619065 -0.205064311624 -0.00726132746786 -15.0578844239 -0.428496644515
1616643300.13 -0.59054813056 0.0157801907093 -0.235489279032 0.0 -15.0578844239 -0.428496644515
1616643300.18 -0.599999919342 0.0167059502256 -0.235489279032 0.0 -15.0401825242 -0.42839545272
1616643300.23 -0.599999914486 0.0179106986754 -0.250701785088 0.00555277988315 -15.0401825242 -0.42839545272
1616643300.28 -0.599999912446 0.028593437777 -0.250701785088 0.00555277988315 -15.017200948 -0.428239744032
1616643300.33 -0.6 0.0370804584362 -0.273824751377 0.00982414931059 -15.017200948 -0.428239744032
1616643300.38 -0.599999669839 0.0407810187411 -0.273824751377 0.00982414931059 -14.9949698229 -0.42804483226
1616643300.43 -0.599999991569 0.0391733690448 -0.289037257433 0.0162312015891 -14.9949698229 -0.42804483226
1616643300.48 -0.599999770905 0.0396879594871 -0.289037257433 0.0162312015891 -14.9673186393 -0.427841385363
1616643300.53 -0.599999938668 0.0408191109112 -0.311551719904 0.0230653937906 -14.9673186393 -0.427841385363
1616643300.58 -0.599999966133 0.0551517478694 -0.311551719904 0.0230653937906 -14.9374299381 -0.427562701335
1616643300.63 -0.599999758344 0.0526324391363 -0.334674715996 0.0290453098714 -14.9374299381 -0.427562701335
1616643300.68 -0.599999685433 0.0609422612352 -0.334674715996 0.0290453098714 -14.9052249195 -0.427274582505
1616643300.73 -0.599999793443 0.053491550277 -0.357189178467 0.0358795002103 -14.9052249195 -0.427274582505
1616643300.78 -0.599999891857 0.0657339684229 -0.357189178467 0.0358795002103 -14.8887510689 -0.426981358041
1616643300.83 -0.599999976374 0.0575552684677 -0.380312174559 0.0431408286095 -14.8887510689 -0.426981358041
1616643300.88 -0.599999553778 0.0653845829709 -0.380312174559 0.0431408286095 -14.8522264322 -0.426652693606
1616643300.93 -0.599991546598 0.0578594668003 -0.40282663703 0.049547880888 -14.8522264322 -0.426652693606
1616643300.98 -0.599999978268 0.0582129682352 -0.40282663703 0.049547880888 -14.8133706171 -0.426344885114
1616643301.03 -0.599999884801 0.053151594881 -0.425949603319 0.0542463883758 -14.8133706171 -0.426344885114
1616643301.08 -0.59999997531 0.0730923655669 -0.425949603319 0.0542463883758 -14.7715147138 -0.425914942666
1616643301.13 -0.599999362197 0.0682766338019 -0.441162109375 0.0563820712268 -14.7715147138 -0.425914942666
1616643301.18 -0.599999773334 0.0643760676821 -0.441162109375 0.0563820712268 -14.7281768029 -0.425538932046
1616643301.23 -0.599999944799 0.0626587760701 -0.471587061882 0.0602263025939 -14.7281768029 -0.425538932046
1616643301.28 -0.599999993394 0.0775345972812 -0.471587061882 0.0623619928956 -14.7115585582 -0.425110794658
1616643301.33 -0.599999702744 0.0718784662706 -0.471587061882 0.0623619928956 -14.7115585582 -0.425110794658
1616643301.38 -0.599999888452 0.0681626309307 -0.486799567938 0.0657790824771 -14.6631595091 -0.42468509218
1616643301.43 -0.599999473717 0.0693099163318 -0.486799567938 0.0657790824771 -14.6631595091 -0.42468509218
1616643301.48 -0.599999828553 0.0676210817075 -0.509314060211 0.0679147690535 -14.6628770828 -0.424682617188
1616643301.53 -0.599999828553 0.0676210817075 -0.509314060211 0.0679147690535 -14.6628770828 -0.424682617188
1616643301.58 -0.599999703486 0.060891507713 -0.509314060211 0.0679147690535 -14.6122858258 -0.424352202739
1616643301.63 -0.599999809735 0.0522960299113 -0.532437026501 0.0687690451741 -14.6122858258 -0.424352202739
1616643301.68 -0.599999754322 0.0522489874372 -0.532437026501 0.0687690451741 -14.5571133973 -0.424069324834
1616643301.73 -0.599999977943 0.0425524631998 -0.554951488972 0.0691961795092 -14.5571133973 -0.424069324834
1616643301.79 -0.599999789624 0.0389895547245 -0.554951488972 0.0691961795092 -14.5025253573 -0.423923726554
1616643301.84 -0.599999995883 0.0305564266679 -0.593286991119 0.0670604929328 -14.5025253573 -0.423923726554
1616643301.89 -0.599999835828 0.033093952397 -0.593286991119 0.0670604929328 -14.4753465355 -0.423772118664
1616643301.94 -0.599999835828 0.033093952397 -0.61580145359 0.0597991682589 -14.4753465355 -0.423772118664
1616643301.99 -0.586666507063 0.0231055566656 -0.61580145359 0.0597991682589 -14.2992621325 -0.423990267324
1616643302.04 -0.573333798184 0.0133896806111 -0.63892441988 0.0525378398597 -14.2992621325 -0.423990267324
1616643302.09 -0.586409149222 0.000637396111924 -0.63892441988 0.0525378398597 -14.2693404791 -0.424279794966
1616643302.14 -0.581938540768 -0.00933724166128 -0.63892441988 0.0431408286095 -14.2693404791 -0.424279794966
1616643302.19 -0.599999984368 -0.0221277875952 -0.63892441988 0.0431408286095 -14.2053038892 -0.424748096556
1616643302.24 -0.599999878887 -0.0284194379513 -0.63892441988 0.0294724479318 -14.2053038892 -0.424748096556
1616643302.29 -0.599999753234 -0.0307399958471 -0.646226406097 0.0111055597663 -14.204916954 -0.42475092411
1616643302.34 -0.599999936775 -0.0180173450524 -0.646226406097 0.0111055597663 -14.204916954 -0.42475092411
1616643302.39 -0.599999510423 -0.0170262503121 -0.63892441988 -0.00384423229843 -14.1828745302 -0.422737950203
1616643302.44 -0.599999510423 -0.0170262503121 -0.63892441988 -0.00384423229843 -14.1828745302 -0.422737950203
1616643302.49 -0.587280341034 -0.0269702023609 -0.646226406097 -0.0106784226373 -14.0419807945 -0.423399513113
1616643302.54 -0.6 -0.0369667787349 -0.646226406097 -0.0106784226373 -14.0419807945 -0.423399513113
1616643302.59 -0.599999739723 -0.046334093399 -0.63892441988 -0.0170854777098 -13.9772190644 -0.424125937395
1616643302.64 -0.599999975324 -0.0504286646169 -0.63892441988 -0.0170854777098 -13.9772190644 -0.424125937395
1616643302.69 -0.599999712806 -0.0612803660057 -0.631013929844 -0.0252010785043 -13.954680729 -0.424924250724
1616643302.74 -0.599999712806 -0.0612803660057 -0.631013929844 -0.0252010785043 -13.954680729 -0.424924250724
1616643302.79 -0.592468257377 -0.0712207906291 -0.631013929844 -0.03545236215 -13.8905646343 -0.425694589734
1616643302.84 -0.599999978777 -0.0811809571806 -0.631013929844 -0.03545236215 -13.8905646343 -0.425694589734
1616643302.89 -0.599999978777 -0.0811809571806 -0.631013929844 -0.0478393360972 -13.7164396261 -0.427177008757
1616643302.94 -0.586666652124 -0.090764481758 -0.631013929844 -0.0478393360972 -13.7164396261 -0.427177008757
1616643302.99 -0.573334543243 -0.0903051022504 -0.631013929844 -0.0606534406543 -13.6511506881 -0.427798373486
1616643303.04 -0.586667847637 -0.0887049789965 -0.631013929844 -0.0606534406543 -13.6511506881 -0.427798373486
1616643303.09 -0.599999968904 -0.0836581615703 -0.623711943626 -0.0709047242999 -13.6403234748 -0.428306700268
1616643303.14 -0.599999967147 -0.0785208724503 -0.623711943626 -0.0709047242999 -13.6403234748 -0.428306700268
1616643303.19 -0.591447801703 -0.0833707372666 -0.61580145359 -0.077311784029 -13.578577562 -0.428627291119
1616643303.24 -0.599998985462 -0.0737283839479 -0.61580145359 -0.077311784029 -13.578577562 -0.428627291119
1616643303.29 -0.599999932901 -0.0688452906685 -0.61580145359 -0.0798745974898 -13.5511150663 -0.428911684451
1616643303.34 -0.592773512263 -0.0588573466911 -0.61580145359 -0.0798745974898 -13.5511150663 -0.428911684451
1616643303.39 -0.599999937405 -0.0688362787166 -0.608499467373 -0.0798745974898 -13.4402658662 -0.428970907715
1616643303.44 -0.599999993194 -0.059480276949 -0.608499467373 -0.0798745974898 -13.4402658662 -0.428970907715
1616643303.49 -0.586666670043 -0.049480277236 -0.608499467373 -0.0790203362703 -13.3796530981 -0.42880551637
1616643303.54 -0.57333336468 -0.0394802788567 -0.608499467373 -0.0790203362703 -13.3796530981 -0.42880551637
1616643303.59 -0.565668090673 -0.0194803083652 -0.608499467373 -0.0713318660855 -13.3791503906 -0.428804129362
1616643303.64 -0.565668090673 -0.0194803083652 -0.608499467373 -0.0713318660855 -13.3791503906 -0.428804129362
1616643303.69 -0.565665710595 -0.00189968031451 -0.608499467373 -0.0559549331665 -13.3355298593 -0.425767797914
1616643303.74 -0.565665710595 -0.00189968031451 -0.608499467373 -0.0559549331665 -13.3355298593 -0.425767797914
1616643303.79 -0.55233241835 0.00810031560778 -0.593286991119 -0.0363066382706 -13.2106399478 -0.419830355705
1616643303.84 -0.525666181814 0.0281002934962 -0.593286991119 -0.0363066382706 -13.2106399478 -0.419830355705
1616643303.89 -0.512332860776 0.0381002936238 -0.593286991119 -0.0166583396494 -13.1460047244 -0.41711290257
1616643303.94 -0.49899956739 0.0481002899978 -0.593286991119 -0.0166583396494 -13.1460047244 -0.41711290257
1616643303.99 -0.485666249505 0.0581002898739 -0.585376441479 0.00469850609079 -13.0600228229 -0.413886881056
1616643304.04 -0.49899958027 0.0681002904397 -0.585376441479 0.00469850609079 -13.0600228229 -0.413886881056
1616643304.09 -0.485666268672 0.078100290267 -0.570163965225 0.02648248896 -13.0015810013 -0.412468620585
1616643304.14 -0.474696391868 0.0980998261044 -0.570163965225 0.02648248896 -13.0015810013 -0.412468620585
1616643304.19 -0.50136100705 0.118099796371 -0.562862038612 0.0465579256415 -12.944487231 -0.411122336667
1616643304.24 -0.514679257632 0.128099796126 -0.562862038612 0.0465579256415 -12.944487231 -0.411122336667
1616643304.3 -0.541344871301 0.148099701672 -0.562862038612 0.0730404108763 -12.9019704911 -0.409291895644
1616643304.35 -0.568011306179 0.16809967753 -0.562862038612 0.0730404108763 -12.9019704911 -0.409291895644
1616643304.4 -0.581344598845 0.178099672883 -0.539739012718 0.103794269264 -12.9018249512 -0.409285575151
1616643304.45 -0.59467608661 0.188099485422 -0.539739012718 0.103794269264 -12.9018249512 -0.409285575151
1616643304.5 -0.599999534284 0.208099407781 -0.532437026501 0.136256679893 -12.8420519156 -0.40753848268
1616643304.55 -0.599999938854 0.218099400392 -0.532437026501 0.165729135275 -12.8420519156 -0.40753848268
1616643304.6 -0.599994505548 0.225314945038 -0.532437026501 0.165729135275 -12.7795804574 -0.405920067125
1616643304.65 -0.6 0.223872402138 -0.524526536465 0.192638754845 -12.7795804574 -0.405920067125
1616643304.7 -0.6 0.223872402137 -0.524526536465 0.192638754845 -12.7265723015 -0.404596851854
1616643304.75 -0.586666699774 0.216409263869 -0.517224550247 0.209724232554 -12.7265723015 -0.404596851854
1616643304.8 -0.599999847042 0.206632572204 -0.517224550247 0.209724232554 -12.6736776388 -0.40360454491
1616643304.85 -0.599999258536 0.206633212423 -0.547649502754 0.217839822173 -12.6736776388 -0.40360454491
1616643304.9 -0.599999978148 0.207942131042 -0.547649502754 0.217839822173 -12.6215233928 -0.40231030989
1616643304.95 -0.599999988885 0.207984616111 -0.562862038612 0.21912124753 -12.6215233928 -0.40231030989
1616643305.0 -0.599999988756 0.207985034618 -0.562862038612 0.21912124753 -12.566202392 -0.40124443205
1616643305.05 -0.586666995468 0.197985221071 -0.593286991119 0.21912124753 -12.566202392 -0.40124443205
1616643305.1 -0.582663036809 0.198305508017 -0.593286991119 0.21912124753 -12.5150500226 -0.40444377499
1616643305.15 -0.569329827305 0.188305559381 -0.593286991119 0.21912124753 -12.5150500226 -0.40444377499
1616643305.2 -0.595996003956 0.169097537587 -0.623711943626 0.216985553503 -12.4545083445 -0.404357553073
1616643305.25 -0.599999905299 0.159097560313 -0.623711943626 0.216985553503 -12.4545083445 -0.404357553073
1616643305.3 -0.599999972496 0.149526216145 -0.623711943626 0.205879986286 -12.45429039 -0.404357194901
1616643305.35 -0.599999888923 0.139554104422 -0.623711943626 0.205879986286 -12.45429039 -0.404357194901
1616643305.4 -0.59999998658 0.138964079662 -0.631013929844 0.184523150325 -12.3752213501 -0.408971319476
1616643305.45 -0.575803853803 0.119216942034 -0.631013929844 0.184523150325 -12.3752213501 -0.408971319476
1616643305.5 -0.579123999014 0.109216946596 -0.61580145359 0.164874851704 -12.3124720256 -0.416023676003
1616643305.55 -0.565790665322 0.0992169460185 -0.61580145359 0.164874851704 -12.3124720256 -0.416023676003
1616643305.6 -0.555300211492 0.0892169468516 -0.61580145359 0.144372269511 -12.2488047642 -0.417980618705
1616643305.65 -0.541967213573 0.079216952555 -0.61580145359 0.144372269511 -12.2488047642 -0.417980618705
1616643305.7 -0.555300544671 0.0692169523024 -0.61580145359 0.122588291764 -12.1859965894 -0.420459442004
1616643305.75 -0.560951292973 0.0592169570805 -0.61580145359 0.122588291764 -12.1859965894 -0.420459442004
1616643305.8 -0.560953024574 0.04033048704 -0.608499467373 0.100804314017 -12.1856412888 -0.420473486185
1616643305.85 -0.547619693485 0.0303304867238 -0.608499467373 0.100804314017 -12.1856412888 -0.420473486185
1616643305.9 -0.547592474098 0.0103306656181 -0.593286991119 0.0760303661227 -12.1391181759 -0.423159213673
1616643305.95 -0.534259267857 0.000330677855076 -0.593286991119 0.0760303661227 -12.1391181759 -0.423159213673
1616643306.0 -0.54759216237 -0.00966923652714 -0.593286991119 0.0499750189483 -12.0786970484 -0.428003683289
1616643306.05 -0.534258916558 -0.0196692247215 -0.593286991119 0.0499750189483 -12.0786970484 -0.428003683289
1616643306.1 -0.547592248723 -0.0296692253807 -0.570163965225 0.024773940444 -12.0158583395 -0.431917588777
1616643306.15 -0.534259567021 -0.0396691391381 -0.570163965225 0.024773940444 -12.0158583395 -0.431917588777
1616643306.2 -0.50759582341 -0.0596689253754 -0.562862038612 0.00213568471372 -11.9325640348 -0.436175809304
1616643306.25 -0.49426249056 -0.0696689259198 -0.562862038612 0.00213568471372 -11.9325640348 -0.436175809304
1616643306.3 -0.493729309369 -0.0892844158478 -0.554951488972 -0.0230653937906 -11.8753932513 -0.440459749616
1616643306.35 -0.480396798261 -0.09928439867 -0.554951488972 -0.0230653937906 -11.856425506 -0.444796366885
1616643306.4 -0.507057743726 -0.119284369706 -0.547649502754 -0.049547880888 -11.856425506 -0.444796366885
1616643306.45 -0.520391076081 -0.12706868779 -0.547649502754 -0.049547880888 -11.7959347811 -0.449354851196
1616643306.5 -0.53369087253 -0.137068661999 -0.539739012718 -0.0764575079083 -11.7959347811 -0.449354851196
1616643306.55 -0.533691433856 -0.157068645015 -0.539739012718 -0.0764575079083 -11.7278077652 -0.453996881594
1616643306.6 -0.520358341393 -0.167068629729 -0.524526536465 -0.101231448352 -11.7278077652 -0.453996881594
1616643306.65 -0.506984531678 -0.19572564009 -0.524526536465 -0.101231448352 -11.6504952788 -0.455128003379
1616643306.7 -0.520313249982 -0.20047685481 -0.524526536465 -0.128995358944 -11.6504952788 -0.455128003379
1616643306.75 -0.546976111568 -0.212260719738 -0.524526536465 -0.128995358944 -11.5964653802 -0.459501314074
1616643306.8 -0.560297271893 -0.213124544407 -0.524526536465 -0.158040672541 -11.5964653802 -0.459501314074
1616643306.85 -0.546963945314 -0.223124544738 -0.524526536465 -0.158040672541 -11.5205082969 -0.462671567656
1616643306.9 -0.546960373707 -0.243124166638 -0.509314060211 -0.181106045842 -11.5205082969 -0.462671567656
1616643306.95 -0.533631701504 -0.253123950702 -0.509314060211 -0.181106045842 -11.4680060537 -0.466626459362
1616643307.0 -0.560292705003 -0.2633199941 -0.502012014389 -0.202462896705 -11.4680060537 -0.466626459362
1616643307.05 -0.573626029814 -0.260319621506 -0.502012014389 -0.202462896705 -11.3930886342 -0.468161556284
1616643307.1 -0.589224027076 -0.27771220121 -0.509314060211 -0.225101158023 -11.3930886342 -0.468161556284
1616643307.15 -0.575890915408 -0.287712198219 -0.509314060211 -0.225101158023 -11.3414101649 -0.47143051514
1616643307.2 -0.589223844435 -0.292044362655 -0.517224550247 -0.243040904403 -11.3414101649 -0.47143051514
1616643307.25 -0.589211581372 -0.306331922503 -0.517224550247 -0.243040904403 -11.3067352129 -0.467898943749
1616643307.3 -0.599998714553 -0.306963450144 -0.539739012718 -0.260980665684 -11.3067352129 -0.467898943749
1616643307.35 -0.586759667691 -0.316962782025 -0.554951488972 -0.278493255377 -11.2591377084 -0.47089569738
1616643307.4 -0.6 -0.321305111648 -0.554951488972 -0.278493255377 -11.2591377084 -0.47089569738
1616643307.46 -0.586670402889 -0.331257767517 -0.570163965225 -0.294297337532 -11.1419226317 -0.466481455907
1616643307.51 -0.587776779444 -0.336497248386 -0.570163965225 -0.294297337532 -11.1419226317 -0.466481455907
1616643307.56 -0.599926186572 -0.341287055684 -0.593286991119 -0.30796572566 -11.0818007933 -0.467739033412
1616643307.61 -0.599998884271 -0.349634764694 -0.593286991119 -0.30796572566 -11.0818007933 -0.467739033412
1616643307.66 -0.586665696589 -0.359634758812 -0.608499467373 -0.320352673531 -11.0197379317 -0.468275120853
1616643307.71 -0.599996680074 -0.379632387605 -0.608499467373 -0.320352673531 -11.0197379317 -0.468275120853
1616643307.76 -0.599973675486 -0.389611707208 -0.623711943626 -0.334448218346 -11.0581836566 -0.482773323808
1616643307.81 -0.599999122059 -0.399610893088 -0.623711943626 -0.334448218346 -11.0581836566 -0.482773323808
1616643307.86 -0.599999288877 -0.379613388802 -0.61580145359 -0.355805039406 -10.9965234325 -0.457638957138
1616643307.91 -0.599999998205 -0.369613423197 -0.61580145359 -0.355805039406 -10.9965234325 -0.457638957138
1616643307.96 -0.586666691969 -0.379613422231 -0.623711943626 -0.368619173765 -10.861593257 -0.45621423476
1616643308.01 -0.599999612068 -0.3896128171 -0.623711943626 -0.368619173765 -10.861593257 -0.45621423476
1616643308.06 -0.599999610637 -0.398896616854 -0.623711943626 -0.373744785786 -10.7991002206 -0.453163727219
1616643308.11 -0.599999815095 -0.386554025436 -0.623711943626 -0.373744785786 -10.7991002206 -0.453163727219
1616643308.16 -0.599999483128 -0.3865550843 -0.623711943626 -0.37972471118 -10.7726236111 -0.440190390898
1616643308.21 -0.599999484397 -0.386540837635 -0.623711943626 -0.37972471118 -10.7726236111 -0.440190390898
1616643308.26 -0.599999482412 -0.386540845793 -0.623711943626 -0.382287532091 -10.7725467682 -0.440151751041
1616643308.31 -0.599999482422 -0.386540845774 -0.623711943626 -0.382287532091 -10.7725467682 -0.440151751041
1616643308.36 -0.586669567754 -0.396537845636 -0.61580145359 -0.383568942547 -10.7103468458 -0.435446987288
1616643308.41 -0.599999690769 -0.40645878528 -0.61580145359 -0.383568942547 -10.7103468458 -0.435446987288
1616643308.46 -0.599998896563 -0.426455231735 -0.61580145359 -0.386558920145 -10.7027042797 -0.447704917969
1616643308.51 -0.599999689432 -0.436453921209 -0.61580145359 -0.386558920145 -10.7027042797 -0.447704917969
1616643308.56 -0.586734427197 -0.446450413995 -0.61580145359 -0.397237330675 -10.5106172645 -0.432212049314
1616643308.61 -0.599984374537 -0.446453378337 -0.61580145359 -0.397237330675 -10.5106172645 -0.432212049314
1616643308.66 -0.599999674263 -0.416513189608 -0.61580145359 -0.414322793484 -10.5021623337 -0.406711190694
1616643308.71 -0.6 -0.406513201015 -0.61580145359 -0.414322793484 -10.5021623337 -0.406711190694
1616643308.76 -0.599976023089 -0.396947395163 -0.623711943626 -0.422438412905 -10.502114296 -0.406540066004
1616643308.81 -0.599999594125 -0.389495487268 -0.623711943626 -0.422438412905 -10.502114296 -0.406540066004
1616643308.86 -0.599999677988 -0.386485044638 -0.623711943626 -0.422438412905 -10.4405215014 -0.396310790208
1616643308.91 -0.599999731247 -0.386543168437 -0.623711943626 -0.419021308422 -10.4405215014 -0.396310790208
1616643308.96 -0.599999610238 -0.386543816322 -0.623711943626 -0.419021308422 -10.4401664734 -0.396251827478
1616643309.01 -0.599999610238 -0.386543816322 -0.608499467373 -0.409197151661 -10.4401664734 -0.396251827478
1616643309.06 -0.586666602231 -0.396543762225 -0.608499467373 -0.409197151661 -10.308997305 -0.389900520722
1616643309.11 -0.58694807386 -0.416527703731 -0.608499467373 -0.400227278471 -10.308997305 -0.389900520722
1616643309.16 -0.599998333389 -0.436521312463 -0.608499467373 -0.400227278471 -10.2488061356 -0.375916610962
1616643309.21 -0.599988605615 -0.456395082844 -0.600588917732 -0.397237330675 -10.2488061356 -0.375916610962
1616643309.26 -0.599999991447 -0.466389273086 -0.600588917732 -0.397237330675 -10.2177892053 -0.357110207212
1616643309.31 -0.599971604655 -0.483534682775 -0.600588917732 -0.402362972498 -10.2177892053 -0.357110207212
1616643309.36 -0.599999856723 -0.486123034337 -0.593286991119 -0.424574106932 -10.1599798073 -0.341912402071
1616643309.41 -0.599999856723 -0.486123034337 -0.593286991119 -0.424574106932 -10.1599798073 -0.341912402071
1616643309.46 -0.586667179271 -0.485369355039 -0.593286991119 -0.447212338448 -10.1026812143 -0.32354384134
1616643309.51 -0.599999825987 -0.483701514094 -0.593286991119 -0.447212338448 -10.1026812143 -0.32354384134
1616643309.56 -0.59999955896 -0.453702828649 -0.593286991119 -0.463016420603 -10.0457415383 -0.305262818263
1616643309.61 -0.599999994314 -0.443702866989 -0.593286991119 -0.463016420603 -10.0457415383 -0.305262818263
1616643309.66 -0.6 -0.423703232939 -0.600588917732 -0.467287778854 -9.98914498215 -0.285890728352
1616643309.71 -0.599999797567 -0.413703619317 -0.600588917732 -0.467287778854 -9.98914498215 -0.285890728352
1616643309.76 -0.599999996783 -0.393703664619 -0.61580145359 -0.460453599691 -9.95739565388 -0.267903578925
1616643309.81 -0.599999996783 -0.393703664619 -0.61580145359 -0.460453599691 -9.95739565388 -0.267903578925
1616643309.86 -0.599994073761 -0.413487187213 -0.61580145359 -0.436533927917 -9.89935933486 -0.246236614428
1616643309.91 -0.599999902745 -0.413241000728 -0.61580145359 -0.436533927917 -9.89935933486 -0.246236614428
1616643309.96 -0.5999994785 -0.393242651291 -0.61580145359 -0.422438412905 -9.84161773025 -0.22320120875
1616643310.01 -0.59999995731 -0.38324268883 -0.61580145359 -0.422438412905 -9.84161773025 -0.22320120875
1616643310.06 -0.599999448005 -0.374565823937 -0.623711943626 -0.412187129259 -9.7845676347 -0.198731766882
1616643310.11 -0.599999448005 -0.374565823937 -0.623711943626 -0.412187129259 -9.7845676347 -0.198731766882
1616643310.16 -0.58666634197 -0.384565373908 -0.61580145359 -0.398091614246 -9.7274715451 -0.172913587747
1616643310.21 -0.599997482138 -0.394565244084 -0.61580145359 -0.398091614246 -9.7274715451 -0.172913587747
1616643310.27 -0.599999473013 -0.394492288227 -0.61580145359 -0.388267457485 -9.67195682846 -0.145353051781
1616643310.32 -0.6 -0.394525748099 -0.61580145359 -0.388267457485 -9.67195682846 -0.145353051781
1616643310.37 -0.59999993102 -0.374526130424 -0.608499467373 -0.384850382805 -9.61695256181 -0.116780817669
1616643310.42 -0.599999878646 -0.354526369843 -0.608499467373 -0.384850382805 -9.61695256181 -0.116780817669
1616643310.47 -0.599999969596 -0.344526417596 -0.608499467373 -0.382287532091 -9.58859082283 -0.0964184891502
1616643310.52 -0.599999949771 -0.337775474146 -0.608499467373 -0.382287532091 -9.58859082283 -0.0964184891502
1616643310.57 -0.599999404627 -0.339561372953 -0.608499467373 -0.371181994677 -9.54018614577 -0.0707152780535
1616643310.62 -0.599999366117 -0.349472532076 -0.608499467373 -0.357513576746 -9.54018614577 -0.0707152780535
1616643310.67 -0.59999980351 -0.349472643937 -0.608499467373 -0.357513576746 -9.48775772358 -0.0402685323094
1616643310.72 -0.599999768171 -0.346479926708 -0.608499467373 -0.350252270699 -9.48775772358 -0.0402685323094
1616643310.77 -0.599999997576 -0.346479811977 -0.608499467373 -0.350252270699 -9.42998249667 -0.0080678986728
1616643310.82 -0.599999223267 -0.34648078879 -0.61580145359 -0.345980912447 -9.42998249667 -0.0080678986728
1616643310.87 -0.599999992955 -0.336480790434 -0.61580145359 -0.345980912447 -9.37853245905 0.0249269283251
1616643310.92 -0.599997539447 -0.34084287867 -0.631013929844 -0.342990934849 -9.37853245905 0.0249269283251
1616643310.97 -0.599999413741 -0.349567448492 -0.631013929844 -0.342990934849 -9.34344665618 0.0598146313076
1616643311.02 -0.599999701309 -0.351765576044 -0.631013929844 -0.340855240822 -9.34344665618 0.0598146313076
1616643311.07 -0.599998761642 -0.351766018111 -0.631013929844 -0.340855240822 -9.30169115576 0.0837574952771
1616643311.12 -0.599998809393 -0.351772754292 -0.631013929844 -0.340855240822 -9.30169115576 0.0837574952771
1616643311.17 -0.599998758363 -0.351772715289 -0.63892441988 -0.340428113937 -9.30156612396 0.0838288962841
1616643311.22 -0.599998758363 -0.351772715289 -0.63892441988 -0.340428113937 -9.30156612396 0.0838288962841
1616643311.27 -0.586665740811 -0.361772618594 -0.63892441988 -0.340428113937 -9.19862350668 0.159669613533
1616643311.32 -0.559999120999 -0.381772616021 -0.631013929844 -0.340855240822 -9.19862350668 0.159669613533
1616643311.37 -0.586655372159 -0.401769331814 -0.631013929844 -0.340855240822 -9.14749242513 0.199134004248
1616643311.42 -0.59998194115 -0.421759223899 -0.631013929844 -0.350679427385 -9.14749242513 0.199134004248
1616643311.47 -0.599997739828 -0.43175714683 -0.631013929844 -0.350679427385 -9.11605239517 0.222149001739
1616643311.52 -0.599992844709 -0.451752940237 -0.631013929844 -0.375453352928 -9.11605239517 0.222149001739
1616643311.57 -0.599994230489 -0.461745689615 -0.631013929844 -0.375453352928 -9.06782632871 0.261437823464
1616643311.62 -0.599992245326 -0.481731079483 -0.61580145359 -0.405780076981 -9.06782632871 0.261437823464
1616643311.67 -0.599999092975 -0.501714686659 -0.61580145359 -0.405780076981 -9.06763362885 0.26159492135
1616643311.72 -0.599999092975 -0.501714686659 -0.623711943626 -0.43824249506 -9.06763362885 0.26159492135
1616643311.77 -0.586671857205 -0.511714260392 -0.623711943626 -0.43824249506 -9.02063160764 0.303057299911
1616643311.82 -0.599991964254 -0.531705037244 -0.61580145359 -0.468142062426 -9.02063160764 0.303057299911
1616643311.87 -0.599999906883 -0.541704601238 -0.61580145359 -0.468142062426 -8.97434838078 0.348139551206
1616643311.92 -0.599999005782 -0.561699988592 -0.61580145359 -0.493343144655 -8.97434838078 0.348139551206
1616643311.97 -0.599999538705 -0.57169766374 -0.61580145359 -0.493343144655 -8.92928035822 0.389975036981
1616643312.02 -0.599999823093 -0.58169671232 -0.600588917732 -0.518971323967 -8.92928035822 0.389975036981
1616643312.07 -0.588258321341 -0.591694445267 -0.600588917732 -0.518971323967 -8.8877542092 0.409625895294
1616643312.12 -0.59999372419 -0.601684336331 -0.61580145359 -0.54502671957 -8.8877542092 0.409625895294
1616643312.17 -0.599999582608 -0.61168297069 -0.61580145359 -0.54502671957 -8.86121279884 0.456302007869
1616643312.22 -0.599858163024 -0.631316469307 -0.608499467373 -0.568519234657 -8.86121279884 0.456302007869
1616643312.27 -0.59999998598 -0.641316202017 -0.608499467373 -0.568519234657 -8.81475635406 0.500015387354
1616643312.32 -0.599999739432 -0.651313260489 -0.61580145359 -0.590303242207 -8.81475635406 0.500015387354
1616643312.37 -0.587079503467 -0.661311248245 -0.61580145359 -0.590303242207 -8.77254031792 0.555927683969
1616643312.42 -0.599999534334 -0.671306512362 -0.61580145359 -0.613795757294 -8.77254031792 0.555927683969
1616643312.47 -0.599999801844 -0.669732131265 -0.61580145359 -0.613795757294 -8.73147798557 0.602621660779
1616643312.52 -0.599999950247 -0.669729589058 -0.61580145359 -0.635152578354 -8.73147798557 0.602621660779
1616643312.57 -0.599999670272 -0.668280169404 -0.61580145359 -0.635152578354 -8.715872463 0.628892697354
1616643312.62 -0.599999670272 -0.668280169404 -0.623711943626 -0.649248123169 -8.715872463 0.628892697354
1616643312.67 -0.586679338183 -0.658280269039 -0.623711943626 -0.649248123169 -8.67978958663 0.669448416755
1616643312.72 -0.599999978125 -0.65306263753 -0.623711943626 -0.657790839672 -8.67978958663 0.669448416755
1616643312.77 -0.586687097392 -0.643064944735 -0.623711943626 -0.657790839672 -8.64143340751 0.719118724686
1616643312.82 -0.599999970185 -0.633899041425 -0.623711943626 -0.661635041237 -8.64143340751 0.719118724686
1616643312.87 -0.573358721697 -0.613899352431 -0.623711943626 -0.661635041237 -8.60858332257 0.770114015554
1616643312.93 -0.573358721697 -0.613899352431 -0.623711943626 -0.655655145645 -8.60858332257 0.770114015554
1616643312.98 -0.573357843446 -0.5939014389 -0.623711943626 -0.655655145645 -8.57346587047 0.822141939131
1616643313.03 -0.586691128638 -0.583901908834 -0.61580145359 -0.638569712639 -8.57346587047 0.822141939131
1616643313.08 -0.599999904726 -0.573902463202 -0.61580145359 -0.638569712639 -8.57644497741 0.814961247656
1616643313.13 -0.586670466647 -0.553908213752 -0.608499467373 -0.614222884178 -8.57644497741 0.814961247656
1616643313.18 -0.599954798352 -0.543951199533 -0.608499467373 -0.614222884178 -8.55141836841 0.867448197595
1616643313.23 -0.599999179539 -0.533953775594 -0.600588917732 -0.586458981037 -8.55141836841 0.867448197595
1616643313.28 -0.58666869664 -0.523953827856 -0.600588917732 -0.586458981037 -8.5215393112 0.920122477889
1616643313.33 -0.599999976671 -0.513953909688 -0.593286991119 -0.558695137501 -8.5215393112 0.920122477889
1616643313.38 -0.586691848888 -0.503954602965 -0.593286991119 -0.558695137501 -8.49392564373 0.973248518506
1616643313.43 -0.586666257658 -0.483954827334 -0.585376441479 -0.535629689693 -8.49392564373 0.973248518506
1616643313.48 -0.599999590577 -0.473954859489 -0.585376441479 -0.535629689693 -8.46768024841 1.02702328726
1616643313.53 -0.599999773577 -0.463955093823 -0.593286991119 -0.512991428375 -8.46768024841 1.02702328726
1616643313.58 -0.599999603825 -0.443955623745 -0.593286991119 -0.512991428375 -8.48052103603 1.03349490971
1616643313.63 -0.599999812338 -0.433955772487 -0.593286991119 -0.488217502832 -8.48052103603 1.03349490971
1616643313.68 -0.599999697921 -0.413956394319 -0.593286991119 -0.488217502832 -8.45690181211 1.07774809139
1616643313.73 -0.599999731701 -0.403956744313 -0.608499467373 -0.459172189236 -8.45690181211 1.07774809139
1616643313.78 -0.599999628867 -0.383956973949 -0.608499467373 -0.459172189236 -8.43462493931 1.1339987028
1616643313.83 -0.599997255888 -0.363958897394 -0.608499467373 -0.431408286095 -8.43462493931 1.1339987028
1616643313.88 -0.599999926914 -0.353958942627 -0.608499467373 -0.431408286095 -8.41404131149 1.19095801068
1616643313.93 -0.599999948248 -0.343958985104 -0.608499467373 -0.401508718729 -8.41404131149 1.19095801068
1616643313.98 -0.59999947327 -0.323959642905 -0.608499467373 -0.401508718729 -8.39443831193 1.24886621302
1616643314.03 -0.6 -0.313959649743 -0.61580145359 -0.373744785786 -8.39443831193 1.24886621302
1616643314.08 -0.599999943865 -0.293960973358 -0.61580145359 -0.373744785786 -8.39260063604 1.2608909583
1616643314.13 -0.599999809469 -0.283961067309 -0.608499467373 -0.34555375576 -8.39260063604 1.2608909583
1616643314.18 -0.599988974162 -0.26396767389 -0.608499467373 -0.34555375576 -8.37512886635 1.31909395829
1616643314.23 -0.59999951132 -0.253967739485 -0.608499467373 -0.317362755537 -8.37512886635 1.31909395829
1616643314.28 -0.599999967511 -0.243967770281 -0.608499467373 -0.317362755537 -8.36043046019 1.37758113485
1616643314.33 -0.599997829566 -0.223968805158 -0.608499467373 -0.29002597928 -8.36043046019 1.37758113485
1616643314.38 -0.59999911794 -0.203971101391 -0.608499467373 -0.262689203024 -8.34604572573 1.43692688489
1616643314.43 -0.599999711416 -0.193971202007 -0.608499467373 -0.262689203024 -8.34604572573 1.43692688489
1616643314.48 -0.599999997115 -0.173972474021 -0.608499467373 -0.232789620757 -8.34596252441 1.43727016449
1616643314.53 -0.599999997115 -0.173972474021 -0.608499467373 -0.232789620757 -8.34596252441 1.43727016449
1616643314.58 -0.599996933389 -0.153973609675 -0.600588917732 -0.204171448946 -8.33242147699 1.49673033343
1616643314.63 -0.599999949398 -0.143973659695 -0.600588917732 -0.204171448946 -8.33242147699 1.49673033343
1616643314.68 -0.586666836551 -0.133973670721 -0.600588917732 -0.178970366716 -8.30987603129 1.62034459117
1616643314.73 -0.599999341496 -0.123973969324 -0.600588917732 -0.178970366716 -8.30987603129 1.62034459117
1616643314.78 -0.599998734734 -0.113974245293 -0.608499467373 -0.155904978514 -8.30851045754 1.64857690258
1616643314.83 -0.599999284607 -0.103974930524 -0.608499467373 -0.155904978514 -8.30851045754 1.64857690258
1616643314.88 -0.599998126451 -0.0839759079715 -0.600588917732 -0.135829538107 -8.29891713229 1.70817011759
1616643314.93 -0.589524246872 -0.0639780592394 -0.600588917732 -0.135829538107 -8.29891713229 1.70817011759
1616643314.98 -0.599978905485 -0.0540149438367 -0.61580145359 -0.112337008119 -8.2897242895 1.76798290092
1616643315.03 -0.599999266966 -0.0440165788879 -0.61580145359 -0.112337008119 -8.2897242895 1.76798290092
1616643315.08 -0.58666875333 -0.034016748196 -0.61580145359 -0.0948243960738 -8.28142596056 1.84138161855
1616643315.13 -0.599999546009 -0.0240171584578 -0.61580145359 -0.0948243960738 -8.28142596056 1.84138161855
1616643315.18 -0.6 -0.00401785270411 -0.608499467373 -0.0700504556298 -8.27356557458 1.90228160197
1616643315.23 -0.599991614802 0.0159569856582 -0.608499467373 -0.0700504556298 -8.27356557458 1.90228160197
1616643315.28 -0.59999944553 0.0259548378108 -0.61580145359 -0.0465579256415 -8.26588852839 1.93906591888
1616643315.33 -0.599994275415 0.0459414455474 -0.61580145359 -0.0465579256415 -8.26588852839 1.93906591888
1616643315.38 -0.599995280462 0.0559312931362 -0.61580145359 -0.0196482986212 -8.26917495689 2.00073171089
1616643315.43 -0.599999860988 0.0759308034471 -0.61580145359 -0.0196482986212 -8.26917495689 2.00073171089
1616643315.48 -0.59999980303 0.0859301392426 -0.623711943626 0.00982414931059 -8.26210685541 2.0629153787
1616643315.53 -0.599998462465 0.105922491517 -0.623711943626 0.00982414931059 -8.26210685541 2.0629153787
1616643315.58 -0.599999110842 0.11592000528 -0.623711943626 0.0392965972424 -8.25577429315 2.14390955488
1616643315.63 -0.599993130267 0.125898905721 -0.623711943626 0.0687690451741 -8.25577429315 2.14390955488
1616643315.68 -0.599996525368 0.145859192192 -0.623711943626 0.0687690451741 -8.24932888895 2.20647649972
1616643315.73 -0.599999979609 0.155859132354 -0.623711943626 0.0978143513203 -8.24932888895 2.20647649972
1616643315.78 -0.599999115431 0.160833300463 -0.623711943626 0.0978143513203 -8.24308685909 2.24233268959
1616643315.83 -0.599998247722 0.158102667998 -0.61580145359 0.123869709671 -8.24308685909 2.24233268959
1616643315.89 -0.599998599747 0.158119464916 -0.61580145359 0.123869709671 -8.23707811859 2.37409601545
1616643315.94 -0.586665351741 0.148119465744 -0.61580145359 0.139673784375 -8.23707811859 2.37409601545
1616643315.99 -0.599999684799 0.144128219396 -0.61580145359 0.139673784375 -8.22300438387 2.45461887508
1616643316.04 -0.586666516421 0.134128221541 -0.61580145359 0.146935105324 -8.22300438387 2.45461887508
1616643316.09 -0.599999982352 0.128396922629 -0.61580145359 0.146935105324 -8.21634576085 2.51697434064
1616643316.14 -0.599999972058 0.128325988328 -0.61580145359 0.146935105324 -8.21634576085 2.51697434064
1616643316.19 -0.599999972059 0.128325988468 -0.61580145359 0.147362247109 -8.21631336212 2.51727843285
1616643316.24 -0.599999878703 0.119199824188 -0.623711943626 0.144372269511 -8.21631336212 2.51727843285
1616643316.29 -0.599999916086 0.119201913431 -0.623711943626 0.144372269511 -8.20288394639 2.54815399686
1616643316.34 -0.586666584879 0.109201913013 -0.61580145359 0.136683821678 -8.20288394639 2.54815399686
1616643316.39 -0.573334773777 0.0992019298775 -0.61580145359 0.136683821678 -8.19546013388 2.6854148889
1616643316.44 -0.586666822237 0.0938118614453 -0.623711943626 0.126005381346 -8.19546013388 2.6854148889
1616643316.49 -0.560000621532 0.0738118823517 -0.623711943626 0.126005381346 -8.18755743605 2.75570361199
1616643316.54 -0.546667774534 0.0638119123004 -0.608499467373 0.108492776752 -8.18755743605 2.75570361199
1616643316.59 -0.573329078908 0.0532487115281 -0.608499467373 0.108492776752 -8.17944961613 2.8166187719
1616643316.64 -0.55999613156 0.043248729717 -0.608499467373 0.0884173437953 -8.17944961613 2.8166187719
1616643316.69 -0.573323647132 0.0333254112484 -0.608499467373 0.0884173437953 -8.1710314746 2.87723971895
1616643316.74 -0.59995055493 0.0281232499561 -0.593286991119 0.0662062242627 -8.1710314746 2.87723971895
1616643316.79 -0.599994354112 0.0287613783095 -0.593286991119 0.0662062242627 -8.17097663879 2.8776345253
1616643316.84 -0.59999983818 0.0257111763212 -0.585376441479 0.0474121980369 -8.17097663879 2.8776345253
1616643316.89 -0.599999858543 0.0269651243025 -0.585376441479 0.0474121980369 -8.16294128193 2.85409272208
1616643316.94 -0.599999858543 0.0269651243025 -0.578074514866 0.0345980897546 -8.16294128193 2.85409272208
1616643316.99 -0.586666525832 0.0169651238933 -0.578074514866 0.0345980897546 -8.15419751719 2.98711319433
1616643317.04 -0.573333285401 0.00696513405554 -0.578074514866 0.0260553527623 -8.15419751719 2.98711319433
1616643317.09 -0.559999952609 -0.00303486634441 -0.578074514866 0.0260553527623 -8.14533621849 3.05525097404
1616643317.14 -0.546666624046 -0.0130348664745 -0.585376441479 0.0166583396494 -8.14533621849 3.05525097404
1616643317.19 -0.519999968758 -0.0330348666829 -0.585376441479 0.0166583396494 -8.13643352853 3.11268906051
1616643317.24 -0.506666637298 -0.0430348669906 -0.585376441479 0.00298995850608 -8.13643352853 3.11268906051
1616643317.29 -0.493333640155 -0.0530348365412 -0.585376441479 0.00298995850608 -8.12745113336 3.17013627563
1616643317.34 -0.480000647255 -0.0630348275424 -0.585376441479 -0.0158040653914 -8.12745113336 3.17013627563
1616643317.39 -0.453333982601 -0.0830348284413 -0.585376441479 -0.0158040653914 -8.11529941359 3.2251644576
1616643317.44 -0.453333982601 -0.0830348284413 -0.570163965225 -0.0392965972424 -8.11529941359 3.2251644576
1616643317.49 -0.426667318013 -0.103034829406 -0.570163965225 -0.0392965972424 -8.10614600716 3.28181798462
1616643317.54 -0.413333984257 -0.113034830041 -0.547649502754 -0.0615077167749 -8.10614600716 3.28181798462
1616643317.59 -0.400000717166 -0.123034823321 -0.547649502754 -0.0615077167749 -8.09695289415 3.34174334717
1616643317.64 -0.38666753877 -0.133034806242 -0.539739012718 -0.0832917019725 -8.09695289415 3.34174334717
1616643317.69 -0.360000881385 -0.15303480688 -0.539739012718 -0.0832917019725 -8.08821965045 3.39644026043
1616643317.74 -0.346667552926 -0.163034806913 -0.524526536465 -0.107638500631 -8.08821965045 3.39644026043
1616643317.79 -0.320000893135 -0.183034807859 -0.524526536465 -0.107638500631 -8.07987752681 3.44952667363
1616643317.84 -0.306667566745 -0.193034807971 -0.509314060211 -0.133266717196 -8.07987752681 3.44952667363
1616643317.89 -0.280001099262 -0.213034799039 -0.509314060211 -0.133266717196 -8.07176956615 3.49595353993
1616643317.94 -0.25333449355 -0.233034796253 -0.478889077902 -0.160603478551 -8.07176956615 3.49595353993
1616643317.99 -0.266667776353 -0.243034795646 -0.478889077902 -0.160603478551 -8.06398959018 3.54613658358
1616643318.04 -0.280001037229 -0.25303478526 -0.456374585629 -0.189648792148 -8.06398959018 3.54613658358
1616643318.09 -0.306666608234 -0.273034583592 -0.456374585629 -0.189648792148 -8.07032437982 3.59353618543
1616643318.14 -0.333333229547 -0.29303457714 -0.425949603319 -0.218266963959 -8.07032437982 3.59353618543
1616643318.19 -0.346666550141 -0.3030345737 -0.425949603319 -0.218266963959 -8.0638627026 3.63790374752
1616643318.24 -0.373333001357 -0.323034535806 -0.395524650812 -0.247312277555 -8.0638627026 3.63790374752
1616643318.29 -0.386666266686 -0.333034519399 -0.395524650812 -0.247312277555 -8.05802110822 3.67941052258
1616643318.34 -0.413329602853 -0.35303449904 -0.365099668503 -0.277639001608 -8.05802110822 3.67941052258
1616643318.39 -0.426662929693 -0.363034499208 -0.365099668503 -0.277639001608 -8.05244608512 3.71798817159
1616643318.44 -0.453329332268 -0.382793360246 -0.349887192249 -0.306684315205 -8.05244608512 3.71798817159
1616643318.49 -0.466662632298 -0.382109981514 -0.349887192249 -0.306684315205 -8.04762413475 3.7592762479
1616643318.54 -0.45741477611 -0.377958789306 -0.341976702213 -0.335302501917 -8.04762413475 3.7592762479
1616643318.59 -0.457416602411 -0.377958307918 -0.341976702213 -0.335302501917 -8.04314273782 3.80272541611
1616643318.64 -0.446119567285 -0.36905065591 -0.334674715996 -0.355805039406 -8.04314273782 3.80272541611
1616643318.69 -0.446119576665 -0.369050653413 -0.341976702213 -0.367337763309 -8.03914385461 3.8360897667
1616643318.75 -0.433779322239 -0.383648377713 -0.341976702213 -0.367337763309 -8.03914385461 3.8360897667
1616643318.8 -0.42543708772 -0.386294761355 -0.341976702213 -0.375026196241 -8.0351259926 3.8703546513
1616643318.85 -0.402786073621 -0.397678340181 -0.341976702213 -0.375026196241 -8.0351259926 3.8703546513
1616643318.9 -0.402661755995 -0.397742963946 -0.365099668503 -0.381860405207 -8.02814696674 3.90516035203
1616643318.95 -0.402658950275 -0.397744074064 -0.365099668503 -0.381860405207 -8.02814696674 3.90516035203
1616643319.0 -0.402659087339 -0.397743998968 -0.395524650812 -0.388267457485 -8.02811145782 3.90533733368
1616643319.05 -0.391035416629 -0.384355258561 -0.395524650812 -0.388267457485 -8.02811145782 3.90533733368
1616643319.1 -0.390356867697 -0.384368158693 -0.395524650812 -0.393393099308 -8.02432150169 3.94385043689
1616643319.15 -0.377023533845 -0.374368158094 -0.395524650812 -0.393393099308 -8.02432150169 3.94385043689
1616643319.2 -0.373793545881 -0.366545252243 -0.410737127066 -0.394247353077 -8.02087288061 3.98320293154
1616643319.25 -0.360460218526 -0.35654525531 -0.410737127066 -0.394247353077 -8.02087288061 3.98320293154
1616643319.3 -0.365970534067 -0.341252559808 -0.410737127066 -0.394247353077 -8.01780100742 4.02350060332
1616643319.35 -0.355102598235 -0.322988258838 -0.395524650812 -0.390830278397 -8.01780100742 4.02350060332
1616643319.4 -0.355105022489 -0.322987351122 -0.395524650812 -0.390830278397 -8.01226181111 4.06369633539
1616643319.45 -0.341771688589 -0.312987350547 -0.395524650812 -0.377161890268 -8.01226181111 4.06369633539
1616643319.5 -0.328438354972 -0.302987350078 -0.395524650812 -0.377161890268 -8.01039181989 4.10322069087
1616643319.55 -0.315105026748 -0.29298735791 -0.387614160776 -0.358795017004 -8.01039181989 4.10322069087
1616643319.6 -0.288438359932 -0.272987357754 -0.387614160776 -0.358795017004 -8.00914257505 4.1466251566
1616643319.65 -0.288438359932 -0.272987357754 -0.37240165472 -0.337438136339 -8.00914257505 4.1466251566
1616643319.7 -0.275105026297 -0.262987357669 -0.37240165472 -0.337438136339 -8.00856242336 4.18869128214
1616643319.75 -0.261771695352 -0.252987361316 -0.37240165472 -0.314372777939 -8.00856242336 4.18869128214
1616643319.8 -0.248438363601 -0.242987364858 -0.37240165472 -0.314372777939 -8.00837129556 4.22538158909
1616643319.85 -0.235105029806 -0.232987364603 -0.365099668503 -0.294297337532 -8.00837129556 4.22538158909
1616643319.9 -0.221771699222 -0.222987370113 -0.365099668503 -0.294297337532 -8.00837039948 4.22555541992
1616643319.95 -0.195105031477 -0.202987369384 -0.341976702213 -0.274649053812 -8.00837039948 4.22555541992
1616643320.0 -0.195105031477 -0.202987369384 -0.341976702213 -0.274649053812 -8.00836945179 4.2536909096
1616643320.05 -0.181771697753 -0.192987369004 -0.334674715996 -0.25500074029 -8.01056167192 4.28658406858
1616643320.1 -0.15510504223 -0.172987413226 -0.304249733686 -0.25500074029 -8.01056167192 4.28658406858
1616643320.15 -0.141771726851 -0.162987560907 -0.304249733686 -0.235779583454 -8.01136345548 4.31797560914
1616643320.2 -0.128438400456 -0.15298760858 -0.281126767397 -0.215277001262 -8.01136345548 4.31797560914
1616643320.25 -0.101771735295 -0.132987671856 -0.281126767397 -0.215277001262 -8.01238916697 4.35832245685
1616643320.3 -0.0751050765555 -0.112987834794 -0.281126767397 -0.215277001262 -8.01238916697 4.35832245685
1616643320.35 -0.0484384095834 -0.132987632954 -0.250701785088 -0.192211613059 -8.01342125458 4.38380850346
1616643320.4 -0.0217717653925 -0.152987557783 -0.250701785088 -0.192211613059 -8.01342125458 4.38380850346
1616643320.45 -0.00843843396847 -0.16298753292 -0.21297480166 -0.169146209955 -8.0143956552 4.40350319219
1616643320.5 0.00489489685969 -0.172987473344 -0.21297480166 -0.169146209955 -8.0143956552 4.40350319219
1616643320.55 0.0315603326148 -0.192975780488 -0.182549834251 -0.161030620337 -8.02202167923 4.42607771362
1616643320.6 0.0582269800037 -0.212975666167 -0.182549834251 -0.161030620337 -8.02202167923 4.42607771362
1616643320.65 0.0715603044532 -0.222975534743 -0.121699891984 -0.15974919498 -8.02423177323 4.44878516954
1616643320.71 0.0848936379259 -0.232975532707 -0.121699891984 -0.15974919498 -8.02423177323 4.44878516954
1616643320.76 0.111560305507 -0.252975532482 -0.0304249729961 -0.165729135275 -8.0256096529 4.48038874486
1616643320.81 0.12489363264 -0.262975503066 -0.0304249729961 -0.165729135275 -8.0256096529 4.48038874486
1616643320.86 0.15156024162 -0.282975395525 -0.0304249729961 -0.178543224931 -8.02581161716 4.48676464279
1616643320.91 0.178226890405 -0.302975312616 -0.0304249729961 -0.178543224931 -8.02581161716 4.48676464279
1616643320.96 0.191560214643 -0.312975219085 0.0225144792348 -0.198191523552 -8.02581214905 4.48678159714
1616643321.01 0.2182268136 -0.332974831533 0.0225144792348 -0.198191523552 -8.02581214905 4.48678159714
1616643321.06 0.231560011696 -0.342974667792 0.0760624334216 -0.226809710264 -8.02566215623 4.51117536542
1616643321.11 0.244893275201 -0.352974590926 0.0760624334216 -0.226809710264 -8.02566215623 4.51117536542
1616643321.16 0.271559918582 -0.372974547679 0.10648740083 -0.261407792568 -8.0251669128 4.50386270676
1616643321.21 0.298226556625 -0.392974517777 0.10648740083 -0.261407792568 -8.0251669128 4.50386270676
1616643321.26 0.311559887001 -0.402974510329 0.129001885653 -0.296433031559 -8.02441149801 4.50924860646
1616643321.31 0.307285988401 -0.422974274857 0.129001885653 -0.296433031559 -8.02441149801 4.50924860646
1616643321.36 0.307204063049 -0.425888527454 0.152124866843 -0.334021091461 -8.02353495493 4.49586871735
1616643321.41 0.303678969674 -0.417826641699 0.152124866843 -0.334021091461 -8.02353495493 4.49586871735
1616643321.46 0.303678977044 -0.417826761723 0.167337357998 -0.366483479738 -8.02250231044 4.48985893328
1616643321.51 0.295749676645 -0.414396812335 0.167337357998 -0.366483479738 -8.02250231044 4.48985893328
1616643321.56 0.29574967376 -0.414397102482 0.18985183537 -0.387413203716 -8.02139366064 4.47893725036
1616643321.61 0.28582740936 -0.404397257273 0.18985183537 -0.387413203716 -8.02139366064 4.47893725036
1616643321.66 0.285790921872 -0.394397533857 0.21297480166 -0.401508718729 -8.02028226195 4.45956084922
1616643321.71 0.280074395916 -0.374397703277 0.21297480166 -0.401508718729 -8.02028226195 4.45956084922
1616643321.76 0.279913434594 -0.364397721443 0.228187292814 -0.408342897892 -8.01906939362 4.43866644888
1616643321.81 0.266423836444 -0.34640009362 0.228187292814 -0.408342897892 -8.01906939362 4.43866644888
1616643321.86 0.263400861832 -0.336400328791 0.243399783969 -0.408342897892 -8.01783849649 4.41479148497
1616643321.91 0.25901583505 -0.316400368732 0.265914261341 -0.400227278471 -8.01783849649 4.41479148497
1616643321.96 0.258797528162 -0.306400375997 0.265914261341 -0.400227278471 -8.01654965047 4.42360628692
1616643322.01 0.245247617673 -0.287992894 0.265914261341 -0.37801617384 -8.01654965047 4.42360628692
1616643322.06 0.231914318853 -0.286893432059 0.265914261341 -0.37801617384 -8.01548338667 4.38131840158
1616643322.11 0.216031154626 -0.273969007837 0.281126767397 -0.350252270699 -8.01548338667 4.38131840158
1616643322.16 0.203556713596 -0.26396902617 0.281126767397 -0.350252270699 -8.01460509312 4.35360704964
1616643322.21 0.189501334892 -0.245583283982 0.273824751377 -0.324624061584 -8.01460509312 4.35360704964
1616643322.26 0.186682944839 -0.235583295555 0.273824751377 -0.324624061584 -8.01382195577 4.34080800559
1616643322.31 0.172329772221 -0.22186197707 0.265914261341 -0.297714442015 -8.01382195577 4.34080800559
1616643322.36 0.158997422688 -0.212600339271 0.265914261341 -0.297714442015 -8.01324768135 4.31362397755
1616643322.41 0.139023643803 -0.199144547116 0.235489279032 -0.272086203098 -8.01324768135 4.31362397755
1616643322.46 0.125690342612 -0.199351205709 0.235489279032 -0.272086203098 -8.01297155502 4.28785192563
1616643322.51 0.112357083623 -0.190408147005 0.228187292814 -0.250302225351 -8.01297155502 4.28785192563
1616643322.56 0.0856904441188 -0.181657810298 0.228187292814 -0.250302225351 -8.01293853675 4.26188737881
1616643322.61 0.059023971307 -0.175766960172 0.21297480166 -0.231508210301 -8.01293853675 4.26188737881
1616643322.66 0.0323573163768 -0.159790390859 0.21297480166 -0.231508210301 -8.01300885563 4.23945957361
1616643322.71 0.0190240123155 -0.152126847408 0.182549834251 -0.215277001262 -8.01300885563 4.23945957361
1616643322.76 0.00569069135038 -0.150231485434 0.182549834251 -0.215277001262 -8.01024528988 4.21928670393
1616643322.81 -0.02097591533 -0.146536596819 0.159426853061 -0.199045807123 -8.01024528988 4.21928670393
1616643322.86 -0.0476425591263 -0.143500881139 0.159426853061 -0.199045807123 -8.0104616025 4.20136128449
1616643322.91 -0.0609755358396 -0.137975228065 0.159426853061 -0.185804560781 -8.0104616025 4.20136128449
1616643322.96 -0.0743087985297 -0.139595303978 0.159426853061 -0.185804560781 -8.01077953685 4.18192353559
1616643323.01 -0.100975439879 -0.143837570532 0.136912375689 -0.175980418921 -8.01077953685 4.18192353559
1616643323.06 -0.127641768697 -0.147278471917 0.136912375689 -0.175980418921 -8.01078128815 4.18181657791
1616643323.11 -0.140975062631 -0.152637396171 0.0985769107938 -0.169146209955 -8.01078128815 4.18181657791
1616643323.16 -0.154308372436 -0.156755194069 0.0985769107938 -0.169146209955 -8.01106773821 4.1598538254
1616643323.21 -0.180975003347 -0.168563568298 0.0377269648015 -0.165729135275 -8.01106773821 4.1598538254
1616643323.26 -0.207641569788 -0.177765330111 0.0377269648015 -0.165729135275 -8.0112220205 4.15378754932
1616643323.31 -0.220974890525 -0.183776469011 -0.0225144792348 -0.164447709918 -8.0112220205 4.15378754932
1616643323.37 -0.247641306266 -0.187465347801 -0.0225144792348 -0.164447709918 -8.01124274242 4.15284059795
1616643323.42 -0.260972515749 -0.1864582946 -0.068151935935 -0.163593441248 -8.01124274242 4.15284059795
1616643323.47 -0.274305844056 -0.184330451595 -0.10648740083 -0.164020583034 -8.01110027063 4.15804914844
1616643323.52 -0.300972259851 -0.192524200907 -0.10648740083 -0.164020583034 -8.01110027063 4.15804914844
1616643323.57 -0.327637294195 -0.195842402496 -0.10648740083 -0.164020583034 -8.01044703334 4.13922715169
1616643323.62 -0.340970562623 -0.19497352139 -0.129001885653 -0.165301993489 -8.01044703334 4.13922715169
1616643323.67 -0.36763706469 -0.193184112631 -0.129001885653 -0.165301993489 -8.01044368744 4.13913059235
1616643323.72 -0.380970279361 -0.189243279793 -0.144214376807 -0.168291941285 -8.01044368744 4.13913059235
1616643323.77 -0.407627637571 -0.186826817784 -0.144214376807 -0.168291941285 -8.01003913067 4.15330245376
1616643323.82 -0.417260341816 -0.179850596705 -0.167337357998 -0.172136172652 -8.01003913067 4.15330245376
1616643323.87 -0.417260176131 -0.179850506717 -0.167337357998 -0.172136172652 -8.0095977822 4.15702017588
1616643323.92 -0.403927639086 -0.176318918515 -0.18985183537 -0.175553277135 -8.0095977822 4.15702017588
1616643323.97 -0.402093460772 -0.176578438711 -0.18985183537 -0.175553277135 -8.00913429578 4.17563477535
1616643324.02 -0.408223654462 -0.166578449468 -0.21297480166 -0.177261814475 -8.00913429578 4.17563477535
1616643324.07 -0.410208591657 -0.166339119892 -0.228187292814 -0.178116083145 -8.00877681491 4.18882542718
1616643324.12 -0.396875279329 -0.156339123492 -0.228187292814 -0.178116083145 -8.00877681491 4.18882542718
1616643324.17 -0.397112844407 -0.15298697061 -0.228187292814 -0.178116083145 -8.00787680871 4.23473634474
1616643324.22 -0.397085994249 -0.152967393811 -0.250701785088 -0.178116083145 -8.00787680871 4.23473634474
1616643324.27 -0.397086395745 -0.152967361829 -0.250701785088 -0.178116083145 -8.0078754425 4.23480606079
1616643324.32 -0.383753096511 -0.142967365385 -0.265914261341 -0.177688956261 -8.0078754425 4.23480606079
1616643324.37 -0.396973587429 -0.138325082064 -0.265914261341 -0.177688956261 -8.00748592962 4.26167864065
1616643324.42 -0.396973587429 -0.138325082064 -0.289037257433 -0.174699008465 -8.00748592962 4.26167864065
1616643324.47 -0.396973587429 -0.138325082064 -0.289037257433 -0.174699008465 -8.00718715445 4.29075108557
1616643324.52 -0.396973587429 -0.138325082064 -0.311551719904 -0.16871906817 -8.00718715445 4.29075108557
1616643324.57 -0.396973587429 -0.138325082064 -0.311551719904 -0.16871906817 -8.00698632971 4.32141802564
1616643324.62 -0.383641458779 -0.128325362244 -0.32676422596 -0.162739157677 -8.00698632971 4.32141802564
1616643324.67 -0.379039311567 -0.118325425763 -0.32676422596 -0.162739157677 -8.01249798873 4.3298410582
1616643324.72 -0.39237260051 -0.108325430994 -0.357189178467 -0.155904978514 -8.01249798873 4.3298410582
1616643324.77 -0.405705918698 -0.0983254306497 -0.357189178467 -0.155904978514 -8.01256073327 4.36491455025
1616643324.82 -0.419039251765 -0.0883254299889 -0.365099668503 -0.146080821753 -8.01256073327 4.36491455025
1616643324.87 -0.432372585676 -0.0783254293472 -0.365099668503 -0.146080821753 -8.01276245371 4.40228277707
1616643324.92 -0.43237255642 -0.0583254318282 -0.380312174559 -0.130703896284 -8.01276245371 4.40228277707
1616643324.97 -0.405706161539 -0.0383254531217 -0.380312174559 -0.130703896284 -8.01322993785 4.44040263707
1616643325.02 -0.405706161539 -0.0383254531217 -0.40282663703 -0.110628463328 -8.01322993785 4.44040263707
1616643325.07 -0.405706321364 -0.0183254700879 -0.410737127066 -0.0875630676746 -8.01388839127 4.48070247372
1616643325.12 -0.392373030692 -0.00832547173594 -0.410737127066 -0.0875630676746 -8.01388839127 4.48070247372
1616643325.17 -0.370130370928 0.0216745271661 -0.418039113283 -0.0597991682589 -8.01465332577 4.50713060297
1616643325.22 -0.370130370928 0.0216745271661 -0.418039113283 -0.0597991682589 -8.01465332577 4.50713060297
1616643325.27 -0.383463697293 0.0316745255146 -0.418039113283 -0.0290453098714 -8.0167595775 4.5488823304
1616643325.32 -0.410130285586 0.0516745168147 -0.418039113283 -0.0290453098714 -8.0167595775 4.5488823304
1616643325.37 -0.436796655214 0.071674467707 -0.410737127066 -0.00213568471372 -8.0194264283 4.63216853664
1616643325.42 -0.46346078571 0.0916741145344 -0.410737127066 -0.00213568471372 -8.0194264283 4.63216853664
1616643325.48 -0.476794111779 0.101674112063 -0.40282663703 0.024773940444 -8.02087876357 4.67368968237
1616643325.53 -0.490127442002 0.111674111934 -0.40282663703 0.024773940444 -8.02087876357 4.67368968237
1616643325.58 -0.516794025869 0.131674042368 -0.395524650812 0.0538192503154 -8.02245306645 4.70537750355
1616643325.63 0.0 0.0 -0.395524650812 0.0538192503154 -8.02245306645 4.70537750355
1616643325.68 0.0 0.0 -0.410737127066 0.0713318660855 -8.02412651174 4.74566268279
1616643325.73 0.0 0.0 -0.410737127066 0.0713318660855 -8.02412651174 4.74566268279
1616643325.78 0.0 0.0 -0.410737127066 0.0555278025568 -8.0258975405 4.78675918203
1616643325.83 0.0 0.0 -0.410737127066 0.0555278025568 -8.0258975405 4.78675918203
1616643325.88 0.0 0.0 -0.387614160776 0.038869459182 -8.02590751648 4.78699064255
1616643325.93 0.0 0.0 -0.387614160776 0.038869459182 -8.02590751648 4.78699064255
1616643325.98 0.0 0.0 -0.37240165472 0.0260553527623 -8.02763610006 4.83428497413
1616643326.03 0.0 0.0 -0.37240165472 0.0260553527623 -8.02763610006 4.83428497413
1616643326.08 0.0 0.0 -0.31946220994 0.0170854777098 -8.02918830045 4.87083410295
1616643326.13 0.0 0.0 -0.31946220994 0.0170854777098 -8.02918830045 4.87083410295
1616643326.18 0.0 0.0 -0.250701785088 0.0115326968953 -8.03049741293 4.89646799341
1616643326.23 0.0 0.0 -0.250701785088 0.0115326968953 -8.03049741293 4.89646799341
1616643326.28 0.0 0.0 -0.174639344215 0.00726132746786 -8.03147565413 4.91963370682
1616643326.33 0.0 0.0 -0.174639344215 0.00726132746786 -8.03147565413 4.91963370682
1616643326.38 0.0 0.0 -0.0985769107938 0.00469850609079 -8.03204269883 4.96617375185
1616643326.43 0.0 0.0 -0.0608499459922 0.00298995850608 -8.03204269883 4.96617375185
1616643326.48 0.0 0.0 -0.0608499459922 0.00298995850608 -8.03808000652 4.99032506345
1616643326.53 0.0 0.0 -0.0225144792348 0.00170854770113 -8.03808000652 4.99032506345
1616643326.58 0.0 0.0 -0.0225144792348 0.00170854770113 -8.03828286781 4.99490137785
1616643326.63 0.0 0.0 -0.0152124864981 0.00128141080495 -8.03828286781 4.99490137785
1616643326.68 0.0 0.0 -0.0152124864981 0.00128141080495 -8.039356465 5.01615799825
1616643326.73 0.0 0.0 -0.0152124864981 0.00128141080495 -8.039356465 5.01615799825
1616643326.78 0.0 0.0 -0.0152124864981 0.00128141080495 -8.03942950234 5.02469175158
1616643326.83 0.0 0.0 0.00730199320242 0.00128141080495 -8.03942950234 5.02469175158
1616643326.88 0.0 0.0 0.0 0.000427136925282 -8.03942966461 5.02471446991
1616643326.93 0.0 0.0 0.0 0.000427136925282 -8.03942966461 5.02471446991
1616643326.98 0.0 0.0 0.0 0.000427136925282 -8.03940016672 5.03120115102
1616643327.03 0.0 0.0 0.0 0.000427136925282 -8.03940016672 5.03120115102
1616643327.08 0.0 0.0 0.00730199320242 0.0 -8.03937067453 5.03047194479
1616643327.13 0.0 0.0 0.00730199320242 0.0 -8.03937067453 5.03047194479
1616643327.18 0.0 0.0 0.00730199320242 -0.000854273850564 -8.03934127561 5.0297289109
1616643327.23 0.0 0.0 0.00730199320242 -0.000854273850564 -8.03934127561 5.0297289109
1616643327.28 0.0 0.0 0.00730199320242 -0.000854273850564 -8.04005333492 5.02972126007
1616643327.33 0.0 0.0 0.0 -0.000854273850564 -8.04005333492 5.02972126007
1616643327.38 0.0 0.0 0.0 -0.000854273850564 -8.04006004333 5.02972126007
1616643327.43 0.0 0.0 0.0 -0.000854273850564 -8.04006004333 5.02972126007
1616643327.48 0.0 0.0 0.0 -0.000854273850564 -8.04109247234 5.02972126007
1616643327.53 0.0 0.0 0.00730199320242 -0.000854273850564 -8.04109247234 5.02972126007
1616643327.58 0.0 0.0 0.00730199320242 -0.000854273850564 -8.04112711013 5.03046606878
1616643327.63 0.0 0.0 0.00730199320242 -0.000854273850564 -8.04112711013 5.03046606878
1616643327.68 0.0 0.0 0.00730199320242 -0.000854273850564 -8.04120815356 5.0304684639
1616643327.73 0.0 0.0 0.00730199320242 -0.000854273850564 -8.04120815356 5.0304684639
1616643327.78 0.0 0.0 0.0 -0.000854273850564 -8.04117901425 5.02972911895
1616643327.83 0.0 0.0 0.0 -0.000854273850564 -8.04117901425 5.02972911895
1616643327.88 0.0 0.0 0.0 -0.000854273850564 -8.04117870331 5.02972126007
1616643327.93 0.0 0.0 0.0 -0.000854273850564 -8.04117870331 5.02972126007
1616643327.98 0.0 0.0 0.0 -0.000854273850564 -8.04117870331 5.02972126007
1616643328.03 0.0 0.0 0.0 -0.000854273850564 -8.04117870331 5.02972126007
1616643328.08 0.0 0.0 0.0 -0.000854273850564 -8.04117870331 5.02972126007
1616643328.13 0.0 0.0 0.0 -0.000854273850564 -8.04117870331 5.02972126007
1616643328.18 0.0 0.0 0.0 -0.000854273850564 -8.04117870331 5.02972126007
1616643328.23 0.0 0.0 0.0 -0.000854273850564 -8.04117870331 5.02972126007
1616643328.28 0.0 0.0 0.0 -0.000854273850564 -8.04126277927 5.02972126007
1616643328.33 0.0 0.0 0.0 -0.000854273850564 -8.04126277927 5.02972126007
1616643328.38 0.0 0.0 0.0 -0.000854273850564 -8.04126358032 5.02972126007
1616643328.43 0.0 0.0 0.0 -0.000854273850564 -8.04126358032 5.02972126007
1616643328.48 0.0 0.0 0.0 -0.000854273850564 -8.04126358032 5.02972126007
1616643328.53 0.0 0.0 0.0 -0.000854273850564 -8.04126358032 5.02972126007
1616643328.58 0.0 0.0 0.0 -0.000854273850564 -8.04126358032 5.02972126007
1616643328.63 0.0 0.0 0.0 -0.000854273850564 -8.04126358032 5.02972126007
