210325_091440
x		y
-19.6127815247 -0.300796896219
-19.4127826691 -0.301183462143
-19.2127838135 -0.301570028067
-19.0127849579 -0.30195659399
-18.8127861023 -0.302343159914
-18.6127872467 -0.302729725838
-18.4127883911 -0.303116291761
-18.2127895355 -0.303502857685
-18.0127906799 -0.303889423609
-17.8127918243 -0.304275989532
-17.6127929688 -0.304662555456
-17.4127941132 -0.30504912138
-17.2127952576 -0.305435687304
-17.012796402 -0.305822253227
-16.8127975464 -0.306208819151
-16.6127986908 -0.306595385075
-16.4127998352 -0.306981950998
-16.2128009796 -0.307368516922
-16.012802124 -0.307755082846
-15.8128023148 -0.308141648769
-15.6128025055 -0.308528214693
-15.4128026962 -0.308914780617
-15.212802887 -0.30930134654
-15.0128030777 -0.309687912464
-14.8128032684 -0.310074478388
-14.6128034592 -0.310461044312
-14.4128036499 -0.310847610235
-14.2128038406 -0.311234176159
-14.0128040314 -0.311620742083
-13.8128042221 -0.312007308006
-13.6128044128 -0.31239387393
-13.4128046036 -0.312780439854
-13.2128047943 -0.313167005777
-13.012804985 -0.313553571701
-12.8128051758 -0.313940137625
-12.6128053665 -0.314326703548
-12.4128055573 -0.314713269472
-12.212805748 -0.315099835396
-12.0128059387 -0.31548640132
-11.8128061295 -0.315872967243
-11.6128063202 -0.316259533167
-11.4128065109 -0.316646099091
-11.2128067017 -0.317032665014
-10.8347330093 -0.311097115278
-10.6356935501 -0.291515111923
-10.4384012222 -0.258717179298
-10.2437324524 -0.212849020958
-10.0525512695 -0.154114425182
-9.86570739746 -0.082774348557
-9.68403148651 0.000854268670082
-9.50833034515 0.0963998809457
-9.33938407898 0.203437998891
-9.17794322968 0.321493089199
-9.024725914 0.450040638447
-8.88041210175 0.588509559631
-8.74564361572 0.736284613609
-8.6210193634 0.892709314823
-8.50709247589 1.05708873272
-8.40436840057 1.22869253159
-8.31330490112 1.4067581892
-8.23430538177 1.59049475193
-8.16772174835 1.77908587456
-8.11384963989 1.97169363499
-8.07292747498 2.16746234894
-8.04513835907 2.36552238464
-8.03060531616 2.56499361992
-8.02785396576 2.86729049683
-8.02683258057 3.06728792191
-8.02581119537 3.26728534698
-8.02478981018 3.46728277206
-8.02376842499 3.66728019714
-8.02274703979 3.86727762222
-8.0217256546 4.0672750473
-8.02070426941 4.26727247238
-8.01968288422 4.46726989746
-8.01866149902 4.66726732254
-8.01764011383 4.86726474762
-8.01760864258 4.87265205383
