210325_115613
x		y
-7.7929725647 -7.45400285721
-7.79225206375 -7.25400400162
-7.79153156281 -7.05400514603
-7.79081106186 -6.85400629044
-7.79009056091 -6.65400743484
-7.78937005997 -6.45400857925
-7.78864955902 -6.25400972366
-7.78792905807 -6.05401086807
-7.78720855713 -5.85401201248
-7.78648805618 -5.65401315689
-7.78576755524 -5.4540143013
-7.78504705429 -5.25401544571
-7.78432655334 -5.05401659012
-7.7836060524 -4.85401773453
-7.78288555145 -4.65401887894
-7.78216505051 -4.45402002335
-7.78144454956 -4.25402116776
-7.78072404861 -4.05402231216
-7.78000354767 -3.85402369499
-7.77928304672 -3.65402507782
-7.77856254578 -3.45402646065
-7.77784204483 -3.25402784348
-7.77712154388 -3.0540292263
-7.77640104294 -2.85403060913
-7.77568054199 -2.65403199196
-7.77496004105 -2.45403337479
-7.7742395401 -2.25403475761
-7.77351903915 -2.05403614044
-7.77279853821 -1.85403740406
-7.77207803726 -1.65403866768
-7.77135753632 -1.4540399313
-7.77063703537 -1.25404119492
-7.76991653442 -1.05404245853
-7.76919603348 -0.854043722153
-7.76847553253 -0.654044985771
-7.76775503159 -0.454046279192
-7.76703453064 -0.254047572613
-7.76631402969 -0.0540488660336
-7.76559352875 0.145949840546
-7.7648730278 0.345948547125
-7.76415252686 0.545947253704
-7.76415986885 0.545945256908
