{"countries":[
        {
        "key"  :"AED",
        "name" :"United Arab Emirates Dirham",
        "image":"unitedarabemirates.png" 
        },
        {
        "key"  :"ALL",
        "name" :"Albanian Lek",
        "image":"albania.png" 
        },
        {
        "key"  :"AMD",
        "name" :"Armenian Dram",
        "image":"armenia.png" 
        },
        {
        "key"  :"ANG",
        "name" :"Netherlands Antillean Guilder",
        "image":"netherlands.png" 
        },
        {
        "key"  :"AOA",
        "name" :"Armenian Dram",
        "image":"armenia.png" 
        },
        {
        "key"  :"ARS",
        "name" :"Angolan Kwanza",
        "image":"angola.png" 
        },
        {
        "key"  :"AMD",
        "name" :"Argentine Peso",
        "image":"argentina.png"
        },
        {
        "key"  :"AUD",
        "name" :"Australian Dollar",
        "image":"australia.png" 
        },
        {
        "key"  :"AWG",
        "name" :"Aruban Florin",
        "image":"aruba.png" 
        },
        {
        "key"  :"AZN",
        "name" :"Azerbaijani Manat",
        "image":"azerbaijan.png" 
        },
        {
        "key"  :"BAM",
        "name" :"Bosnia-Herzegovina Convertible Mark",
        "image":"bosniaandherzegovina.png" 
         },
        {
        "key"  :"BDT",
        "name" :"Bangladeshi Taka",
        "image":"bangladesh.png" 
        },
        {
         "key"  :"BGN",
        "name" :"Bulgarian Lev",
        "image":"bulgaria.png" 
        },
        {
        "key"  :"BHD",
        "name" :"Bahraini Dinar",
        "image":"bahrain.png" 
        },
        {
        "key"  :"BMD",
        "name" :"Bermudan Dollar",
        "image":"bermuda.png" 
        },
        {
         "key"  :"BND",
         "name" :"Brunei Dollar",
        "image":"brunei.png" 
        },
        {
        "key"  :"BRL",
        "name" :"Brazilian Real",
        "image":"brazil.png" 
        },
        {
        "key"  :"BSD",
        "name" :"Bahamian Dollar",
        "image":"bahamas.png" 
        },
        {
        "key"  :"BTN",
        "name" :"Bhutanese Ngultrum",
        "image":"bhutan.png" 
        },
        {
        "key"  :"BWP",
        "name" :"Botswanan Pula",
        "image":"botswana.png" 
        },
        {
        "key"  :"BYN",
        "name" :"Belarusian Ruble",
        "image":"belarus.png" 
        },
        {
        "key"  :"CAD",
        "name" :"Canadian Dollar",
        "image":"canada.png" 
        },
        {
        "key"  :"CDF",
        "name" :"Swiss Franc",
        "image":"democraticrepublicofcongo.png" 
        },
        {
        "key"  :"CHF",
        "name" :"Swiss Franc",
        "image":"sweden.png" 
        },
        {
        "key"  :"CLF",
        "name" :"Chilean Unit of Account (UF)",
        "image":"chile.png" 
        },
        {
        "key"  :"CNH",
        "name" :"Chinese Yuan (Offshore)",
        "image":"china.png" 
        },
        {
        "key"  :"CNY",
        "name" :"Chinese Yuan",
        "image":"china.png" 
        },
        {
        "key"  :"COP",
        "name" :"Colombia",
        "image":"caymanislands.png" 
        },
        {
        "key"  :"CRC",
        "name" :"Costa Rican Colón",
        "image":"costarica.png" 
        },
        {
        "key"  :"CUC",
        "name" :"Cuban Convertible Peso",
        "image":"cuba.png" 
        },
        {
        "key"  :"CUP",
        "name" :"Cuban Peso",
        "image":"cuba.png" 
        },
        {
        "key"  :"CVE",
        "name" :"Cape Verdean Escudo",
        "image":"cape-verde.png" 
        },
        {
         "key"  :"CZK",
        "name" :"Czech Republic Koruna",
        "image":"czechrepublic.png" 
        },
        {
        "key"  :"DKK",
        "name" :"Danish Krone",
        "image":"denmark.png" 
        },
        {
        "key"  :"DOP",
        "name" :"Dominican Peso",
         "image":"dominicanrepublic.png" 
        },
        {
         "key"  :"DZD",
        "name" :"Algerian Dinar",
        "image":"algeria.png" 
        },
        {
         "key"  :"EGP",
        "name" :"Egyptian Pound",
        "image":"egypt.png" 
        },
        {
        "key"  :"ERN",
        "name" :"Eritrean Nakfa",
        "image":"eritrea.png" 
        },
        {
        "key"  :"ETB",
        "name" :"Ethiopian Birr",
        "image":"ethiopia.png" 
        },
        {
        "key"  :"EUR",
        "name" :"Euro",
        "image":"europeanunion.png" 
        },
        {
        "key"  :"FJD",
        "name" :"Fijian Dollar",
        "image":"fiji.png" 
        },
        {
        "key"  :"FKP",
         "name" :"Falkland Islands Pound",
        "image":"falklandislands.png" 
        },  
        {
        "key"  :"GPB",
        "name" :"British Pound Sterling",
        "image":"england.png" 
        },
        {
        "key"  :"GEL",
        "name" :"Georgian Lari",
        "image":"georgia.png" 
        },
        {
        "key"  :"GGP",
        "name" :"Guernsey Pound",
        "image":"guernsey.png" 
        },
        {
        "key"  :"GHS",
        "name" :"Ghanaian Cedi",
        "image":"ghana.png" 
        },
        {
         "key"  :"GIP",
        "name" :"Gibraltar Pound",
        "image":"gibraltar.png" 
        },
        {
        "key"  :"GMD",
        "name" :"Gambian Dalasi",
        "image":"gambia.png" 
        },
        {
        "key"  :"GNF",
        "name" :"Guinean Franc",
        "image":"guinea.png" 
        },
        {
        "key"  :"GTQ",
        "name" :"Guatemalan Quetzal",
        "image":"guatemala.png" 
        },
        {
         "key"  :"GYD",
         "name" :"Guyanaese Dollar",
        "image":"guyana.png" 
        },
        {
        "key"  :"HKD",
        "name" :"Hong Kong Dollar",
        "image":"hongkong.png" 
        },     
        {
        "key"  :"HNL",
        "name" :"Honduran Lempira",
        "image":"honduras.png" 
        },     
        {
        "key"  :"HRK",
        "name" :"Croatian Kuna",
        "image":"croatia.png" 
        },
        {
        "key"  :"HTG",
        "name" :"Haitian Gourde",
        "image":"haiti.png" 
        },  
        {
        "key" :"HUF",
        "name" :"Hungarian Forint",
        "image":"hungary.png" 
        },  
        {
        "key"  :"IDR",
        "name" :"Indonesian Rupiah",
        "image":"indonesia.png" 
        },    
        {
        "key"  :"ILS",
        "name" :"Israeli New Sheqel",
        "image":"israel.png" 
        },  
        {
        "key"  :"INR",
        "name" :"Indian Rupee",
        "image":"india.png" 
        },  
        {
        "key"  :"IQD",
        "name" :"Iraqi Dinar",
        "image":"iraq.png" 
        }, 
        {
         "key"  :"IRR",
        "name" :"Iranian Rial",
        "image":"iran.png" 
        },
        {
        "key"  :"ISK",
        "name" :"Iraqi Dinar",
        "image":"iraq.png" 
        },
        {
        "key"  :"IQD",
        "name" :"Icelandic Króna",
        "image":"iceland.png" 
        },
        {
        "key"  :"JEP",
        "name" :"Jersey Pound",
        "image":"jersey.png" 
        },
        {
        "key"  :"JMD",
        "name" :"Jamaican Dollar",
         "image":"jamaica.png" 
        },
        {
        "key"  :"JOD",
        "name" :"Jordanian Dinar",
        "image":"jordan.png" 
        },
        {
        "key"  :"JPY",
        "name" :"Japanese Yen",
        "image":"japan.png" 
        },
        {
        "key"  :"KES",
        "name" :"Kenyan Shilling",
        "image":"kenya.png" 
        },
        {
        "key"  :"KGS",
        "name" :"Kyrgystani Som",
        "image":"kyrgyzstan.png" 
        },
        {
        "key"  :"KHR",
        "name" :"Cambodian Riel",
        "image":"cambodian.png" 
        },
        {
        "key"  :"KMF",
        "name" :"Comorian Franc",
        "image":"cameroon.png" 
        },
        {
        "key"  :"KPW",
        "name" :"North Korean Won",
        "image":"north-korea.png" 
        },
        {
        "key"  :"KRW",
         "name" :"South Korean Won",
        "image":"south-korea.png" 
        },
        {
        "key"  :"KWD",
        "name" :"Kuwaiti Dinar",
        "image":"kwait.png" 
        },
         {
         "key"  :"KYD",
        "name" :"Cayman Islands Dollar",
        "image":"caymanislands.png" 
        },
        {
        "key"  :"KZT",
        "name" :"Kazakhstani Tenge",
        "image":"kazakhstan.png" 
        },
        {
        "key"  :"LAK",
        "name" :"Laotian Kip",
        "image":"laos.png" 
        },
        {
        "key"  :"LBP",
        "name" :"Lebanese Pound",
        "image":"lebanon.png" 
         },
        {
        "key"  :"LKR",
        "name" :"Sri Lankan Rupee",
        "image":"srilanka.png" 
        },
         {
        "key"  :"LRD",
        "name" :"Liberian Dollar",
        "image":"liberia.png" 
        },
        {
        "key"  :"LSL",
        "name" :"Lesotho Loti",
        "image":"lesotho.png" 
        },
        {
        "key"  :"LYD",
        "name" :"Libyan Dinar",
        "image":"libya.png" 
        },
        {
        "key"  :"MAD",
        "name" :"Moroccan Dirham",
        "image":"morocco.png" 
        },
        {
        "key"  :"MDL",
        "name" :"Moldovan Leu",
        "image":"moldova.png" 
        },
        {
        "key"  :"MGA",
        "name" :"Malagasy Ariary",
        "image":"malagasy.png" 
        },
        {
        "key"  :"MKD",
        "name" :"Macedonian Denarm",
        "image":"mecedonian.png" 
        },
        {
        "key"  :"MMK",
        "name" :"Myanma Kyat",
        "image":"myanmar.png" 
        },
        {
        "key"  :"MNT",
        "name" :"Mongolian Tugrik",
        "image":"mongolia.png" 
        },
        {
        "key"  :"MOP",
        "name" :"Macanese Pataca",
        "image":"macao.png" 
        },
        {
        "key"  :"MUR",
        "name" :"Mauritian Rupee",
        "image":"mauritania.png" 
        },
        {
        "key"  :"MVR",
        "name" :"Maldivian Rufiyaa",
        "image":"maldives.png" 
        },
        {
        "key"  :"MWK",
        "name" :"Malawian Kwacha",
        "image":"malawi.png" 
        },
        {
        "key"  :"MXN",
        "name" :"Mexican Peso",
        "image":"mexico.png" 
        },
        {
        "key"  :"MYR",
        "name" :"Malaysian Ringgit",
        "image":"malasya.png" 
        },
        {
        "key"  :"MZN",
        "name" :"Mozambican Metical",
         "image":"mozambique.png" 
         },
        {
        "key"  :"NAD",
        "name" :"Namibian Dollar",
        "image":"namibia.png" 
        },
        {
        "key"  :"NGN",
        "name" :"Nigerian Nairar",
        "image":"nigeria.png" 
        },
        {
        "key"  :"NIO",
        "name" :"Nicaraguan Córdoba",
        "image":"nicaragua.png" 
        },
        {
        "key"  :"NOK",
        "name" :"Norwegian Krone",
        "image":"norwegian.png" 
        },
        {
        "key"  :"NPR",
        "name" :"Nepalese Rupee",
        "image":"nepal.png" 
        },
        {
        "key"  :"NZD",
        "name" :"New Zealand Dollar",
        "image":"newzealand.png" 
        },
        {
        "key"  :"OMR",
        "name" :"Omani Rial",
        "image":"oman.png" 
        },
        {
        "key"  :"PAB",
        "name" :"Panamanian Balboa",
        "image":"panama.png" 
        },
        {
        "key"  :"PEN",
        "name" :"Peruvian Nuevo Sol",
        "image":"peru.png" 
        },
        {
        "key"  :"PGK",
        "name" :"Papua New Guinean Kina",
        "image":"papua-new-guinea.png" 
        },
        {
        "key"  :"PHP",
        "name" :"Philippine Peso",
        "image":"philippines.png" 
        },
        {
        "key"  :"PKR",
        "name" :"Pakistani Rupeel",
        "image":"pakistan.png" 
        },
        {
        "key"  :"PLN",
        "name" :"Polish Zloty",
        "image":"palau.png" 
        },
        {
        "key"  :"QAR",
        "name" :"Qatari Rial",
        "image":"qatar.png" 
        },
        {
        "key"  :"RON",
        "name" :"Romanian Leu",
        "image":"romania.png" 
        },
        {
        "key"  :"RSD",
        "name" :"Serbian Dinar",
        "image":"serbia.png" 
        },
        {
        "key"  :"RUB",
        "name" :"Russian Ruble",
        "image":"russia.png" 
        },
        {
        "key"  :"RWF",
        "name" :"Rwandan Franc",
        "image":"rwanda.png" 
        },
        {
        "key"  :"SAR",
        "name" :"Saudi Riyal",
        "image":"saudiarabia.png" 
        },
        {
        "key"  :"SBD",
        "name" :"Solomon Islands Dollar",
        "image":"solomon-islands.png" 
        },
        {
        "key"  :"SCR",
        "name" :"Seychellois Rupee",
        "image":"seychelles.png" 
        },
        {
        "key"  :"SDG",
        "name" :"Sudanese Pound",
        "image":"sudan.png" 
        },
        {
        "key"  :"SEK",
        "name" :"Swedish Krona",
        "image":"sweden.png" 
        },
        {
        "key"  :"SGD",
        "name" :"Singapore Dollar",
        "image":"singapore.png" 
        },
        {
        "key"  :"SHB",
        "name" :"Saint Helena Pound",
        "image":"Saint-Helena.png" 
        },
        {
        "key"  :"SLL",
        "name" :"Sierra Leonean Leone",
        "image":"sierra-leone.png" 
        },
        {
        "key"  :"SOS",
        "name" :"Somali Shilling",
         "image":"somalia.png" 
        },
        {
        "key"  :"SRD",
        "name" :"Surinamese Dollar",
        "image":"suriname.png" 
        },
        {
        "key"  :"SSP",
         "name" :"South Sudanese Pound",
        "image":"south-sudan.png" 
        },
        {
        "key"  :"STD",
        "name" :"São Tomé and Príncipe Dobra",
        "image":"saotomeandprince.png" 
        },
        {
        "key"  :"SVC",
        "name" :"Salvadoran Colón",
        "image":"salvadoran.png" 
        },
        {
        "key"  :"SYP",
        "name" :"Syrian Pound",
        "image":"syria.png" 
        },
        {
        "key"  :"SZL",
        "name" :"Swazi Lilangeni",
        "image":"swaziland.png" 
        },
        {
        "key"  :"THB",
        "name" :"Thai Baht",
        "image":"thailand.png" 
        },
        {
        "key"  :"TJS",
        "name" :"Tajikistani Somoni",
        "image":"tajikistan.png" 
        },
        {
        "key"  :"TMT",
        "name" :"Turkmenistani Manat",
        "image":"turkmenistan.png" 
        },
        {
        "key"  :"TND",
        "name" :"Tunisian Dinar",
        "image":"tunisia.png" 
        },
        {
        "key"  :"TOP",
        "name" :"Tongan Pa'anga",
       "image":"tonga.png" 
        },
        {
        "key"  :"TRY",
        "name" :"Turkish Lira",
        "image":"turkey.png" 
        },
        {
        "key"  :"TTD",
        "name" :"Trinidad and Tobago Dollar",
        "image":"trinidadandtobago.png" 
        },
        {
        "key"  :"TWD",
        "name" :"New Taiwan Dollar",
        "image":"taiwan.png" 
        },
        {
        "key"  :"TZS",
        "name" :"Tanzanian Shilling",
        "image":"tanzania.png" 
        },
        {
        "key"  :"UAH",
        "name" :"Ukrainian Hryvnia",
        "image":"ukraine.png" 
        },
        {
        "key"  :"UGX",
        "name" :"Ugandan Shilling",
        "image":"uganda.png" 
        },
        {
        "key"  :"USD",
        "name" :"United States Dollar",
        "image":"united-states.png" 
        },
        {
        "key"  :"UYU",
        "name" :"Uruguayan Peso",
        "image":"uruguay.png" 
        },
        {
        "key"  :"UZS",
        "name" :"Uzbekistan Som",
        "image":"uzbekistn.png" 
        },
        {
        "key"  :"VEF",
        "name" :"Venezuelan Bolívar Fuerte",
        "image":"venezuela.png" 
        },
        {
        "key"  :"VND",
        "name" :"Vietnamese Dong",
        "image":"vietnam.png" 
        }
    ]
}
