{
    "Logging": {
        "LogLevel": {
            "Default": "Warning"
        }
    },
    "ConnectionStrings": {
        "DefaultConnection": "server=127.0.0.1;uid=root;password=root;database=hms_netcore_api;"
    }
}
