%YAML 1.1
%TAG !u! tag:unity3d.com,2011:
--- !u!114 &11400000
MonoBehaviour:
  m_ObjectHideFlags: 0
  m_PrefabParentObject: {fileID: 0}
  m_PrefabInternal: {fileID: 0}
  m_GameObject: {fileID: 0}
  m_Enabled: 1
  m_EditorHideFlags: 0
  m_Script: {fileID: 11500000, guid: a6b194f808b1af6499c93410e504af42, type: 3}
  m_Name: 1512_Atlas
  m_EditorClassIdentifier: 
  atlasFile: {fileID: 4900000, guid: 668c6a93252afd549b4afd95fdc84cd2, type: 3}
  materials:
  - {fileID: 2100000, guid: e08efee58a8b17b4f9275991dcd147cf, type: 2}
  - {fileID: 2100000, guid: 7179050b241ed4f41ac5192d9647f422, type: 2}
  - {fileID: 2100000, guid: c4b678dfa4cc0444d81a1a36e7e09b3f, type: 2}
  - {fileID: 2100000, guid: 7667be62de82211498efe262342d5037, type: 2}
