%YAML 1.1
%TAG !u! tag:unity3d.com,2011:
--- !u!21 &2100000
Material:
  serializedVersion: 6
  m_ObjectHideFlags: 0
  m_PrefabParentObject: {fileID: 0}
  m_PrefabInternal: {fileID: 0}
  m_Name: magic_eff_30301_att_ren 1
  m_Shader: {fileID: 4800000, guid: 54dda5751291d024b980980f664d613a, type: 3}
  m_ShaderKeywords: _EMISSION _PARTICLE_CONTROLA_ON
  m_LightmapFlags: 1
  m_CustomRenderQueue: -1
  stringTagMap: {}
  m_SavedProperties:
    serializedVersion: 2
    m_TexEnvs:
    - first:
        name: _BumpMap
      second:
        m_Texture: {fileID: 0}
        m_Scale: {x: 1, y: 1}
        m_Offset: {x: 0, y: 0}
    - first:
        name: _DetailAlbedoMap
      second:
        m_Texture: {fileID: 0}
        m_Scale: {x: 1, y: 1}
        m_Offset: {x: 0, y: 0}
    - first:
        name: _DetailMask
      second:
        m_Texture: {fileID: 0}
        m_Scale: {x: 1, y: 1}
        m_Offset: {x: 0, y: 0}
    - first:
        name: _DetailNormalMap
      second:
        m_Texture: {fileID: 0}
        m_Scale: {x: 1, y: 1}
        m_Offset: {x: 0, y: 0}
    - first:
        name: _EmissionMap
      second:
        m_Texture: {fileID: 0}
        m_Scale: {x: 1, y: 1}
        m_Offset: {x: 0, y: 0}
    - first:
        name: _MainTex
      second:
        m_Texture: {fileID: 0}
        m_Scale: {x: 1, y: 1}
        m_Offset: {x: 0, y: 0}
    - first:
        name: _MetallicGlossMap
      second:
        m_Texture: {fileID: 0}
        m_Scale: {x: 1, y: 1}
        m_Offset: {x: 0, y: 0}
    - first:
        name: _OcclusionMap
      second:
        m_Texture: {fileID: 0}
        m_Scale: {x: 1, y: 1}
        m_Offset: {x: 0, y: 0}
    - first:
        name: _ParallaxMap
      second:
        m_Texture: {fileID: 0}
        m_Scale: {x: 1, y: 1}
        m_Offset: {x: 0, y: 0}
    - first:
        name: _Tex
      second:
        m_Texture: {fileID: 0}
        m_Scale: {x: 1, y: 1}
        m_Offset: {x: 0, y: 0}
    - first:
        name: _blendTex
      second:
        m_Texture: {fileID: 0}
        m_Scale: {x: 1, y: 1}
        m_Offset: {x: 0, y: 0}
    - first:
        name: _dissolveTex
      second:
        m_Texture: {fileID: 0}
        m_Scale: {x: 1, y: 1}
        m_Offset: {x: 0, y: 0}
    - first:
        name: _word
      second:
        m_Texture: {fileID: 0}
        m_Scale: {x: 1, y: 1}
        m_Offset: {x: 0, y: 0}
    m_Floats:
    - first:
        name: _AllPower
      second: 1
    - first:
        name: _Alpha
      second: 1
    - first:
        name: _AlphaPower
      second: 4
    - first:
        name: _BumpScale
      second: 1
    - first:
        name: _Cutoff
      second: 0.5
    - first:
        name: _DetailNormalMapScale
      second: 1
    - first:
        name: _DstBlend
      second: 0
    - first:
        name: _Fenli
      second: 3.5
    - first:
        name: _FresnelBright
      second: 0.65
    - first:
        name: _FresnelEXP
      second: 0.75
    - first:
        name: _GlossMapScale
      second: 1
    - first:
        name: _Glossiness
      second: 0.5
    - first:
        name: _GlossyReflections
      second: 1
    - first:
        name: _Gradient_Offset
      second: 0.35
    - first:
        name: _Gradient_Power
      second: 1.04
    - first:
        name: _InnerColorPower
      second: 0.5
    - first:
        name: _InvFade
      second: 1
    - first:
        name: _MainTex_Power
      second: 3
    - first:
        name: _Metallic
      second: 0
    - first:
        name: _Mode
      second: 0
    - first:
        name: _OcclusionStrength
      second: 1
    - first:
        name: _Parallax
      second: 0.02
    - first:
        name: _RimPower
      second: 2.5
    - first:
        name: _SmoothnessTextureChannel
      second: 0
    - first:
        name: _SpecularHighlights
      second: 1
    - first:
        name: _SrcBlend
      second: 1
    - first:
        name: _TexBright
      second: 1
    - first:
        name: _TexPower
      second: 1
    - first:
        name: _TexSpeed
      second: 1
    - first:
        name: _UVSec
      second: 0
    - first:
        name: _UV_switch
      second: 0
    - first:
        name: _Word
      second: 0
    - first:
        name: _WordBright
      second: 2
    - first:
        name: _ZWrite
      second: 1
    - first:
        name: _blendTex_Power
      second: 1
    - first:
        name: _blendTex_Speed
      second: 1
    - first:
        name: _dissEdge_Width
      second: 1
    - first:
        name: _diss_Amount
      second: 0
    - first:
        name: _diss_amount
      second: -0.01
    - first:
        name: _node_138
      second: 0.95
    - first:
        name: _node_5484
      second: 1.75
    - first:
        name: _node_6314
      second: 0.01
    - first:
        name: _node_6712
      second: 1.5
    - first:
        name: _particleControl
      second: 0
    - first:
        name: _particle_controlA
      second: -0.01
    - first:
        name: _rim_Alpha
      second: 1
    - first:
        name: _rimedge_Power
      second: 1.38
    m_Colors:
    - first:
        name: _Color
      second: {r: 1, g: 1, b: 1, a: 1}
    - first:
        name: _Color1
      second: {r: 1, g: 0.81501013, b: 0.5808823, a: 1}
    - first:
        name: _Color2
      second: {r: 1, g: 0.2794118, b: 0.5626776, a: 1}
    - first:
        name: _ColorIn
      second: {r: 0.0023248293, g: 0.09539807, b: 0.31617647, a: 1}
    - first:
        name: _ColorOut
      second: {r: 0.39705884, g: 0.72555786, b: 1, a: 1}
    - first:
        name: _EmissionColor
      second: {r: 0, g: 0, b: 0, a: 1}
    - first:
        name: _FresnelColor
      second: {r: 0, g: 0.07053733, b: 0.78676474, a: 1}
    - first:
        name: _InnerColor
      second: {r: 0.5, g: 0.5, b: 0.5, a: 0.5}
    - first:
        name: _MainColor
      second: {r: 0.5, g: 0.5, b: 0.5, a: 1}
    - first:
        name: _OutlineColor
      second: {r: 1, g: 0.6413793, b: 0, a: 1}
    - first:
        name: _RimColor
      second: {r: 0.5, g: 0.5, b: 0.5, a: 0.5}
    - first:
        name: _TintColor
      second: {r: 0.2, g: 0.3, b: 0.5, a: 2}
    - first:
        name: _WordColor
      second: {r: 0.5, g: 0.5, b: 0.5, a: 1}
    - first:
        name: _blendTex_Color
      second: {r: 0.5, g: 0.5, b: 0.5, a: 1}
    - first:
        name: _dissEdge_Color
      second: {r: 0.5, g: 0.5, b: 0.5, a: 1}
    - first:
        name: _node_9827
      second: {r: 0.5, g: 0.5, b: 0.5, a: 1}
