%YAML 1.1
%TAG !u! tag:unity3d.com,2011:
--- !u!74 &7400000
AnimationClip:
  m_ObjectHideFlags: 0
  m_PrefabParentObject: {fileID: 0}
  m_PrefabInternal: {fileID: 0}
  m_Name: showup150
  serializedVersion: 6
  m_Legacy: 0
  m_Compressed: 0
  m_UseHighQualityCurve: 1
  m_RotationCurves: []
  m_CompressedRotationCurves: []
  m_EulerCurves:
  - curve:
      serializedVersion: 2
      m_Curve:
      - time: 0
        value: {x: -0, y: 0, z: 0}
        inSlope: {x: 0.000000008004128, y: 4.224, z: 5.6419606}
        outSlope: {x: 0.000000008004128, y: 4.224, z: 5.6419606}
        tangentMode: 0
      - time: 0.41666666
        value: {x: 0.0000000033350533, y: 1.76, z: 2.350817}
        inSlope: {x: -0.0000000010005157, y: -3.5229478, z: -0.705245}
        outSlope: {x: -0.0000000010005157, y: -3.5229478, z: -0.705245}
        tangentMode: 0
      - time: 0.75
        value: {x: 0, y: -1.9966319, z: 0}
        inSlope: {x: -0.0000000050025797, y: -4.3038597, z: -3.5262253}
        outSlope: {x: -0.0000000050025797, y: -4.3038597, z: -3.5262253}
        tangentMode: 0
      - time: 1.5
        value: {x: -0, y: 0, z: 0}
        inSlope: {x: -0, y: 2.662176, z: 0}
        outSlope: {x: -0, y: 2.662176, z: 0}
        tangentMode: 0
      m_PreInfinity: 2
      m_PostInfinity: 2
      m_RotationOrder: 4
    path: rotate
  m_PositionCurves:
  - curve:
      serializedVersion: 2
      m_Curve:
      - time: 0
        value: {x: -4.82, y: 3.98, z: 1.1}
        inSlope: {x: 12.504001, y: -7.32, z: 10.2960005}
        outSlope: {x: 12.504001, y: -7.32, z: 10.2960005}
        tangentMode: 0
      - time: 0.41666666
        value: {x: 0.39, y: 0.93, z: 5.39}
        inSlope: {x: 5.6670003, y: -3.6000001, z: 6.2280006}
        outSlope: {x: 5.6670003, y: -3.6000001, z: 6.2280006}
        tangentMode: 0
      - time: 0.75
        value: {x: -0, y: 0.97, z: 6.11}
        inSlope: {x: -0.585, y: 0.060000032, z: 1.0133338}
        outSlope: {x: -0.585, y: 0.060000032, z: 1.0133338}
        tangentMode: 0
      - time: 1.5
        value: {x: 0, y: 0.97, z: 6.01}
        inSlope: {x: 0, y: 0, z: -0.1333332}
        outSlope: {x: 0, y: 0, z: -0.1333332}
        tangentMode: 0
      m_PreInfinity: 2
      m_PostInfinity: 2
      m_RotationOrder: 4
    path: rotate/position
  m_ScaleCurves: []
  m_FloatCurves: []
  m_PPtrCurves: []
  m_SampleRate: 60
  m_WrapMode: 0
  m_Bounds:
    m_Center: {x: 0, y: 0, z: 0}
    m_Extent: {x: 0, y: 0, z: 0}
  m_ClipBindingConstant:
    genericBindings:
    - path: 1837759963
      attribute: 1
      script: {fileID: 0}
      classID: 4
      customType: 0
      isPPtrCurve: 0
    - path: 931746316
      attribute: 4
      script: {fileID: 0}
      classID: 4
      customType: 14
      isPPtrCurve: 0
    pptrCurveMapping: []
  m_AnimationClipSettings:
    serializedVersion: 2
    m_AdditiveReferencePoseClip: {fileID: 0}
    m_AdditiveReferencePoseTime: 0
    m_StartTime: 0
    m_StopTime: 1.5
    m_OrientationOffsetY: 0
    m_Level: 0
    m_CycleOffset: 0
    m_HasAdditiveReferencePose: 0
    m_LoopTime: 0
    m_LoopBlend: 0
    m_LoopBlendOrientation: 0
    m_LoopBlendPositionY: 0
    m_LoopBlendPositionXZ: 0
    m_KeepOriginalOrientation: 0
    m_KeepOriginalPositionY: 1
    m_KeepOriginalPositionXZ: 0
    m_HeightFromFeet: 0
    m_Mirror: 0
  m_EditorCurves:
  - curve:
      serializedVersion: 2
      m_Curve:
      - time: 0
        value: -4.82
        inSlope: 12.504001
        outSlope: 12.504001
        tangentMode: 10
      - time: 0.41666666
        value: 0.39
        inSlope: 5.6670003
        outSlope: 5.6670003
        tangentMode: 10
      - time: 0.75
        value: -0
        inSlope: -0.585
        outSlope: -0.585
        tangentMode: 10
      - time: 1.5
        value: 0
        inSlope: 0
        outSlope: 0
        tangentMode: 10
      m_PreInfinity: 2
      m_PostInfinity: 2
      m_RotationOrder: 4
    attribute: m_LocalPosition.x
    path: rotate/position
    classID: 4
    script: {fileID: 0}
  - curve:
      serializedVersion: 2
      m_Curve:
      - time: 0
        value: 3.98
        inSlope: -7.32
        outSlope: -7.32
        tangentMode: 10
      - time: 0.41666666
        value: 0.93
        inSlope: -3.6000001
        outSlope: -3.6000001
        tangentMode: 10
      - time: 0.75
        value: 0.97
        inSlope: 0.060000032
        outSlope: 0.060000032
        tangentMode: 10
      - time: 1.5
        value: 0.97
        inSlope: 0
        outSlope: 0
        tangentMode: 10
      m_PreInfinity: 2
      m_PostInfinity: 2
      m_RotationOrder: 4
    attribute: m_LocalPosition.y
    path: rotate/position
    classID: 4
    script: {fileID: 0}
  - curve:
      serializedVersion: 2
      m_Curve:
      - time: 0
        value: 1.1
        inSlope: 10.2960005
        outSlope: 10.2960005
        tangentMode: 10
      - time: 0.41666666
        value: 5.39
        inSlope: 6.2280006
        outSlope: 6.2280006
        tangentMode: 10
      - time: 0.75
        value: 6.11
        inSlope: 1.0133338
        outSlope: 1.0133338
        tangentMode: 10
      - time: 1.5
        value: 6.01
        inSlope: -0.1333332
        outSlope: -0.1333332
        tangentMode: 10
      m_PreInfinity: 2
      m_PostInfinity: 2
      m_RotationOrder: 4
    attribute: m_LocalPosition.z
    path: rotate/position
    classID: 4
    script: {fileID: 0}
  - curve:
      serializedVersion: 2
      m_Curve:
      - time: 0
        value: -0
        inSlope: 0.000000008004128
        outSlope: 0.000000008004128
        tangentMode: 10
      - time: 0.41666666
        value: 0.0000000033350533
        inSlope: -0.0000000010005157
        outSlope: -0.0000000010005157
        tangentMode: 10
      - time: 0.75
        value: 0
        inSlope: -0.0000000050025797
        outSlope: -0.0000000050025797
        tangentMode: 10
      - time: 1.5
        value: -0
        inSlope: -0
        outSlope: -0
        tangentMode: 10
      m_PreInfinity: 2
      m_PostInfinity: 2
      m_RotationOrder: 4
    attribute: localEulerAnglesRaw.x
    path: rotate
    classID: 4
    script: {fileID: 0}
  - curve:
      serializedVersion: 2
      m_Curve:
      - time: 0
        value: 0
        inSlope: 4.224
        outSlope: 4.224
        tangentMode: 10
      - time: 0.41666666
        value: 1.76
        inSlope: -3.5229478
        outSlope: -3.5229478
        tangentMode: 10
      - time: 0.75
        value: -1.9966319
        inSlope: -4.3038597
        outSlope: -4.3038597
        tangentMode: 10
      - time: 1.5
        value: 0
        inSlope: 2.662176
        outSlope: 2.662176
        tangentMode: 10
      m_PreInfinity: 2
      m_PostInfinity: 2
      m_RotationOrder: 4
    attribute: localEulerAnglesRaw.y
    path: rotate
    classID: 4
    script: {fileID: 0}
  - curve:
      serializedVersion: 2
      m_Curve:
      - time: 0
        value: 0
        inSlope: 5.6419606
        outSlope: 5.6419606
        tangentMode: 10
      - time: 0.41666666
        value: 2.350817
        inSlope: -0.705245
        outSlope: -0.705245
        tangentMode: 10
      - time: 0.75
        value: 0
        inSlope: -3.5262253
        outSlope: -3.5262253
        tangentMode: 10
      - time: 1.5
        value: 0
        inSlope: 0
        outSlope: 0
        tangentMode: 10
      m_PreInfinity: 2
      m_PostInfinity: 2
      m_RotationOrder: 4
    attribute: localEulerAnglesRaw.z
    path: rotate
    classID: 4
    script: {fileID: 0}
  m_EulerEditorCurves:
  - curve:
      serializedVersion: 2
      m_Curve: []
      m_PreInfinity: 2
      m_PostInfinity: 2
      m_RotationOrder: 4
    attribute: m_LocalEulerAngles.x
    path: rotate
    classID: 4
    script: {fileID: 0}
  - curve:
      serializedVersion: 2
      m_Curve: []
      m_PreInfinity: 2
      m_PostInfinity: 2
      m_RotationOrder: 4
    attribute: m_LocalEulerAngles.y
    path: rotate
    classID: 4
    script: {fileID: 0}
  - curve:
      serializedVersion: 2
      m_Curve: []
      m_PreInfinity: 2
      m_PostInfinity: 2
      m_RotationOrder: 4
    attribute: m_LocalEulerAngles.z
    path: rotate
    classID: 4
    script: {fileID: 0}
  m_HasGenericRootTransform: 0
  m_HasMotionFloatCurves: 0
  m_GenerateMotionCurves: 0
  m_Events: []
