%YAML 1.1
%TAG !u! tag:unity3d.com,2011:
--- !u!21 &2100000
Material:
  serializedVersion: 6
  m_ObjectHideFlags: 0
  m_CorrespondingSourceObject: {fileID: 0}
  m_PrefabInstance: {fileID: 0}
  m_PrefabAsset: {fileID: 0}
  m_Name: FX_smoke_003_AB_ky
  m_Shader: {fileID: 200, guid: 0000000000000000f000000000000000, type: 0}
  m_ShaderKeywords: 
  m_LightmapFlags: 4
  m_EnableInstancingVariants: 1
  m_DoubleSidedGI: 0
  m_CustomRenderQueue: -1
  stringTagMap: {}
  disabledShaderPasses: []
  m_SavedProperties:
    serializedVersion: 3
    m_TexEnvs:
    - _DiffuseTexture:
        m_Texture: {fileID: 2800000, guid: 9b6b448e6bccdda43a283a0e08570159, type: 3}
        m_Scale: {x: 1, y: 1}
        m_Offset: {x: 0, y: 0}
    - _MainTex:
        m_Texture: {fileID: 2800000, guid: 6e95a55d97b74304495111297b35611e, type: 3}
        m_Scale: {x: 1, y: 1}
        m_Offset: {x: 0, y: 0}
    - _T_mask:
        m_Texture: {fileID: 2800000, guid: 192b8b517da85124dab5f62cfea60a52, type: 3}
        m_Scale: {x: 1, y: 1}
        m_Offset: {x: 0, y: 0}
    m_Floats:
    - _Brightness: 3
    - _Cutoff: 0.5
    - _InvFade: 1
    - _MainTexPannerX: 0
    - _MainTexPannerY: 0
    - _N_BY_KD: 0.1
    - _N_BY_QD: 0.1
    - _N_mask: 3
    m_Colors:
    - _C_BYcolor: {r: 0.3490196, g: 0.09213562, b: 0.07058824, a: 1}
    - _ColorAlpha: {r: 2.118547, g: 0.3549399, b: 0.2772968, a: 1}
    - _TintColor: {r: 0.5, g: 0.5, b: 0.5, a: 0.5}
  m_BuildTextureStacks: []
