%YAML 1.1
%TAG !u! tag:unity3d.com,2011:
--- !u!1001 &100100000
Prefab:
  m_ObjectHideFlags: 1
  serializedVersion: 2
  m_Modification:
    m_TransformParent: {fileID: 0}
    m_Modifications: []
    m_RemovedComponents: []
  m_ParentPrefab: {fileID: 0}
  m_RootGameObject: {fileID: 1000013434837760}
  m_IsPrefabParent: 1
--- !u!1 &1000013434837760
GameObject:
  m_ObjectHideFlags: 0
  m_PrefabParentObject: {fileID: 0}
  m_PrefabInternal: {fileID: 100100000}
  serializedVersion: 4
  m_Component:
  - 4: {fileID: 4000011285963268}
  - 114: {fileID: 114000012414812730}
  m_Layer: 8
  m_Name: lightmap_5010_1
  m_TagString: Untagged
  m_Icon: {fileID: 0}
  m_NavMeshLayer: 0
  m_StaticEditorFlags: 0
  m_IsActive: 1
--- !u!4 &4000011285963268
Transform:
  m_ObjectHideFlags: 1
  m_PrefabParentObject: {fileID: 0}
  m_PrefabInternal: {fileID: 100100000}
  m_GameObject: {fileID: 1000013434837760}
  m_LocalRotation: {x: 0, y: 0, z: 0, w: 1}
  m_LocalPosition: {x: 0, y: 0, z: 0}
  m_LocalScale: {x: 1, y: 1, z: 1}
  m_LocalEulerAnglesHint: {x: 0, y: 0, z: 0}
  m_Children: []
  m_Father: {fileID: 0}
  m_RootOrder: 0
--- !u!114 &114000012414812730
MonoBehaviour:
  m_ObjectHideFlags: 1
  m_PrefabParentObject: {fileID: 0}
  m_PrefabInternal: {fileID: 100100000}
  m_GameObject: {fileID: 1000013434837760}
  m_Enabled: 1
  m_EditorHideFlags: 0
  m_Script: {fileID: 11500000, guid: 9b9d0662ce7f2614bb636d809f78c5dd, type: 3}
  m_Name: 
  m_EditorClassIdentifier: 
  renderData:
    lightmapMode: 0
    ambientMode: 1
    ambientLight: {r: 0, g: 0, b: 0, a: 1}
    ambientIntensity: 1
    ambientEquatorColor: {r: 0.45173606, g: 0.39792386, b: 0.58823526, a: 1}
    ambientGroundColor: {r: 0.0072988826, g: 0.012897486, b: 0.022058845, a: 1}
    ambientSkyColor: {r: 0, g: 0, b: 0, a: 1}
    defaultReflectionResolution: 128
    fog: 1
    fogColor: {r: 0, g: 0.83448315, b: 1, a: 1}
    fogDensity: 0.01
    fogEndDistance: 100
    fogMode: 1
    fogStartDistance: 60
    haloStrength: 0.5
  nearTextureList: []
  farTextureList:
  - {fileID: 2800000, guid: 934bb6a1d71629b409c777090aa6240c, type: 3}
  modelLightList:
  - index: -1
    scaleOffset: {x: 1, y: 1, z: 0, w: 0}
  - index: 0
    scaleOffset: {x: 0.40832278, y: 0.40832278, z: 0.1970298, w: 0.5394206}
  - index: 0
    scaleOffset: {x: 0.19449039, y: 0.19449039, z: -0.0007597281, w: 0.31564653}
  - index: 0
    scaleOffset: {x: 0.19725488, y: 0.19725488, z: -0.0007705269, w: -0.0007705269}
  - index: 0
    scaleOffset: {x: 0.541962, y: 0.541962, z: 0.19650777, w: -0.0021170392}
  - index: -1
    scaleOffset: {x: 1, y: 1, z: 0, w: 0}
  - index: -1
    scaleOffset: {x: 1, y: 1, z: 0, w: 0}
  - index: -1
    scaleOffset: {x: 1, y: 1, z: 0, w: 0}
  - index: -1
    scaleOffset: {x: 1, y: 1, z: 0, w: 0}
  - index: 0
    scaleOffset: {x: 0.11425266, y: 0.11425266, z: 0, w: 0.19921875}
