%YAML 1.1
%TAG !u! tag:unity3d.com,2011:
--- !u!21 &2100000
Material:
  serializedVersion: 6
  m_ObjectHideFlags: 0
  m_CorrespondingSourceObject: {fileID: 0}
  m_PrefabInstance: {fileID: 0}
  m_PrefabAsset: {fileID: 0}
  m_Name: M_t_water_01_lcb_DT 2
  m_Shader: {fileID: 202, guid: 0000000000000000f000000000000000, type: 0}
  m_ShaderKeywords: 
  m_LightmapFlags: 4
  m_EnableInstancingVariants: 1
  m_DoubleSidedGI: 0
  m_CustomRenderQueue: -1
  stringTagMap: {}
  disabledShaderPasses: []
  m_SavedProperties:
    serializedVersion: 3
    m_TexEnvs:
    - _MainTex:
        m_Texture: {fileID: 2800000, guid: b9e972a706770cf4fbecb47f26a8c84d, type: 3}
        m_Scale: {x: 1, y: 1.5}
        m_Offset: {x: 0, y: 0}
    - _MaskTex:
        m_Texture: {fileID: 2800000, guid: 60d33b600b610904cb1db0b6abc3e809, type: 3}
        m_Scale: {x: 1, y: 1}
        m_Offset: {x: 0, y: 0.05}
    - _TurbulenceTex:
        m_Texture: {fileID: 2800000, guid: b9e972a706770cf4fbecb47f26a8c84d, type: 3}
        m_Scale: {x: 1, y: 1}
        m_Offset: {x: 0, y: 0}
    m_Floats:
    - _Brightness: 1.5
    - _BumpScale: 1
    - _ColorMask: 15
    - _Cutoff: 0.5
    - _DetailNormalMapScale: 1
    - _DstBlend: 0
    - _GlossMapScale: 1
    - _Glossiness: 0.5
    - _GlossyReflections: 1
    - _InvFade: 1
    - _MainTexBrightness: 8
    - _MainTexContrast: 1
    - _MainTexPannerX: 0.2
    - _MainTexPannerY: 0.6
    - _MaskTexDynmatic: 0
    - _MaskTexPannerX: 0
    - _MaskTexPannerY: 0
    - _Metallic: 0
    - _Mode: 0
    - _N_BY_KD: 0
    - _N_BY_QD: 0
    - _N_mask: 1
    - _NormalTexPannerX: 0.2
    - _NormalTexPannerY: 0.2
    - _OcclusionStrength: 1
    - _Parallax: 0.02
    - _SmoothnessTextureChannel: 0
    - _SpecularHighlights: 1
    - _SrcBlend: 1
    - _Stencil: 0
    - _StencilComp: 8
    - _StencilOp: 0
    - _StencilReadMask: 255
    - _StencilWriteMask: 255
    - _UVEffectPower: 0.1
    - _UVSec: 0
    - _ZWrite: 1
    m_Colors:
    - _C_BYcolor: {r: 0, g: 0.16855, b: 1, a: 1}
    - _Color: {r: 1, g: 1, b: 1, a: 1}
    - _ColorAlpha: {r: 2.118547, g: 2.118547, b: 2.118547, a: 1}
    - _EmissionColor: {r: 0, g: 0, b: 0, a: 1}
    - _MainColor: {r: 0.5797881, g: 0.7339535, b: 0.9528302, a: 1}
  m_BuildTextureStacks: []
