%YAML 1.1
%TAG !u! tag:unity3d.com,2011:
--- !u!21 &2100000
Material:
  serializedVersion: 6
  m_ObjectHideFlags: 0
  m_CorrespondingSourceObject: {fileID: 0}
  m_PrefabInstance: {fileID: 0}
  m_PrefabAsset: {fileID: 0}
  m_Name: FX_Ms_008zsw_0_Ultra02_025
  m_Shader: {fileID: 200, guid: 0000000000000000f000000000000000, type: 0}
  m_ShaderKeywords: _DISSOLVEMODE_PARTICALDISSOLVE _FRESNELMULTIPLYALPHA_ON
  m_LightmapFlags: 4
  m_EnableInstancingVariants: 1
  m_DoubleSidedGI: 0
  m_CustomRenderQueue: -1
  stringTagMap: {}
  disabledShaderPasses: []
  m_SavedProperties:
    serializedVersion: 3
    m_TexEnvs:
    - _MainTex:
        m_Texture: {fileID: 2800000, guid: 482e7cb06ba012c408feba17973f525c, type: 3}
        m_Scale: {x: 1, y: 1}
        m_Offset: {x: 0, y: 0}
    - _MaskTex:
        m_Texture: {fileID: 2800000, guid: 482e7cb06ba012c408feba17973f525c, type: 3}
        m_Scale: {x: 1, y: 1}
        m_Offset: {x: 0, y: 0}
    - _TurbulenceTex:
        m_Texture: {fileID: 0}
        m_Scale: {x: 0.15, y: 2}
        m_Offset: {x: 0, y: 0}
    m_Floats:
    - _Brightness: 1
    - _BumpScale: 1
    - _ColorMask: 15
    - _Contrast: 1
    - _Cutoff: 0.5
    - _DetailNormalMapScale: 1
    - _Dis_Threshold: 1
    - _Dissolve: 1
    - _DissolveMode: 1
    - _DstBlend: 0
    - _EdgeWidth: 0
    - _FrenselValue: 0.31
    - _FresnelBrightness: 2.16
    - _FresnelMultiplyAlpha: 1
    - _GlossMapScale: 1
    - _Glossiness: 0.5
    - _GlossyReflections: 1
    - _Hardness: 1
    - _InvFade: 1
    - _MainT_Tiling_U: 1
    - _MainT_Tiling_V: 1.31
    - _MainTexBrightness: 1.5
    - _MainTexContrast: 1.5
    - _MainTexPannerX: 0
    - _MainTexPannerY: 0
    - _MaskTexDynmatic: 0
    - _MaskTexPannerX: 0
    - _MaskTexPannerY: 0
    - _Metallic: 0
    - _Mode: 0
    - _N_Power: 0.2
    - _NormalTexPannerX: 0
    - _NormalTexPannerY: 0
    - _NormalThreshold: 0
    - _OcclusionStrength: 1
    - _Parallax: 0.02
    - _SmoothnessTextureChannel: 0
    - _SpecularHighlights: 1
    - _SrcBlend: 1
    - _Stencil: 0
    - _StencilComp: 8
    - _StencilOp: 0
    - _StencilReadMask: 255
    - _StencilWriteMask: 255
    - _TurbulencePower: 0
    - _TurbulenceTexPannerX: 0
    - _TurbulenceTexPannerY: 0
    - _UVEffectPower: 0
    - _UVSec: 0
    - _U_N_Panner: 0
    - _U_N_Tiling: 0.5
    - _V_N_Tiling: 0.5
    - _Y_N_Panner: 0
    - _ZWrite: 1
    m_Colors:
    - _Color: {r: 1, g: 1, b: 1, a: 1}
    - _EdgeColor: {r: 1, g: 1, b: 1, a: 1}
    - _EmissionColor: {r: 0, g: 0, b: 0, a: 1}
    - _FrenselColor: {r: 0.6132076, g: 0.2458615, b: 0.2458615, a: 1}
    - _MainColor: {r: 2.118547, g: 2.118547, b: 2.118547, a: 1}
    - _Main_color: {r: 1, g: 1, b: 1, a: 1}
    - _TintColor: {r: 0.5, g: 0.5, b: 0.5, a: 0.5}
    - _VTInfoBlock: {r: 0, g: 0, b: 0, a: 0}
  m_BuildTextureStacks: []
