%YAML 1.1
%TAG !u! tag:unity3d.com,2011:
--- !u!21 &2100000
Material:
  serializedVersion: 6
  m_ObjectHideFlags: 0
  m_PrefabParentObject: {fileID: 0}
  m_PrefabInternal: {fileID: 0}
  m_Name: other_017_blend
  m_Shader: {fileID: 203, guid: 0000000000000000f000000000000000, type: 0}
  m_ShaderKeywords: _PARTICLE_CONTROLA_ON
  m_LightmapFlags: 5
  m_CustomRenderQueue: -1
  stringTagMap: {}
  m_SavedProperties:
    serializedVersion: 2
    m_TexEnvs:
    - first:
        name: _Dissolve_Tex
      second:
        m_Texture: {fileID: 2800000, guid: 7acc33f24a06fcd46baa112415b42195, type: 3}
        m_Scale: {x: 1, y: 1}
        m_Offset: {x: -0.11, y: 0.26}
    - first:
        name: _MainTex
      second:
        m_Texture: {fileID: 2800000, guid: 2a01b2b97e12c2d4081f02cc0d26aafe, type: 3}
        m_Scale: {x: 1, y: 1}
        m_Offset: {x: 0, y: 0}
    m_Floats:
    - first:
        name: _Cutoff
      second: 0.5
    - first:
        name: _InvFade
      second: 1
    - first:
        name: _MainTex_Power
      second: 1.2
    - first:
        name: _diss_amount
      second: -0.01
    - first:
        name: _particle_controlA
      second: 1
    m_Colors:
    - first:
        name: _MainColor
      second: {r: 1, g: 1, b: 1, a: 1}
    - first:
        name: _TintColor
      second: {r: 1, g: 1, b: 1, a: 1}
