%YAML 1.1
%TAG !u! tag:unity3d.com,2011:
--- !u!21 &2100000
Material:
  serializedVersion: 6
  m_ObjectHideFlags: 0
  m_CorrespondingSourceObject: {fileID: 0}
  m_PrefabInstance: {fileID: 0}
  m_PrefabAsset: {fileID: 0}
  m_Name: Fx_fire_030_cq003
  m_Shader: {fileID: 200, guid: 0000000000000000f000000000000000, type: 0}
  m_ShaderKeywords: _DISSOLVEMODE_PARTICALDISSOLVE
  m_LightmapFlags: 4
  m_EnableInstancingVariants: 1
  m_DoubleSidedGI: 0
  m_CustomRenderQueue: -1
  stringTagMap: {}
  disabledShaderPasses: []
  m_SavedProperties:
    serializedVersion: 3
    m_TexEnvs:
    - _MainT:
        m_Texture: {fileID: 2800000, guid: 7b0cf791a3331154981c63da47b9a417, type: 3}
        m_Scale: {x: -1.75, y: 1}
        m_Offset: {x: 0.73, y: 0}
    - _MainTex:
        m_Texture: {fileID: 2800000, guid: 7b0cf791a3331154981c63da47b9a417, type: 3}
        m_Scale: {x: 1, y: 1}
        m_Offset: {x: 0, y: 0}
    - _Noise_T:
        m_Texture: {fileID: 0}
        m_Scale: {x: 0.35, y: 0.35}
        m_Offset: {x: 0, y: 0}
    m_Floats:
    - _BlendMode: 10
    - _BumpScale: 1
    - _ColorMask: 15
    - _Cutoff: 0.5
    - _DetailNormalMapScale: 1
    - _Dissolve: 0
    - _DissolveMode: 1
    - _DstBlend: 0
    - _EdgeWidth: 0
    - _GlossMapScale: 1
    - _Glossiness: 0.5
    - _GlossyReflections: 1
    - _Hardness: 1
    - _InvFade: 1
    - _MainTexBrightness: 2.3
    - _MainTexContrast: 1
    - _MainTexPannerX: 0
    - _MainTexPannerY: -2
    - _Main_T_Offset_U: 0
    - _Main_T_Offset_V: 0
    - _MaskTexDynmatic: 0
    - _MaskTexPannerX: 0
    - _MaskTexPannerY: 0
    - _Metallic: 0
    - _Mode: 0
    - _N_Power: 0
    - _Noise_T_Offset_U: 0
    - _Noise_T_Offset_V: 0
    - _NormalTexPannerX: 0
    - _NormalTexPannerY: 0
    - _OcclusionStrength: 1
    - _Offset_Z: 0
    - _Parallax: 0.02
    - _SmoothnessTextureChannel: 0
    - _SpecularHighlights: 1
    - _SrcBlend: 1
    - _Stencil: 0
    - _StencilComp: 8
    - _StencilOp: 0
    - _StencilReadMask: 255
    - _StencilWriteMask: 255
    - _UVEffectPower: 0
    - _UVSec: 0
    - _ZWrite: 1
    m_Colors:
    - _Color: {r: 1, g: 1, b: 1, a: 1}
    - _EdgeColor: {r: 0.6037736, g: 0.1794233, b: 0.1794233, a: 1}
    - _EmissionColor: {r: 0, g: 0, b: 0, a: 1}
    - _MainColor: {r: 1.414214, g: 1.414214, b: 1.414214, a: 1}
    - _TintColor: {r: 0.5, g: 0.5, b: 0.5, a: 0.5}
  m_BuildTextureStacks: []
