%YAML 1.1
%TAG !u! tag:unity3d.com,2011:
--- !u!21 &2100000
Material:
  serializedVersion: 6
  m_ObjectHideFlags: 0
  m_PrefabParentObject: {fileID: 0}
  m_PrefabInternal: {fileID: 0}
  m_Name: magic_eff_100402_att_paopao
  m_Shader: {fileID: 4800000, guid: 2306c852b9dad4f409cda3f7e0a60e52, type: 3}
  m_ShaderKeywords: _PARTICLE_CONTROLA_ON
  m_LightmapFlags: 5
  m_CustomRenderQueue: -1
  stringTagMap: {}
  m_SavedProperties:
    serializedVersion: 2
    m_TexEnvs:
    - first:
        name: _Dissolve_Tex
      second:
        m_Texture: {fileID: 2800000, guid: 8b3d7684efa5a074185ca9c36589d8de, type: 3}
        m_Scale: {x: 1, y: 1}
        m_Offset: {x: 0, y: 0}
    - first:
        name: _MainTex
      second:
        m_Texture: {fileID: 2800000, guid: 4828e322595331a4b845d9e8c46989f2, type: 3}
        m_Scale: {x: 1, y: 1}
        m_Offset: {x: 0, y: 0}
    m_Floats:
    - first:
        name: _Cutoff
      second: 0.5
    - first:
        name: _InvFade
      second: 1
    - first:
        name: _MainTex_Power
      second: 3
    - first:
        name: _diss_amount
      second: -0.01
    - first:
        name: _particle_controlA
      second: 1
    m_Colors:
    - first:
        name: _MainColor
      second: {r: 0.5, g: 0.5, b: 0.5, a: 1}
    - first:
        name: _TintColor
      second: {r: 0.5, g: 0.5, b: 0.5, a: 0.5}
