%YAML 1.1
%TAG !u! tag:unity3d.com,2011:
--- !u!21 &2100000
Material:
  serializedVersion: 6
  m_ObjectHideFlags: 0
  m_CorrespondingSourceObject: {fileID: 0}
  m_PrefabInstance: {fileID: 0}
  m_PrefabAsset: {fileID: 0}
  m_Name: FX_dilie_sjw001
  m_Shader: {fileID: 200, guid: 0000000000000000f000000000000000, type: 0}
  m_ShaderKeywords: 
  m_LightmapFlags: 4
  m_EnableInstancingVariants: 1
  m_DoubleSidedGI: 0
  m_CustomRenderQueue: -1
  stringTagMap: {}
  disabledShaderPasses: []
  m_SavedProperties:
    serializedVersion: 3
    m_TexEnvs:
    - _DetailTex:
        m_Texture: {fileID: 2800000, guid: 236b7fc4cea17904bbebf8b65e9ce072, type: 3}
        m_Scale: {x: 1, y: 1}
        m_Offset: {x: 0, y: 0}
    - _MainTex:
        m_Texture: {fileID: 2800000, guid: 10691c3a10d6b4c49af55e2f4aba2932, type: 3}
        m_Scale: {x: 1, y: 1}
        m_Offset: {x: 0, y: 0}
    m_Floats:
    - _ColorMask: 15
    - _Cutoff: 0.5
    - _InvFade: 1
    - _MMultiplier: 2
    - _MainTexBrightness: 1
    - _MainTexContrast: 1
    - _MainTexPannerX: 0
    - _MainTexPannerY: 0
    - _MaskTexDynmatic: 0
    - _MaskTexPannerX: 0
    - _MaskTexPannerY: 0
    - _N_BY_KD: 2
    - _N_BY_QD: 2.66
    - _N_mask: 2.67
    - _NormalTexPannerX: 0
    - _NormalTexPannerY: 0
    - _Scroll2X: 4
    - _Scroll2Y: 0
    - _ScrollX: 0
    - _ScrollY: 0
    - _Stencil: 0
    - _StencilComp: 8
    - _StencilOp: 0
    - _StencilReadMask: 255
    - _StencilWriteMask: 255
    - _UVEffectPower: 0
    m_Colors:
    - _C_BYcolor: {r: 1, g: 0.7389756, b: 0.2028302, a: 1}
    - _Color: {r: 1, g: 1, b: 1, a: 1}
    - _ColorAlpha: {r: 1, g: 1, b: 1, a: 1}
    - _MainColor: {r: 1, g: 1, b: 1, a: 1}
    - _TintColor: {r: 0.5, g: 0.5, b: 0.5, a: 0.5}
  m_BuildTextureStacks: []
