%YAML 1.1
%TAG !u! tag:unity3d.com,2011:
--- !u!21 &2100000
Material:
  serializedVersion: 8
  m_ObjectHideFlags: 0
  m_CorrespondingSourceObject: {fileID: 0}
  m_PrefabInstance: {fileID: 0}
  m_PrefabAsset: {fileID: 0}
  m_Name: ring_005_liuguang
  m_Shader: {fileID: 4800000, guid: 1f7e247671bff644992230748634170a, type: 3}
  m_ValidKeywords: []
  m_InvalidKeywords: []
  m_LightmapFlags: 5
  m_EnableInstancingVariants: 0
  m_DoubleSidedGI: 0
  m_CustomRenderQueue: -1
  stringTagMap: {}
  disabledShaderPasses: []
  m_SavedProperties:
    serializedVersion: 3
    m_TexEnvs:
    - _Liuguang01:
        m_Texture: {fileID: 2800000, guid: dc366a37011f3e44e8441208e90529a1, type: 3}
        m_Scale: {x: 1, y: 1}
        m_Offset: {x: 0, y: 0}
    - _Liuguang02:
        m_Texture: {fileID: 2800000, guid: 7acc33f24a06fcd46baa112415b42195, type: 3}
        m_Scale: {x: 1, y: 1}
        m_Offset: {x: 0, y: 0}
    - _MainTex:
        m_Texture: {fileID: 2800000, guid: 80b6beb26444ff44eb96935a17331e51, type: 3}
        m_Scale: {x: 1, y: 1}
        m_Offset: {x: 0, y: 0}
    m_Ints: []
    m_Floats:
    - _Alpha: 2
    - _InvFade: 1
    - _Liuguang_ZT: 3
    - _Liuguang_power: 2
    - _Posterize: 4
    - _Posterize_Switch: 0
    - _U_Speed01: 3
    - _U_Speed02: 2
    - _V_Speed01: 1
    - _V_Speed02: 5
    m_Colors:
    - _TintColor: {r: 1, g: 0.35172406, b: 0, a: 0.5}
  m_BuildTextureStacks: []
