%YAML 1.1
%TAG !u! tag:unity3d.com,2011:
--- !u!21 &2100000
Material:
  serializedVersion: 6
  m_ObjectHideFlags: 0
  m_CorrespondingSourceObject: {fileID: 0}
  m_PrefabInstance: {fileID: 0}
  m_PrefabAsset: {fileID: 0}
  m_Name: Linetralve_cq002
  m_Shader: {fileID: 200, guid: 0000000000000000f000000000000000, type: 0}
  m_ShaderKeywords: 
  m_LightmapFlags: 4
  m_EnableInstancingVariants: 1
  m_DoubleSidedGI: 0
  m_CustomRenderQueue: -1
  stringTagMap: {}
  disabledShaderPasses: []
  m_SavedProperties:
    serializedVersion: 3
    m_TexEnvs:
    - _MainTex:
        m_Texture: {fileID: 2800000, guid: 4806db12ae2d15b40a6edded94383a1a, type: 3}
        m_Scale: {x: 1, y: 1}
        m_Offset: {x: 0, y: 0}
    m_Floats:
    - _Amount: 1
    - _BumpScale: 1
    - _Cutoff: 0.5
    - _Density: 5.84
    - _Density2: 5
    - _DetailNormalMapScale: 1
    - _Dissolve: 0.8473159
    - _DstBlend: 0
    - _EdgeWidth: 1
    - _GlossMapScale: 1
    - _Glossiness: 0.5
    - _GlossyReflections: 1
    - _Hardness: 1
    - _InvFade: 1
    - _Metallic: 0
    - _Mode: 0
    - _N_Power: 0.1
    - _OcclusionStrength: 1
    - _Parallax: 0.02
    - _SmoothnessTextureChannel: 0
    - _SpecularHighlights: 1
    - _Speed: 1
    - _SrcBlend: 1
    - _UVSec: 0
    - _U_N_Panner: 0
    - _U_N_Tiling: 1
    - _V_N_Tiling: 1
    - _Y_N_Panner: 0.34
    - _ZWrite: 1
    - _color_strength: 3.95
    - _line_Amount: 0.21
    - _line_Speed: 1
    - _width: 0.03
    m_Colors:
    - _Color: {r: 1, g: 1, b: 1, a: 1}
    - _EdgeColor: {r: 1, g: 1, b: 1, a: 1}
    - _EmissionColor: {r: 0, g: 0, b: 0, a: 1}
    - _MainColor: {r: 1, g: 1, b: 1, a: 1}
    - _TintColor: {r: 0.5, g: 0.5, b: 0.5, a: 0.5}
    - _VTInfoBlock: {r: 0, g: 0, b: 0, a: 0}
    - _color: {r: 0.9716981, g: 0.3070933, b: 0.3479814, a: 1}
  m_BuildTextureStacks: []
