%YAML 1.1
%TAG !u! tag:unity3d.com,2011:
--- !u!90 &9000000
Avatar:
  m_ObjectHideFlags: 0
  m_CorrespondingSourceObject: {fileID: 0}
  m_PrefabInstance: {fileID: 0}
  m_PrefabAsset: {fileID: 0}
  m_Name: ms_zb03_03
  m_AvatarSize: 3520
  m_Avatar:
    serializedVersion: 3
    m_AvatarSkeleton:
      data:
        m_Node:
        - m_ParentId: -1
          m_AxesId: -1
        - m_ParentId: 0
          m_AxesId: -1
        - m_ParentId: 0
          m_AxesId: -1
        - m_ParentId: 2
          m_AxesId: -1
        - m_ParentId: 3
          m_AxesId: -1
        - m_ParentId: 4
          m_AxesId: -1
        - m_ParentId: 5
          m_AxesId: -1
        - m_ParentId: 6
          m_AxesId: -1
        - m_ParentId: 7
          m_AxesId: -1
        - m_ParentId: 8
          m_AxesId: -1
        - m_ParentId: 7
          m_AxesId: -1
        - m_ParentId: 10
          m_AxesId: -1
        - m_ParentId: 7
          m_AxesId: -1
        - m_ParentId: 12
          m_AxesId: -1
        - m_ParentId: 6
          m_AxesId: -1
        - m_ParentId: 14
          m_AxesId: -1
        - m_ParentId: 4
          m_AxesId: -1
        - m_ParentId: 3
          m_AxesId: -1
        - m_ParentId: 17
          m_AxesId: -1
        - m_ParentId: 18
          m_AxesId: -1
        - m_ParentId: 19
          m_AxesId: -1
        - m_ParentId: 17
          m_AxesId: -1
        - m_ParentId: 3
          m_AxesId: -1
        - m_ParentId: 0
          m_AxesId: -1
        - m_ParentId: 0
          m_AxesId: -1
        - m_ParentId: 0
          m_AxesId: -1
        - m_ParentId: 0
          m_AxesId: -1
        - m_ParentId: 0
          m_AxesId: -1
        m_ID: 00000000062721bae51b53374cc7b041ac8bf097c30161e99acc1dc515e5682d971f01d04f0249e99032b937daf433c661e94f1230362ab3617110dd43e39bae21a51e6e87c7469efcbee306abc34946d74178e1a3662dffd52a93f92bde225ebdee2529c97a5dd95e8653a0b39c853a
        m_AxesArray: []
    m_AvatarSkeletonPose:
      data:
        m_X:
        - t: {x: 0, y: 0, z: 0}
          q: {x: 0, y: 0, z: 0, w: 1}
          s: {x: 1, y: 1, z: 1}
        - t: {x: 0, y: 0, z: -3.540626e-10}
          q: {x: -0.7071068, y: 0, z: 0, w: 0.7071068}
          s: {x: 1, y: 1, z: 1}
        - t: {x: -0.008282, y: 0.000543, z: -0.165933}
          q: {x: 0.000277924, y: -0.002295275, z: -0.7108533, w: 0.7033365}
          s: {x: 1, y: 1, z: 1}
        - t: {x: -1.409718, y: 0, z: 0}
          q: {x: 0, y: 0, z: -0.004444486, w: 0.9999902}
          s: {x: 1, y: 1, z: 1}
        - t: {x: -0.874271, y: 0.614715, z: -0.340262}
          q: {x: 0.0000001880616, y: 0.000000009744342, z: -0.6695701, w: 0.7427489}
          s: {x: 1, y: 1, z: 1}
        - t: {x: -0.581385, y: 0, z: 0}
          q: {x: 0, y: 0, z: -0.7094926, w: 0.7047129}
          s: {x: 1, y: 1, z: 1}
        - t: {x: -0.883453, y: 0.000009, z: 0}
          q: {x: 0.5944103, y: 0.4194812, z: -0.4600306, w: 0.5090027}
          s: {x: 1, y: 1, z: 1}
        - t: {x: -0.818948, y: 0, z: 0}
          q: {x: -0.0000001331581, y: -0.000000133158, z: -0.0000001331581, w: 1}
          s: {x: 1, y: 1, z: 1}
        - t: {x: -0.263281, y: 0.063668, z: -0.020106}
          q: {x: -0.02046942, y: -0.02650601, z: -0.06992581, w: 0.9969899}
          s: {x: 1, y: 1, z: 1}
        - t: {x: -0.230386, y: 0, z: 0}
          q: {x: 0, y: 0, z: 0.2660948, w: 0.9639469}
          s: {x: 1, y: 1, z: 1}
        - t: {x: -0.257181, y: 0.023118, z: 0.075318}
          q: {x: 0.5056337, y: 0.1860105, z: -0.065084, w: 0.8399398}
          s: {x: 1, y: 1, z: 1}
        - t: {x: -0.203447, y: 0, z: 0}
          q: {x: 0, y: 0, z: 0.2660948, w: 0.9639469}
          s: {x: 1, y: 1, z: 1}
        - t: {x: -0.235837, y: -0.003992, z: -0.12657}
          q: {x: -0.4938233, y: -0.194547, z: -0.04935536, w: 0.8460817}
          s: {x: 1, y: 1, z: 1}
        - t: {x: -0.21418, y: 0, z: 0}
          q: {x: -0.0007956223, y: 0.002882197, z: 0.2660936, w: 0.9639425}
          s: {x: 1, y: 1, z: 1}
        - t: {x: -0.331183, y: 0.444806, z: -0.065946}
          q: {x: -0.02404008, y: -0.005706031, z: 0.03720503, w: 0.9990022}
          s: {x: 1, y: 1, z: 1}
        - t: {x: -1.776773, y: 0.004435699, z: 0.01292012}
          q: {x: 0.0006386712, y: -0.005294782, z: -0.0154866, w: 0.9998659}
          s: {x: 0.9999998, y: 0.9999997, z: 0.9999997}
        - t: {x: -0.144184, y: -0.108017, z: 0.43208}
          q: {x: 0.6853353, y: 0.1741136, z: -0.6658131, w: -0.2381026}
          s: {x: 1, y: 1, z: 1}
        - t: {x: -0.863441, y: -0.603587, z: -0.340262}
          q: {x: -0.7002639, y: 0.7138841, z: 0.00000009324577, w: 0.00000009505942}
          s: {x: -1, y: -1, z: -1}
        - t: {x: -0.581385, y: 0, z: 0}
          q: {x: 0.002974979, y: -0.003490541, z: -0.6794801, w: 0.7336797}
          s: {x: 1, y: 1, z: 1}
        - t: {x: -0.848814, y: 0.000009, z: 0}
          q: {x: 0.550738, y: 0.4363088, z: -0.4440803, w: 0.5559811}
          s: {x: 1, y: 1, z: 1}
        - t: {x: -2.399641, y: -0.007967234, z: 0.0176785}
          q: {x: -0.004860588, y: -0.002514869, z: 0.9998794, w: -0.01453812}
          s: {x: -0.9999999, y: -1, z: -1}
        - t: {x: -0.148315, y: -0.117032, z: 0.432079}
          q: {x: 0.1967999, y: -0.6791685, z: -0.2158382, w: 0.6733602}
          s: {x: -1, y: -1, z: -1}
        - t: {x: -2.180813, y: -0.01110226, z: 0.1659329}
          q: {x: 0.00000005734507, y: 0.00000005785706, z: 0.7102423, w: 0.7039573}
          s: {x: 1, y: 1, z: 1}
        - t: {x: 0.742, y: 1.793, z: -1.539}
          q: {x: -0.4063677, y: 0.5786749, z: -0.4063685, w: 0.5786754}
          s: {x: 0.9999999, y: 1, z: 0.9999998}
        - t: {x: -0.7369999, y: 1.793, z: -1.539}
          q: {x: -0.4063684, y: 0.5786757, z: -0.4063675, w: 0.5786749}
          s: {x: 1, y: 1, z: 0.9999999}
        - t: {x: -0.8299999, y: 1.315, z: -1.501}
          q: {x: 0.000004266058, y: 0.00000102024, z: 0.9999872, w: 0.005061449}
          s: {x: 1, y: 1, z: 1}
        - t: {x: 0, y: 0, z: 0}
          q: {x: 0.00000006657903, y: 0, z: 0, w: 1}
          s: {x: 1, y: 1, z: 1}
        - t: {x: 0, y: 2.267154, z: 1.160774}
          q: {x: 0.00000006657903, y: 0, z: 0, w: 1}
          s: {x: 1, y: 1, z: 1}
    m_DefaultPose:
      data:
        m_X:
        - t: {x: 0, y: 0, z: 0}
          q: {x: 0, y: 0, z: 0, w: 1}
          s: {x: 1, y: 1, z: 1}
        - t: {x: 0, y: 0, z: -3.540626e-10}
          q: {x: -0.7071068, y: 0, z: 0, w: 0.7071068}
          s: {x: 1, y: 1, z: 1}
        - t: {x: -0.008282, y: 0.000543, z: -0.165933}
          q: {x: 0.000277924, y: -0.002295275, z: -0.7108533, w: 0.7033365}
          s: {x: 1, y: 1, z: 1}
        - t: {x: -1.409718, y: 0, z: 0}
          q: {x: 0, y: 0, z: -0.004444486, w: 0.9999902}
          s: {x: 1, y: 1, z: 1}
        - t: {x: -0.874271, y: 0.614715, z: -0.340262}
          q: {x: 0.0000001880616, y: 0.000000009744342, z: -0.6695701, w: 0.7427489}
          s: {x: 1, y: 1, z: 1}
        - t: {x: -0.581385, y: 0, z: 0}
          q: {x: 0, y: 0, z: -0.7094926, w: 0.7047129}
          s: {x: 1, y: 1, z: 1}
        - t: {x: -0.883453, y: 0.000009, z: 0}
          q: {x: 0.5944103, y: 0.4194812, z: -0.4600306, w: 0.5090027}
          s: {x: 1, y: 1, z: 1}
        - t: {x: -0.818948, y: 0, z: 0}
          q: {x: -0.0000001331581, y: -0.000000133158, z: -0.0000001331581, w: 1}
          s: {x: 1, y: 1, z: 1}
        - t: {x: -0.263281, y: 0.063668, z: -0.020106}
          q: {x: -0.02046942, y: -0.02650601, z: -0.06992581, w: 0.9969899}
          s: {x: 1, y: 1, z: 1}
        - t: {x: -0.230386, y: 0, z: 0}
          q: {x: 0, y: 0, z: 0.2660948, w: 0.9639469}
          s: {x: 1, y: 1, z: 1}
        - t: {x: -0.257181, y: 0.023118, z: 0.075318}
          q: {x: 0.5056337, y: 0.1860105, z: -0.065084, w: 0.8399398}
          s: {x: 1, y: 1, z: 1}
        - t: {x: -0.203447, y: 0, z: 0}
          q: {x: 0, y: 0, z: 0.2660948, w: 0.9639469}
          s: {x: 1, y: 1, z: 1}
        - t: {x: -0.235837, y: -0.003992, z: -0.12657}
          q: {x: -0.4938233, y: -0.194547, z: -0.04935536, w: 0.8460817}
          s: {x: 1, y: 1, z: 1}
        - t: {x: -0.21418, y: 0, z: 0}
          q: {x: -0.0007956223, y: 0.002882197, z: 0.2660936, w: 0.9639425}
          s: {x: 1, y: 1, z: 1}
        - t: {x: -0.331183, y: 0.444806, z: -0.065946}
          q: {x: -0.02404008, y: -0.005706031, z: 0.03720503, w: 0.9990022}
          s: {x: 1, y: 1, z: 1}
        - t: {x: -1.776773, y: 0.004435699, z: 0.01292012}
          q: {x: 0.0006386712, y: -0.005294782, z: -0.0154866, w: 0.9998659}
          s: {x: 0.9999998, y: 0.9999997, z: 0.9999997}
        - t: {x: -0.144184, y: -0.108017, z: 0.43208}
          q: {x: 0.6853353, y: 0.1741136, z: -0.6658131, w: -0.2381026}
          s: {x: 1, y: 1, z: 1}
        - t: {x: -0.863441, y: -0.603587, z: -0.340262}
          q: {x: -0.7002639, y: 0.7138841, z: 0.00000009324577, w: 0.00000009505942}
          s: {x: -1, y: -1, z: -1}
        - t: {x: -0.581385, y: 0, z: 0}
          q: {x: 0.002974979, y: -0.003490541, z: -0.6794801, w: 0.7336797}
          s: {x: 1, y: 1, z: 1}
        - t: {x: -0.848814, y: 0.000009, z: 0}
          q: {x: 0.550738, y: 0.4363088, z: -0.4440803, w: 0.5559811}
          s: {x: 1, y: 1, z: 1}
        - t: {x: -2.399641, y: -0.007967234, z: 0.0176785}
          q: {x: -0.004860588, y: -0.002514869, z: 0.9998794, w: -0.01453812}
          s: {x: -0.9999999, y: -1, z: -1}
        - t: {x: -0.148315, y: -0.117032, z: 0.432079}
          q: {x: 0.1967999, y: -0.6791685, z: -0.2158382, w: 0.6733602}
          s: {x: -1, y: -1, z: -1}
        - t: {x: -2.180813, y: -0.01110226, z: 0.1659329}
          q: {x: 0.00000005734507, y: 0.00000005785706, z: 0.7102423, w: 0.7039573}
          s: {x: 1, y: 1, z: 1}
        - t: {x: 0.742, y: 1.793, z: -1.539}
          q: {x: -0.4063677, y: 0.5786749, z: -0.4063685, w: 0.5786754}
          s: {x: 0.9999999, y: 1, z: 0.9999998}
        - t: {x: -0.7369999, y: 1.793, z: -1.539}
          q: {x: -0.4063684, y: 0.5786757, z: -0.4063675, w: 0.5786749}
          s: {x: 1, y: 1, z: 0.9999999}
        - t: {x: -0.8299999, y: 1.315, z: -1.501}
          q: {x: 0.000004266058, y: 0.00000102024, z: 0.9999872, w: 0.005061449}
          s: {x: 1, y: 1, z: 1}
        - t: {x: 0, y: 0, z: 0}
          q: {x: 0.00000006657903, y: 0, z: 0, w: 1}
          s: {x: 1, y: 1, z: 1}
        - t: {x: 0, y: 2.267154, z: 1.160774}
          q: {x: 0.00000006657903, y: 0, z: 0, w: 1}
          s: {x: 1, y: 1, z: 1}
    m_SkeletonNameIDArray: 00000000062721bae51b53375f4a5aae6aef3947fcdf3e30468e37a9d0be30de07bf2cb0918f2bc70092945796a29320f149627267796505a42a482e9b5ad19a1e7b41b741a38f4ed7938839321a4f59c41506a0884b46c0a259c1072bde225ebdee2529c97a5dd95e8653a0b39c853a
    m_Human:
      data:
        serializedVersion: 2
        m_RootX:
          t: {x: 0, y: 0, z: 0}
          q: {x: 0, y: 0, z: 0, w: 1}
          s: {x: 1, y: 1, z: 1}
        m_Skeleton:
          data:
            m_Node: []
            m_ID: 
            m_AxesArray: []
        m_SkeletonPose:
          data:
            m_X: []
        m_LeftHand:
          data:
            m_HandBoneIndex: ffffffffffffffffffffffffffffffffffffffffffffffffffffffffffffffffffffffffffffffffffffffffffffffffffffffffffffffffffffffff
        m_RightHand:
          data:
            m_HandBoneIndex: ffffffffffffffffffffffffffffffffffffffffffffffffffffffffffffffffffffffffffffffffffffffffffffffffffffffffffffffffffffffff
        m_HumanBoneIndex: ffffffffffffffffffffffffffffffffffffffffffffffffffffffffffffffffffffffffffffffffffffffffffffffffffffffffffffffffffffffffffffffffffffffffffffffffffffffffffffffffffffffffffffffffffffffffffffffffffffffff
        m_HumanBoneMass:
        - 0.1454546
        - 0.1212121
        - 0.1212121
        - 0.04848485
        - 0.04848485
        - 0.009696971
        - 0.009696971
        - 0.03030303
        - 0.1454546
        - 0.1454546
        - 0.01212121
        - 0.04848485
        - 0.006060607
        - 0.006060607
        - 0.02424243
        - 0.02424243
        - 0.01818182
        - 0.01818182
        - 0.006060607
        - 0.006060607
        - 0.002424243
        - 0.002424243
        - 0
        - 0
        - 0
        m_Scale: 1
        m_ArmTwist: 0.5
        m_ForeArmTwist: 0.5
        m_UpperLegTwist: 0.5
        m_LegTwist: 0.5
        m_ArmStretch: 0.05
        m_LegStretch: 0.05
        m_FeetSpacing: 0
        m_HasLeftHand: 0
        m_HasRightHand: 0
        m_HasTDoF: 0
    m_HumanSkeletonIndexArray: 
    m_HumanSkeletonReverseIndexArray: 
    m_RootMotionBoneIndex: -1
    m_RootMotionBoneX:
      t: {x: 0, y: 0, z: 0}
      q: {x: 0, y: 0, z: 0, w: 1}
      s: {x: 1, y: 1, z: 1}
    m_RootMotionSkeleton:
      data:
        m_Node: []
        m_ID: 
        m_AxesArray: []
    m_RootMotionSkeletonPose:
      data:
        m_X: []
    m_RootMotionSkeletonIndexArray: 
  m_TOS:
    3913876047: Bone001/Bone002/Bone004/Bone005/Bone006/Bone007/Bone016/Bone017
    4187171541: Bone001/Bone002/Head
    928193509: Bone001
    2549124012: Bone001/Bone002/Bone004
    2929451843: Bone001/Bone002/Bone004/Bone005/Bone006/Bone011/RightWeapon
    761849109: Bone001/Bone002/Bone004/Bone005/Bone006/Bone007
    934883984: Bone001/Bone002/Bone004/Bone005/Bone006/Bone007/Bone018
    3325293786: Bone001/Bone002/Bone004/Bone005/Bone006/Bone007/Bone018/Bone019
    690351805: Bone015
    3782754775: Bone001/Bone002/Bone008/Bone009/Bone010/LeftWeapon
    1102104396: Bone001/Bone002
    3489734551: Bone001/Bone002/Bone004/Bone005/Bone006/Bone007/Bone016
    4281165475: Bone001/Bone002/Bone008/Bone013
    2655438727: Bone001/Bone002/Bone008
    0: 
    981834931: Chest
    3646782153: Bone003
    3708842337: Bone001/Bone002/Bone004/Bone005/Bone006/Bone011
    3307064474: Bone001/Bone002/Bone004/Bone005/Bone006
    1579343403: Bone014
    3915448771: Bone001/Bone002/Bone004/Bone005
    115588860: Bone001/Bone002/Bone008/Bone009
    2689828446: Ground
    307226977: Bone001/Bone002/Bone004/Bone005/Bone006/Bone007/Bone020
    3122734854: Ms_zb03_0
    1179239339: Bone001/Bone002/Bone008/Bone009/Bone010
    3005888048: Bone001/Bone002/Bone004/Bone005/Bone006/Bone007/Bone020/Bone021
    1847502113: Bone001/Bone002/Bone004/Bone012
  m_HumanDescription:
    serializedVersion: 3
    m_Human: []
    m_Skeleton: []
    m_ArmTwist: 0.5
    m_ForeArmTwist: 0.5
    m_UpperLegTwist: 0.5
    m_LegTwist: 0.5
    m_ArmStretch: 0.05
    m_LegStretch: 0.05
    m_FeetSpacing: 0
    m_GlobalScale: 1
    m_RootMotionBoneName: 
    m_HasTranslationDoF: 0
    m_HasExtraRoot: 0
    m_SkeletonHasParents: 1
