%YAML 1.1
%TAG !u! tag:unity3d.com,2011:
--- !u!1 &1000013163987024
GameObject:
  m_ObjectHideFlags: 0
  m_CorrespondingSourceObject: {fileID: 0}
  m_PrefabInstance: {fileID: 0}
  m_PrefabAsset: {fileID: 0}
  serializedVersion: 6
  m_Component:
  - component: {fileID: 4000013905574938}
  - component: {fileID: 114000013908317680}
  m_Layer: 0
  m_Name: ItemAtlas2
  m_TagString: Untagged
  m_Icon: {fileID: 0}
  m_NavMeshLayer: 0
  m_StaticEditorFlags: 0
  m_IsActive: 1
--- !u!4 &4000013905574938
Transform:
  m_ObjectHideFlags: 0
  m_CorrespondingSourceObject: {fileID: 0}
  m_PrefabInstance: {fileID: 0}
  m_PrefabAsset: {fileID: 0}
  m_GameObject: {fileID: 1000013163987024}
  m_LocalRotation: {x: 0, y: 0, z: 0, w: 1}
  m_LocalPosition: {x: 0, y: 0, z: 0}
  m_LocalScale: {x: 1, y: 1, z: 1}
  m_Children: []
  m_Father: {fileID: 0}
  m_RootOrder: 0
  m_LocalEulerAnglesHint: {x: 0, y: 0, z: 0}
--- !u!114 &114000013908317680
MonoBehaviour:
  m_ObjectHideFlags: 0
  m_CorrespondingSourceObject: {fileID: 0}
  m_PrefabInstance: {fileID: 0}
  m_PrefabAsset: {fileID: 0}
  m_GameObject: {fileID: 1000013163987024}
  m_Enabled: 1
  m_EditorHideFlags: 0
  m_Script: {fileID: 11500000, guid: 4d0c51bb0b6e93049af5e88f93826e3b, type: 3}
  m_Name: 
  m_EditorClassIdentifier: 
  material: {fileID: 2100000, guid: be595344f10b7c54996ae093a6054838, type: 2}
  mSprites:
  - name: 3100000
    x: 255
    y: 521
    width: 119
    height: 116
    borderLeft: 0
    borderRight: 0
    borderTop: 0
    borderBottom: 0
    paddingLeft: 5
    paddingRight: 4
    paddingTop: 8
    paddingBottom: 4
  - name: 3100100
    x: 782
    y: 46
    width: 93
    height: 93
    borderLeft: 0
    borderRight: 0
    borderTop: 0
    borderBottom: 0
    paddingLeft: 18
    paddingRight: 17
    paddingTop: 18
    paddingBottom: 17
  - name: 3100200
    x: 694
    y: 140
    width: 99
    height: 99
    borderLeft: 0
    borderRight: 0
    borderTop: 0
    borderBottom: 0
    paddingLeft: 17
    paddingRight: 12
    paddingTop: 16
    paddingBottom: 13
  - name: 3100300
    x: 129
    y: 638
    width: 125
    height: 128
    borderLeft: 0
    borderRight: 0
    borderTop: 0
    borderBottom: 0
    paddingLeft: 3
    paddingRight: 0
    paddingTop: 0
    paddingBottom: 0
  - name: 3100400
    x: 596
    y: 805
    width: 107
    height: 108
    borderLeft: 0
    borderRight: 0
    borderTop: 0
    borderBottom: 0
    paddingLeft: 11
    paddingRight: 10
    paddingTop: 10
    paddingBottom: 10
  - name: 3100500
    x: 913
    y: 820
    width: 100
    height: 100
    borderLeft: 0
    borderRight: 0
    borderTop: 0
    borderBottom: 0
    paddingLeft: 14
    paddingRight: 14
    paddingTop: 14
    paddingBottom: 14
  - name: 3100600
    x: 373
    y: 151
    width: 120
    height: 116
    borderLeft: 0
    borderRight: 0
    borderTop: 0
    borderBottom: 0
    paddingLeft: 8
    paddingRight: 0
    paddingTop: 8
    paddingBottom: 4
  - name: 3106301
    x: 812
    y: 714
    width: 100
    height: 101
    borderLeft: 0
    borderRight: 0
    borderTop: 0
    borderBottom: 0
    paddingLeft: 14
    paddingRight: 14
    paddingTop: 14
    paddingBottom: 13
  - name: 3106401
    x: 809
    y: 816
    width: 103
    height: 103
    borderLeft: 0
    borderRight: 0
    borderTop: 0
    borderBottom: 0
    paddingLeft: 16
    paddingRight: 9
    paddingTop: 13
    paddingBottom: 12
  - name: 3106501
    x: 129
    y: 511
    width: 125
    height: 126
    borderLeft: 0
    borderRight: 0
    borderTop: 0
    borderBottom: 0
    paddingLeft: 1
    paddingRight: 2
    paddingTop: 2
    paddingBottom: 0
  - name: 3106601
    x: 877
    y: 170
    width: 88
    height: 89
    borderLeft: 0
    borderRight: 0
    borderTop: 0
    borderBottom: 0
    paddingLeft: 18
    paddingRight: 22
    paddingTop: 23
    paddingBottom: 16
  - name: 3106701
    x: 913
    y: 719
    width: 99
    height: 100
    borderLeft: 0
    borderRight: 0
    borderTop: 0
    borderBottom: 0
    paddingLeft: 12
    paddingRight: 17
    paddingTop: 16
    paddingBottom: 12
  - name: 3200000
    x: 129
    y: 767
    width: 128
    height: 128
    borderLeft: 0
    borderRight: 0
    borderTop: 0
    borderBottom: 0
    paddingLeft: 0
    paddingRight: 0
    paddingTop: 0
    paddingBottom: 0
  - name: 3200100
    x: 921
    y: 922
    width: 98
    height: 102
    borderLeft: 0
    borderRight: 0
    borderTop: 0
    borderBottom: 0
    paddingLeft: 14
    paddingRight: 16
    paddingTop: 12
    paddingBottom: 14
  - name: 3200200
    x: 704
    y: 813
    width: 104
    height: 104
    borderLeft: 0
    borderRight: 0
    borderTop: 0
    borderBottom: 0
    paddingLeft: 12
    paddingRight: 12
    paddingTop: 12
    paddingBottom: 12
  - name: 3200300
    x: 0
    y: 55
    width: 128
    height: 128
    borderLeft: 0
    borderRight: 0
    borderTop: 0
    borderBottom: 0
    paddingLeft: 0
    paddingRight: 0
    paddingTop: 0
    paddingBottom: 0
  - name: 3200400
    x: 573
    y: 454
    width: 108
    height: 109
    borderLeft: 0
    borderRight: 0
    borderTop: 0
    borderBottom: 0
    paddingLeft: 10
    paddingRight: 10
    paddingTop: 9
    paddingBottom: 10
  - name: 3200500
    x: 794
    y: 602
    width: 102
    height: 100
    borderLeft: 0
    borderRight: 0
    borderTop: 0
    borderBottom: 0
    paddingLeft: 13
    paddingRight: 13
    paddingTop: 14
    paddingBottom: 14
  - name: 3200600
    x: 0
    y: 313
    width: 128
    height: 128
    borderLeft: 0
    borderRight: 0
    borderTop: 0
    borderBottom: 0
    paddingLeft: 0
    paddingRight: 0
    paddingTop: 0
    paddingBottom: 0
  - name: 3206301
    x: 789
    y: 260
    width: 98
    height: 100
    borderLeft: 0
    borderRight: 0
    borderTop: 0
    borderBottom: 0
    paddingLeft: 15
    paddingRight: 15
    paddingTop: 14
    paddingBottom: 14
  - name: 3206401
    x: 583
    y: 186
    width: 106
    height: 106
    borderLeft: 0
    borderRight: 0
    borderTop: 0
    borderBottom: 0
    paddingLeft: 9
    paddingRight: 13
    paddingTop: 14
    paddingBottom: 8
  - name: 3206501
    x: 129
    y: 896
    width: 128
    height: 128
    borderLeft: 0
    borderRight: 0
    borderTop: 0
    borderBottom: 0
    paddingLeft: 0
    paddingRight: 0
    paddingTop: 0
    paddingBottom: 0
  - name: 3206601
    x: 974
    y: 426
    width: 87
    height: 88
    borderLeft: 0
    borderRight: 0
    borderTop: 0
    borderBottom: 0
    paddingLeft: 22
    paddingRight: 19
    paddingTop: 19
    paddingBottom: 21
  - name: 3206701
    x: 713
    y: 920
    width: 103
    height: 104
    borderLeft: 0
    borderRight: 0
    borderTop: 0
    borderBottom: 0
    paddingLeft: 11
    paddingRight: 14
    paddingTop: 14
    paddingBottom: 10
  - name: 3300000
    x: 129
    y: 260
    width: 123
    height: 124
    borderLeft: 0
    borderRight: 0
    borderTop: 0
    borderBottom: 0
    paddingLeft: 1
    paddingRight: 4
    paddingTop: 4
    paddingBottom: 0
  - name: 3300100
    x: 376
    y: 911
    width: 113
    height: 113
    borderLeft: 0
    borderRight: 0
    borderTop: 0
    borderBottom: 0
    paddingLeft: 8
    paddingRight: 7
    paddingTop: 8
    paddingBottom: 7
  - name: 3300200
    x: 603
    y: 918
    width: 109
    height: 106
    borderLeft: 0
    borderRight: 0
    borderTop: 0
    borderBottom: 0
    paddingLeft: 9
    paddingRight: 10
    paddingTop: 12
    paddingBottom: 10
  - name: 3300300
    x: 0
    y: 829
    width: 128
    height: 128
    borderLeft: 0
    borderRight: 0
    borderTop: 0
    borderBottom: 0
    paddingLeft: 0
    paddingRight: 0
    paddingTop: 0
    paddingBottom: 0
  - name: 3300400
    x: 480
    y: 564
    width: 109
    height: 109
    borderLeft: 0
    borderRight: 0
    borderTop: 0
    borderBottom: 0
    paddingLeft: 8
    paddingRight: 11
    paddingTop: 11
    paddingBottom: 8
  - name: 3300500
    x: 897
    y: 612
    width: 100
    height: 101
    borderLeft: 0
    borderRight: 0
    borderTop: 0
    borderBottom: 0
    paddingLeft: 14
    paddingRight: 14
    paddingTop: 14
    paddingBottom: 13
  - name: 3300600
    x: 0
    y: 700
    width: 128
    height: 128
    borderLeft: 0
    borderRight: 0
    borderTop: 0
    borderBottom: 0
    paddingLeft: 0
    paddingRight: 0
    paddingTop: 0
    paddingBottom: 0
  - name: 3306301
    x: 483
    y: 798
    width: 112
    height: 112
    borderLeft: 0
    borderRight: 0
    borderTop: 0
    borderBottom: 0
    paddingLeft: 12
    paddingRight: 4
    paddingTop: 5
    paddingBottom: 11
  - name: 3306401
    x: 258
    y: 907
    width: 117
    height: 117
    borderLeft: 0
    borderRight: 0
    borderTop: 0
    borderBottom: 0
    paddingLeft: 9
    paddingRight: 2
    paddingTop: 2
    paddingBottom: 9
  - name: 3306501
    x: 129
    y: 135
    width: 122
    height: 124
    borderLeft: 0
    borderRight: 0
    borderTop: 0
    borderBottom: 0
    paddingLeft: 6
    paddingRight: 0
    paddingTop: 0
    paddingBottom: 4
  - name: 3306601
    x: 817
    y: 921
    width: 103
    height: 103
    borderLeft: 0
    borderRight: 0
    borderTop: 0
    borderBottom: 0
    paddingLeft: 16
    paddingRight: 9
    paddingTop: 11
    paddingBottom: 14
  - name: 3306701
    x: 258
    y: 789
    width: 117
    height: 117
    borderLeft: 0
    borderRight: 0
    borderTop: 0
    borderBottom: 0
    paddingLeft: 10
    paddingRight: 1
    paddingTop: 2
    paddingBottom: 9
  - name: 3400000
    x: 1256
    y: 126
    width: 58
    height: 67
    borderLeft: 0
    borderRight: 0
    borderTop: 0
    borderBottom: 0
    paddingLeft: 18
    paddingRight: 24
    paddingTop: 20
    paddingBottom: 13
  - name: 3400100
    x: 1457
    y: 339
    width: 62
    height: 64
    borderLeft: 0
    borderRight: 0
    borderTop: 0
    borderBottom: 0
    paddingLeft: 16
    paddingRight: 22
    paddingTop: 22
    paddingBottom: 14
  - name: 3400200
    x: 1442
    y: 625
    width: 67
    height: 66
    borderLeft: 0
    borderRight: 0
    borderTop: 0
    borderBottom: 0
    paddingLeft: 17
    paddingRight: 16
    paddingTop: 19
    paddingBottom: 15
  - name: 3400300
    x: 1181
    y: 53
    width: 67
    height: 70
    borderLeft: 0
    borderRight: 0
    borderTop: 0
    borderBottom: 0
    paddingLeft: 12
    paddingRight: 21
    paddingTop: 19
    paddingBottom: 11
  - name: 3400400
    x: 1251
    y: 323
    width: 70
    height: 71
    borderLeft: 0
    borderRight: 0
    borderTop: 0
    borderBottom: 0
    paddingLeft: 14
    paddingRight: 16
    paddingTop: 17
    paddingBottom: 12
  - name: 3400500
    x: 1101
    y: 106
    width: 73
    height: 67
    borderLeft: 0
    borderRight: 0
    borderTop: 0
    borderBottom: 0
    paddingLeft: 14
    paddingRight: 13
    paddingTop: 20
    paddingBottom: 13
  - name: 3400600
    x: 1211
    y: 395
    width: 71
    height: 75
    borderLeft: 0
    borderRight: 0
    borderTop: 0
    borderBottom: 0
    paddingLeft: 14
    paddingRight: 15
    paddingTop: 14
    paddingBottom: 11
  - name: 3406301
    x: 1293
    y: 552
    width: 71
    height: 69
    borderLeft: 0
    borderRight: 0
    borderTop: 0
    borderBottom: 0
    paddingLeft: 14
    paddingRight: 15
    paddingTop: 19
    paddingBottom: 12
  - name: 3406401
    x: 1361
    y: 645
    width: 68
    height: 72
    borderLeft: 0
    borderRight: 0
    borderTop: 0
    borderBottom: 0
    paddingLeft: 10
    paddingRight: 22
    paddingTop: 15
    paddingBottom: 13
  - name: 3406501
    x: 1219
    y: 596
    width: 69
    height: 77
    borderLeft: 0
    borderRight: 0
    borderTop: 0
    borderBottom: 0
    paddingLeft: 17
    paddingRight: 14
    paddingTop: 14
    paddingBottom: 9
  - name: 3406601
    x: 1155
    y: 674
    width: 75
    height: 74
    borderLeft: 0
    borderRight: 0
    borderTop: 0
    borderBottom: 0
    paddingLeft: 14
    paddingRight: 11
    paddingTop: 15
    paddingBottom: 11
  - name: 3406701
    x: 1403
    y: 957
    width: 76
    height: 67
    borderLeft: 0
    borderRight: 0
    borderTop: 0
    borderBottom: 0
    paddingLeft: 12
    paddingRight: 12
    paddingTop: 15
    paddingBottom: 18
  - name: 3500000
    x: 1392
    y: 339
    width: 64
    height: 64
    borderLeft: 0
    borderRight: 0
    borderTop: 0
    borderBottom: 0
    paddingLeft: 15
    paddingRight: 21
    paddingTop: 18
    paddingBottom: 18
  - name: 3500100
    x: 1405
    y: 219
    width: 67
    height: 59
    borderLeft: 0
    borderRight: 0
    borderTop: 0
    borderBottom: 0
    paddingLeft: 11
    paddingRight: 22
    paddingTop: 20
    paddingBottom: 21
  - name: 3500200
    x: 1489
    y: 561
    width: 54
    height: 63
    borderLeft: 0
    borderRight: 0
    borderTop: 0
    borderBottom: 0
    paddingLeft: 22
    paddingRight: 24
    paddingTop: 17
    paddingBottom: 20
  - name: 3500300
    x: 1392
    y: 279
    width: 69
    height: 59
    borderLeft: 0
    borderRight: 0
    borderTop: 0
    borderBottom: 0
    paddingLeft: 11
    paddingRight: 20
    paddingTop: 21
    paddingBottom: 20
  - name: 3500400
    x: 957
    y: 3
    width: 70
    height: 61
    borderLeft: 0
    borderRight: 0
    borderTop: 0
    borderBottom: 0
    paddingLeft: 11
    paddingRight: 19
    paddingTop: 20
    paddingBottom: 19
  - name: 3500500
    x: 1507
    y: 698
    width: 74
    height: 59
    borderLeft: 0
    borderRight: 0
    borderTop: 0
    borderBottom: 0
    paddingLeft: 10
    paddingRight: 16
    paddingTop: 20
    paddingBottom: 21
  - name: 3500600
    x: 1547
    y: 897
    width: 68
    height: 62
    borderLeft: 0
    borderRight: 0
    borderTop: 0
    borderBottom: 0
    paddingLeft: 11
    paddingRight: 21
    paddingTop: 19
    paddingBottom: 19
  - name: 3506301
    x: 1327
    y: 889
    width: 76
    height: 67
    borderLeft: 0
    borderRight: 0
    borderTop: 0
    borderBottom: 0
    paddingLeft: 11
    paddingRight: 13
    paddingTop: 14
    paddingBottom: 19
  - name: 3506401
    x: 1177
    y: 124
    width: 78
    height: 69
    borderLeft: 0
    borderRight: 0
    borderTop: 0
    borderBottom: 0
    paddingLeft: 12
    paddingRight: 10
    paddingTop: 14
    paddingBottom: 17
  - name: 3506501
    x: 1482
    y: 885
    width: 64
    height: 74
    borderLeft: 0
    borderRight: 0
    borderTop: 0
    borderBottom: 0
    paddingLeft: 19
    paddingRight: 17
    paddingTop: 12
    paddingBottom: 14
  - name: 3506601
    x: 1320
    y: 805
    width: 64
    height: 81
    borderLeft: 0
    borderRight: 0
    borderTop: 0
    borderBottom: 0
    paddingLeft: 19
    paddingRight: 17
    paddingTop: 8
    paddingBottom: 11
  - name: 3506701
    x: 1323
    y: 957
    width: 79
    height: 67
    borderLeft: 0
    borderRight: 0
    borderTop: 0
    borderBottom: 0
    paddingLeft: 12
    paddingRight: 9
    paddingTop: 15
    paddingBottom: 18
  - name: 3600000
    x: 601
    y: 1
    width: 80
    height: 67
    borderLeft: 0
    borderRight: 0
    borderTop: 0
    borderBottom: 0
    paddingLeft: 11
    paddingRight: 9
    paddingTop: 13
    paddingBottom: 20
  - name: 3600100
    x: 1231
    y: 697
    width: 78
    height: 68
    borderLeft: 0
    borderRight: 0
    borderTop: 0
    borderBottom: 0
    paddingLeft: 11
    paddingRight: 11
    paddingTop: 13
    paddingBottom: 19
  - name: 3600200
    x: 1463
    y: 823
    width: 75
    height: 61
    borderLeft: 0
    borderRight: 0
    borderTop: 0
    borderBottom: 0
    paddingLeft: 14
    paddingRight: 11
    paddingTop: 19
    paddingBottom: 20
  - name: 3600300
    x: 1255
    y: 257
    width: 75
    height: 65
    borderLeft: 0
    borderRight: 0
    borderTop: 0
    borderBottom: 0
    paddingLeft: 14
    paddingRight: 11
    paddingTop: 16
    paddingBottom: 19
  - name: 3600400
    x: 1387
    y: 756
    width: 74
    height: 66
    borderLeft: 0
    borderRight: 0
    borderTop: 0
    borderBottom: 0
    paddingLeft: 15
    paddingRight: 11
    paddingTop: 15
    paddingBottom: 19
  - name: 3600500
    x: 1316
    y: 45
    width: 69
    height: 67
    borderLeft: 0
    borderRight: 0
    borderTop: 0
    borderBottom: 0
    paddingLeft: 19
    paddingRight: 12
    paddingTop: 15
    paddingBottom: 18
  - name: 3600600
    x: 1215
    y: 494
    width: 77
    height: 69
    borderLeft: 0
    borderRight: 0
    borderTop: 0
    borderBottom: 0
    paddingLeft: 12
    paddingRight: 11
    paddingTop: 11
    paddingBottom: 20
  - name: 3606301
    x: 1177
    y: 194
    width: 77
    height: 70
    borderLeft: 0
    borderRight: 0
    borderTop: 0
    borderBottom: 0
    paddingLeft: 13
    paddingRight: 10
    paddingTop: 12
    paddingBottom: 18
  - name: 3606401
    x: 1243
    y: 955
    width: 79
    height: 69
    borderLeft: 0
    borderRight: 0
    borderTop: 0
    borderBottom: 0
    paddingLeft: 7
    paddingRight: 14
    paddingTop: 12
    paddingBottom: 19
  - name: 3606501
    x: 1310
    y: 718
    width: 76
    height: 69
    borderLeft: 0
    borderRight: 0
    borderTop: 0
    borderBottom: 0
    paddingLeft: 15
    paddingRight: 9
    paddingTop: 12
    paddingBottom: 19
  - name: 3606601
    x: 1247
    y: 887
    width: 79
    height: 67
    borderLeft: 0
    borderRight: 0
    borderTop: 0
    borderBottom: 0
    paddingLeft: 10
    paddingRight: 11
    paddingTop: 15
    paddingBottom: 18
  - name: 3606701
    x: 1391
    y: 404
    width: 68
    height: 67
    borderLeft: 0
    borderRight: 0
    borderTop: 0
    borderBottom: 0
    paddingLeft: 17
    paddingRight: 15
    paddingTop: 18
    paddingBottom: 15
  - name: 4000000
    x: 375
    y: 551
    width: 104
    height: 122
    borderLeft: 0
    borderRight: 0
    borderTop: 0
    borderBottom: 0
    paddingLeft: 12
    paddingRight: 12
    paddingTop: 6
    paddingBottom: 0
  - name: 4000100
    x: 957
    y: 65
    width: 71
    height: 104
    borderLeft: 0
    borderRight: 0
    borderTop: 0
    borderBottom: 0
    paddingLeft: 28
    paddingRight: 29
    paddingTop: 12
    paddingBottom: 12
  - name: 4000200
    x: 1171
    y: 931
    width: 71
    height: 93
    borderLeft: 0
    borderRight: 0
    borderTop: 0
    borderBottom: 0
    paddingLeft: 24
    paddingRight: 33
    paddingTop: 16
    paddingBottom: 19
  - name: 4000300
    x: 493
    y: 293
    width: 92
    height: 128
    borderLeft: 0
    borderRight: 0
    borderTop: 0
    borderBottom: 0
    paddingLeft: 12
    paddingRight: 24
    paddingTop: 0
    paddingBottom: 0
  - name: 4000400
    x: 1029
    y: 106
    width: 71
    height: 91
    borderLeft: 0
    borderRight: 0
    borderTop: 0
    borderBottom: 0
    paddingLeft: 29
    paddingRight: 28
    paddingTop: 18
    paddingBottom: 19
  - name: 4000500
    x: 1331
    y: 270
    width: 60
    height: 77
    borderLeft: 0
    borderRight: 0
    borderTop: 0
    borderBottom: 0
    paddingLeft: 34
    paddingRight: 34
    paddingTop: 26
    paddingBottom: 25
  - name: 4000600
    x: 796
    y: 363
    width: 80
    height: 116
    borderLeft: 0
    borderRight: 0
    borderTop: 0
    borderBottom: 0
    paddingLeft: 28
    paddingRight: 20
    paddingTop: 8
    paddingBottom: 4
  - name: 4005301
    x: 1037
    y: 252
    width: 69
    height: 90
    borderLeft: 0
    borderRight: 0
    borderTop: 0
    borderBottom: 0
    paddingLeft: 28
    paddingRight: 31
    paddingTop: 18
    paddingBottom: 20
  - name: 4005401
    x: 876
    y: 55
    width: 80
    height: 99
    borderLeft: 0
    borderRight: 0
    borderTop: 0
    borderBottom: 0
    paddingLeft: 30
    paddingRight: 18
    paddingTop: 18
    paddingBottom: 11
  - name: 4005501
    x: 594
    y: 689
    width: 108
    height: 108
    borderLeft: 0
    borderRight: 0
    borderTop: 0
    borderBottom: 0
    paddingLeft: 4
    paddingRight: 16
    paddingTop: 16
    paddingBottom: 4
  - name: 4005601
    x: 1014
    y: 825
    width: 74
    height: 96
    borderLeft: 0
    borderRight: 0
    borderTop: 0
    borderBottom: 0
    paddingLeft: 25
    paddingRight: 29
    paddingTop: 16
    paddingBottom: 16
  - name: 4100000
    x: 129
    y: 385
    width: 124
    height: 125
    borderLeft: 0
    borderRight: 0
    borderTop: 0
    borderBottom: 0
    paddingLeft: 4
    paddingRight: 0
    paddingTop: 3
    paddingBottom: 0
  - name: 4100100
    x: 590
    y: 572
    width: 103
    height: 114
    borderLeft: 0
    borderRight: 0
    borderTop: 0
    borderBottom: 0
    paddingLeft: 13
    paddingRight: 12
    paddingTop: 7
    paddingBottom: 7
  - name: 4100200
    x: 682
    y: 467
    width: 107
    height: 104
    borderLeft: 0
    borderRight: 0
    borderTop: 0
    borderBottom: 0
    paddingLeft: 14
    paddingRight: 7
    paddingTop: 14
    paddingBottom: 10
  - name: 4100300
    x: 254
    y: 389
    width: 120
    height: 121
    borderLeft: 0
    borderRight: 0
    borderTop: 0
    borderBottom: 0
    paddingLeft: 8
    paddingRight: 0
    paddingTop: 7
    paddingBottom: 0
  - name: 4100400
    x: 695
    y: 361
    width: 100
    height: 105
    borderLeft: 0
    borderRight: 0
    borderTop: 0
    borderBottom: 0
    paddingLeft: 15
    paddingRight: 13
    paddingTop: 9
    paddingBottom: 14
  - name: 4100500
    x: 485
    y: 687
    width: 108
    height: 110
    borderLeft: 0
    borderRight: 0
    borderTop: 0
    borderBottom: 0
    paddingLeft: 10
    paddingRight: 10
    paddingTop: 9
    paddingBottom: 9
  - name: 4100600
    x: 488
    y: 26
    width: 112
    height: 124
    borderLeft: 0
    borderRight: 0
    borderTop: 0
    borderBottom: 0
    paddingLeft: 8
    paddingRight: 8
    paddingTop: 4
    paddingBottom: 0
  - name: 4105301
    x: 690
    y: 240
    width: 98
    height: 108
    borderLeft: 0
    borderRight: 0
    borderTop: 0
    borderBottom: 0
    paddingLeft: 15
    paddingRight: 15
    paddingTop: 9
    paddingBottom: 11
  - name: 4105401
    x: 586
    y: 349
    width: 108
    height: 104
    borderLeft: 0
    borderRight: 0
    borderTop: 0
    borderBottom: 0
    paddingLeft: 12
    paddingRight: 8
    paddingTop: 13
    paddingBottom: 11
  - name: 4105501
    x: 364
    y: 674
    width: 120
    height: 114
    borderLeft: 0
    borderRight: 0
    borderTop: 0
    borderBottom: 0
    paddingLeft: 4
    paddingRight: 4
    paddingTop: 8
    paddingBottom: 6
  - name: 4105601
    x: 790
    y: 480
    width: 109
    height: 96
    borderLeft: 0
    borderRight: 0
    borderTop: 0
    borderBottom: 0
    paddingLeft: 12
    paddingRight: 7
    paddingTop: 15
    paddingBottom: 17
  - name: 4110000
    x: 1460
    y: 443
    width: 48
    height: 76
    borderLeft: 0
    borderRight: 0
    borderTop: 0
    borderBottom: 0
    paddingLeft: 23
    paddingRight: 29
    paddingTop: 13
    paddingBottom: 11
  - name: 4110100
    x: 1352
    y: 472
    width: 61
    height: 79
    borderLeft: 0
    borderRight: 0
    borderTop: 0
    borderBottom: 0
    paddingLeft: 17
    paddingRight: 22
    paddingTop: 14
    paddingBottom: 7
  - name: 4110200
    x: 1539
    y: 803
    width: 53
    height: 81
    borderLeft: 0
    borderRight: 0
    borderTop: 0
    borderBottom: 0
    paddingLeft: 22
    paddingRight: 25
    paddingTop: 12
    paddingBottom: 7
  - name: 4110300
    x: 1316
    y: 113
    width: 58
    height: 80
    borderLeft: 0
    borderRight: 0
    borderTop: 0
    borderBottom: 0
    paddingLeft: 20
    paddingRight: 22
    paddingTop: 13
    paddingBottom: 7
  - name: 4110400
    x: 1076
    y: 546
    width: 76
    height: 79
    borderLeft: 0
    borderRight: 0
    borderTop: 0
    borderBottom: 0
    paddingLeft: 12
    paddingRight: 12
    paddingTop: 12
    paddingBottom: 9
  - name: 4110500
    x: 1062
    y: 432
    width: 74
    height: 82
    borderLeft: 0
    borderRight: 0
    borderTop: 0
    borderBottom: 0
    paddingLeft: 15
    paddingRight: 11
    paddingTop: 10
    paddingBottom: 8
  - name: 4110600
    x: 977
    y: 343
    width: 79
    height: 82
    borderLeft: 0
    borderRight: 0
    borderTop: 0
    borderBottom: 0
    paddingLeft: 10
    paddingRight: 11
    paddingTop: 11
    paddingBottom: 7
  - name: 4115301
    x: 1179
    y: 278
    width: 71
    height: 75
    borderLeft: 0
    borderRight: 0
    borderTop: 0
    borderBottom: 0
    paddingLeft: 13
    paddingRight: 16
    paddingTop: 14
    paddingBottom: 11
  - name: 4115401
    x: 1172
    y: 856
    width: 74
    height: 74
    borderLeft: 0
    borderRight: 0
    borderTop: 0
    borderBottom: 0
    paddingLeft: 12
    paddingRight: 14
    paddingTop: 12
    paddingBottom: 14
  - name: 4115501
    x: 1101
    y: 174
    width: 75
    height: 77
    borderLeft: 0
    borderRight: 0
    borderTop: 0
    borderBottom: 0
    paddingLeft: 13
    paddingRight: 12
    paddingTop: 15
    paddingBottom: 8
  - name: 4115601
    x: 703
    y: 703
    width: 108
    height: 101
    borderLeft: 0
    borderRight: 0
    borderTop: 0
    borderBottom: 0
    paddingLeft: 12
    paddingRight: 8
    paddingTop: 13
    paddingBottom: 14
  - name: 4200000
    x: 0
    y: 958
    width: 80
    height: 66
    borderLeft: 0
    borderRight: 0
    borderTop: 0
    borderBottom: 0
    paddingLeft: 24
    paddingRight: 24
    paddingTop: 29
    paddingBottom: 33
  - name: 4200100
    x: 1057
    y: 347
    width: 78
    height: 78
    borderLeft: 0
    borderRight: 0
    borderTop: 0
    borderBottom: 0
    paddingLeft: 25
    paddingRight: 25
    paddingTop: 27
    paddingBottom: 23
  - name: 4200200
    x: 1094
    y: 936
    width: 76
    height: 88
    borderLeft: 0
    borderRight: 0
    borderTop: 0
    borderBottom: 0
    paddingLeft: 26
    paddingRight: 26
    paddingTop: 20
    paddingBottom: 20
  - name: 4200300
    x: 0
    y: 571
    width: 128
    height: 128
    borderLeft: 0
    borderRight: 0
    borderTop: 0
    borderBottom: 0
    paddingLeft: 0
    paddingRight: 0
    paddingTop: 0
    paddingBottom: 0
  - name: 4200400
    x: 0
    y: 442
    width: 128
    height: 128
    borderLeft: 0
    borderRight: 0
    borderTop: 0
    borderBottom: 0
    paddingLeft: 0
    paddingRight: 0
    paddingTop: 0
    paddingBottom: 0
  - name: 4200500
    x: 0
    y: 184
    width: 128
    height: 128
    borderLeft: 0
    borderRight: 0
    borderTop: 0
    borderBottom: 0
    paddingLeft: 0
    paddingRight: 0
    paddingTop: 0
    paddingBottom: 0
  - name: 4200600
    x: 252
    y: 135
    width: 120
    height: 120
    borderLeft: 0
    borderRight: 0
    borderTop: 0
    borderBottom: 0
    paddingLeft: 4
    paddingRight: 4
    paddingTop: 4
    paddingBottom: 4
  - name: 4200700
    x: 367
    y: 14
    width: 120
    height: 120
    borderLeft: 0
    borderRight: 0
    borderTop: 0
    borderBottom: 0
    paddingLeft: 4
    paddingRight: 4
    paddingTop: 4
    paddingBottom: 4
  - name: 4205301
    x: 372
    y: 268
    width: 120
    height: 120
    borderLeft: 0
    borderRight: 0
    borderTop: 0
    borderBottom: 0
    paddingLeft: 4
    paddingRight: 4
    paddingTop: 4
    paddingBottom: 4
  - name: 4205401
    x: 129
    y: 6
    width: 118
    height: 128
    borderLeft: 0
    borderRight: 0
    borderTop: 0
    borderBottom: 0
    paddingLeft: 5
    paddingRight: 5
    paddingTop: 0
    paddingBottom: 0
  - name: 4205501
    x: 248
    y: 6
    width: 118
    height: 128
    borderLeft: 0
    borderRight: 0
    borderTop: 0
    borderBottom: 0
    paddingLeft: 5
    paddingRight: 5
    paddingTop: 0
    paddingBottom: 0
  - name: 4205601
    x: 253
    y: 256
    width: 118
    height: 128
    borderLeft: 0
    borderRight: 0
    borderTop: 0
    borderBottom: 0
    paddingLeft: 5
    paddingRight: 5
    paddingTop: 0
    paddingBottom: 0
  - name: 4300000
    x: 490
    y: 914
    width: 112
    height: 110
    borderLeft: 0
    borderRight: 0
    borderTop: 0
    borderBottom: 0
    paddingLeft: 8
    paddingRight: 8
    paddingTop: 10
    paddingBottom: 8
  - name: 4300100
    x: 794
    y: 155
    width: 82
    height: 104
    borderLeft: 0
    borderRight: 0
    borderTop: 0
    borderBottom: 0
    paddingLeft: 23
    paddingRight: 23
    paddingTop: 12
    paddingBottom: 12
  - name: 4300200
    x: 900
    y: 515
    width: 95
    height: 96
    borderLeft: 0
    borderRight: 0
    borderTop: 0
    borderBottom: 0
    paddingLeft: 16
    paddingRight: 17
    paddingTop: 16
    paddingBottom: 16
  - name: 4300300
    x: 476
    y: 422
    width: 96
    height: 128
    borderLeft: 0
    borderRight: 0
    borderTop: 0
    borderBottom: 0
    paddingLeft: 16
    paddingRight: 16
    paddingTop: 0
    paddingBottom: 0
  - name: 4300400
    x: 1089
    y: 844
    width: 82
    height: 84
    borderLeft: 0
    borderRight: 0
    borderTop: 0
    borderBottom: 0
    paddingLeft: 23
    paddingRight: 23
    paddingTop: 23
    paddingBottom: 21
  - name: 4300500
    x: 694
    y: 35
    width: 87
    height: 104
    borderLeft: 0
    borderRight: 0
    borderTop: 0
    borderBottom: 0
    paddingLeft: 21
    paddingRight: 20
    paddingTop: 12
    paddingBottom: 12
  - name: 4300600
    x: 375
    y: 426
    width: 100
    height: 124
    borderLeft: 0
    borderRight: 0
    borderTop: 0
    borderBottom: 0
    paddingLeft: 16
    paddingRight: 12
    paddingTop: 4
    paddingBottom: 0
  - name: 4305301
    x: 888
    y: 295
    width: 88
    height: 88
    borderLeft: 0
    borderRight: 0
    borderTop: 0
    borderBottom: 0
    paddingLeft: 20
    paddingRight: 20
    paddingTop: 20
    paddingBottom: 20
  - name: 4305401
    x: 877
    y: 384
    width: 96
    height: 95
    borderLeft: 0
    borderRight: 0
    borderTop: 0
    borderBottom: 0
    paddingLeft: 23
    paddingRight: 9
    paddingTop: 18
    paddingBottom: 15
  - name: 4305501
    x: 376
    y: 791
    width: 106
    height: 119
    borderLeft: 0
    borderRight: 0
    borderTop: 0
    borderBottom: 0
    paddingLeft: 6
    paddingRight: 16
    paddingTop: 4
    paddingBottom: 5
  - name: 4305601
    x: 1013
    y: 735
    width: 89
    height: 84
    borderLeft: 0
    borderRight: 0
    borderTop: 0
    borderBottom: 0
    paddingLeft: 19
    paddingRight: 20
    paddingTop: 25
    paddingBottom: 19
  - name: 4310000
    x: 1365
    y: 581
    width: 76
    height: 63
    borderLeft: 0
    borderRight: 0
    borderTop: 0
    borderBottom: 0
    paddingLeft: 12
    paddingRight: 12
    paddingTop: 20
    paddingBottom: 17
  - name: 4310100
    x: 1375
    y: 143
    width: 74
    height: 62
    borderLeft: 0
    borderRight: 0
    borderTop: 0
    borderBottom: 0
    paddingLeft: 13
    paddingRight: 13
    paddingTop: 23
    paddingBottom: 15
  - name: 4310200
    x: 1430
    y: 692
    width: 76
    height: 63
    borderLeft: 0
    borderRight: 0
    borderTop: 0
    borderBottom: 0
    paddingLeft: 13
    paddingRight: 11
    paddingTop: 22
    paddingBottom: 15
  - name: 4310300
    x: 1404
    y: 891
    width: 77
    height: 65
    borderLeft: 0
    borderRight: 0
    borderTop: 0
    borderBottom: 0
    paddingLeft: 12
    paddingRight: 11
    paddingTop: 22
    paddingBottom: 13
  - name: 4310400
    x: 1240
    y: 788
    width: 79
    height: 67
    borderLeft: 0
    borderRight: 0
    borderTop: 0
    borderBottom: 0
    paddingLeft: 10
    paddingRight: 11
    paddingTop: 20
    paddingBottom: 13
  - name: 4310500
    x: 1385
    y: 823
    width: 77
    height: 65
    borderLeft: 0
    borderRight: 0
    borderTop: 0
    borderBottom: 0
    paddingLeft: 12
    paddingRight: 11
    paddingTop: 20
    paddingBottom: 15
  - name: 4310600
    x: 1480
    y: 960
    width: 77
    height: 64
    borderLeft: 0
    borderRight: 0
    borderTop: 0
    borderBottom: 0
    paddingLeft: 14
    paddingRight: 9
    paddingTop: 22
    paddingBottom: 14
  - name: 4315301
    x: 1462
    y: 758
    width: 74
    height: 64
    borderLeft: 0
    borderRight: 0
    borderTop: 0
    borderBottom: 0
    paddingLeft: 12
    paddingRight: 14
    paddingTop: 21
    paddingBottom: 15
  - name: 4315401
    x: 1558
    y: 966
    width: 72
    height: 58
    borderLeft: 0
    borderRight: 0
    borderTop: 0
    borderBottom: 0
    paddingLeft: 13
    paddingRight: 15
    paddingTop: 21
    paddingBottom: 21
  - name: 4315501
    x: 1414
    y: 520
    width: 74
    height: 60
    borderLeft: 0
    borderRight: 0
    borderTop: 0
    borderBottom: 0
    paddingLeft: 12
    paddingRight: 14
    paddingTop: 22
    paddingBottom: 18
  - name: 4315601
    x: 1255
    y: 194
    width: 75
    height: 62
    borderLeft: 0
    borderRight: 0
    borderTop: 0
    borderBottom: 0
    paddingLeft: 9
    paddingRight: 16
    paddingTop: 21
    paddingBottom: 17
  - name: 4400000
    x: 601
    y: 69
    width: 92
    height: 116
    borderLeft: 0
    borderRight: 0
    borderTop: 0
    borderBottom: 0
    paddingLeft: 16
    paddingRight: 20
    paddingTop: 8
    paddingBottom: 4
  - name: 4400100
    x: 996
    y: 515
    width: 79
    height: 96
    borderLeft: 0
    borderRight: 0
    borderTop: 0
    borderBottom: 0
    paddingLeft: 22
    paddingRight: 27
    paddingTop: 15
    paddingBottom: 17
  - name: 4400200
    x: 255
    y: 638
    width: 108
    height: 128
    borderLeft: 0
    borderRight: 0
    borderTop: 0
    borderBottom: 0
    paddingLeft: 8
    paddingRight: 12
    paddingTop: 0
    paddingBottom: 0
  - name: 4400300
    x: 1103
    y: 749
    width: 63
    height: 94
    borderLeft: 0
    borderRight: 0
    borderTop: 0
    borderBottom: 0
    paddingLeft: 32
    paddingRight: 33
    paddingTop: 16
    paddingBottom: 18
  - name: 4400400
    x: 1153
    y: 564
    width: 65
    height: 87
    borderLeft: 0
    borderRight: 0
    borderTop: 0
    borderBottom: 0
    paddingLeft: 32
    paddingRight: 31
    paddingTop: 21
    paddingBottom: 20
  - name: 4400500
    x: 494
    y: 164
    width: 88
    height: 128
    borderLeft: 0
    borderRight: 0
    borderTop: 0
    borderBottom: 0
    paddingLeft: 20
    paddingRight: 20
    paddingTop: 0
    paddingBottom: 0
  - name: 4400600
    x: 966
    y: 198
    width: 70
    height: 96
    borderLeft: 0
    borderRight: 0
    borderTop: 0
    borderBottom: 0
    paddingLeft: 30
    paddingRight: 28
    paddingTop: 16
    paddingBottom: 16
  - name: 4405301
    x: 998
    y: 626
    width: 82
    height: 92
    borderLeft: 0
    borderRight: 0
    borderTop: 0
    borderBottom: 0
    paddingLeft: 25
    paddingRight: 21
    paddingTop: 22
    paddingBottom: 14
  - name: 4405401
    x: 694
    y: 577
    width: 99
    height: 111
    borderLeft: 0
    borderRight: 0
    borderTop: 0
    borderBottom: 0
    paddingLeft: 20
    paddingRight: 9
    paddingTop: 13
    paddingBottom: 4
  - name: 4405501
    x: 1029
    y: 13
    width: 70
    height: 92
    borderLeft: 0
    borderRight: 0
    borderTop: 0
    borderBottom: 0
    paddingLeft: 30
    paddingRight: 28
    paddingTop: 23
    paddingBottom: 13
  - name: 4405601
    x: 1020
    y: 929
    width: 73
    height: 95
    borderLeft: 0
    borderRight: 0
    borderTop: 0
    borderBottom: 0
    paddingLeft: 28
    paddingRight: 27
    paddingTop: 20
    paddingBottom: 13
  - name: 4410000
    x: 1249
    y: 52
    width: 66
    height: 71
    borderLeft: 0
    borderRight: 0
    borderTop: 0
    borderBottom: 0
    paddingLeft: 16
    paddingRight: 18
    paddingTop: 16
    paddingBottom: 13
  - name: 4410100
    x: 1331
    y: 206
    width: 73
    height: 63
    borderLeft: 0
    borderRight: 0
    borderTop: 0
    borderBottom: 0
    paddingLeft: 15
    paddingRight: 12
    paddingTop: 24
    paddingBottom: 13
  - name: 4410200
    x: 1137
    y: 471
    width: 77
    height: 74
    borderLeft: 0
    borderRight: 0
    borderTop: 0
    borderBottom: 0
    paddingLeft: 12
    paddingRight: 11
    paddingTop: 15
    paddingBottom: 11
  - name: 4410300
    x: 1100
    y: 25
    width: 80
    height: 80
    borderLeft: 0
    borderRight: 0
    borderTop: 0
    borderBottom: 0
    paddingLeft: 10
    paddingRight: 10
    paddingTop: 13
    paddingBottom: 7
  - name: 4410400
    x: 1136
    y: 354
    width: 74
    height: 77
    borderLeft: 0
    borderRight: 0
    borderTop: 0
    borderBottom: 0
    paddingLeft: 11
    paddingRight: 15
    paddingTop: 15
    paddingBottom: 8
  - name: 4410500
    x: 1081
    y: 652
    width: 73
    height: 82
    borderLeft: 0
    borderRight: 0
    borderTop: 0
    borderBottom: 0
    paddingLeft: 13
    paddingRight: 14
    paddingTop: 12
    paddingBottom: 6
  - name: 4410600
    x: 1107
    y: 265
    width: 71
    height: 81
    borderLeft: 0
    borderRight: 0
    borderTop: 0
    borderBottom: 0
    paddingLeft: 14
    paddingRight: 15
    paddingTop: 13
    paddingBottom: 6
  - name: 4415301
    x: 1322
    y: 348
    width: 68
    height: 71
    borderLeft: 0
    borderRight: 0
    borderTop: 0
    borderBottom: 0
    paddingLeft: 12
    paddingRight: 20
    paddingTop: 17
    paddingBottom: 12
  - name: 4415401
    x: 1283
    y: 420
    width: 68
    height: 73
    borderLeft: 0
    borderRight: 0
    borderTop: 0
    borderBottom: 0
    paddingLeft: 13
    paddingRight: 19
    paddingTop: 15
    paddingBottom: 12
  - name: 4415501
    x: 1289
    y: 622
    width: 71
    height: 74
    borderLeft: 0
    borderRight: 0
    borderTop: 0
    borderBottom: 0
    paddingLeft: 13
    paddingRight: 16
    paddingTop: 15
    paddingBottom: 11
  - name: 4415601
    x: 1167
    y: 766
    width: 72
    height: 77
    borderLeft: 0
    borderRight: 0
    borderTop: 0
    borderBottom: 0
    paddingLeft: 12
    paddingRight: 16
    paddingTop: 14
    paddingBottom: 9
  mPixelSize: 1
  mReplacement: {fileID: 0}
  mCoordinates: 0
  sprites: []
