%YAML 1.1
%TAG !u! tag:unity3d.com,2011:
--- !u!221 &22100000
AnimatorOverrideController:
  m_ObjectHideFlags: 0
  m_CorrespondingSourceObject: {fileID: 0}
  m_PrefabInstance: {fileID: 0}
  m_PrefabAsset: {fileID: 0}
  m_Name: Animator2001
  m_Controller: {fileID: 9100000, guid: 217e3c3e719851a47b0ee794c54d3908, type: 2}
  m_Clips:
  - m_OriginalClip: {fileID: 7400000, guid: 1d215c006ac5838478f72f045707175c, type: 2}
    m_OverrideClip: {fileID: 7400000, guid: d713d4b26a5f2f0489b0ffd126a4c8ff, type: 2}
  - m_OriginalClip: {fileID: 7400000, guid: c599e063fc13b024daa36b49b8f466ef, type: 2}
    m_OverrideClip: {fileID: 7400000, guid: 8021d1384725ba74d8e4ba68af747d69, type: 2}
