%YAML 1.1
%TAG !u! tag:unity3d.com,2011:
--- !u!114 &11400000
MonoBehaviour:
  m_ObjectHideFlags: 0
  m_PrefabParentObject: {fileID: 0}
  m_PrefabInternal: {fileID: 0}
  m_GameObject: {fileID: 0}
  m_Enabled: 1
  m_EditorHideFlags: 0
  m_Script: {fileID: 11500000, guid: a6b194f808b1af6499c93410e504af42, type: 3}
  m_Name: 1100_Atlas
  m_EditorClassIdentifier: 
  atlasFile: {fileID: 4900000, guid: d976c022b707a4c4bb2bb8a866302505, type: 3}
  materials:
  - {fileID: 2100000, guid: e6aec9f4a14d532419521f1f19f2b475, type: 2}
  - {fileID: 2100000, guid: d77e7c25846ab4144837f446fa9e5d1a, type: 2}
  - {fileID: 2100000, guid: 2090a0e1aea77304cbd82ddbf9a87b47, type: 2}
