%YAML 1.1
%TAG !u! tag:unity3d.com,2011:
--- !u!74 &7400000
AnimationClip:
  m_CorrespondingSourceObject: {fileID: 0}
  m_PrefabInstance: {fileID: 0}
  m_PrefabAsset: {fileID: 0}
  m_Name: 013_Skill_Fly_ying2
  serializedVersion: 6
  m_Legacy: 0
  m_Compressed: 0
  m_UseHighQualityCurve: 1
  m_RotationCurves:
  - curve:
      serializedVersion: 2
      m_Curve:
      - serializedVersion: 3
        time: 1.490116E-08
        value: {x: -0.005570047, y: 0.3635909, z: -0.05727803, w: 0.9297795}
        inSlope: {x: 0, y: 0, z: 0, w: 0}
        outSlope: {x: -0.2065538, y: 0.2330849, z: 0.2186215, w: -0.07646622}
        tangentMode: 1
        weightedMode: 0
        inWeight: {x: 0.3333333, y: 0.3333333, z: 0.3333333, w: 0.3333333}
        outWeight: {x: 0.3333333, y: 0.3333333, z: 0.3333333, w: 0.3333333}
      - serializedVersion: 3
        time: 0.06666668
        value: {x: -0.04379589, y: 0.3178698, z: -0.009510207, w: 0.9470746}
        inSlope: {x: -0.8126709, y: -1.398208, z: 1.188714, w: 0.4228136}
        outSlope: {x: -0.8126709, y: -1.398208, z: 1.188714, w: 0.4228136}
        tangentMode: 1
        weightedMode: 0
        inWeight: {x: 0.3333333, y: 0.3333333, z: 0.3333333, w: 0.3333333}
        outWeight: {x: 0.3333333, y: 0.3333333, z: 0.3333333, w: 0.3333333}
      - serializedVersion: 3
        time: 0.1333333
        value: {x: -0.09037508, y: 0.1956507, z: 0.07032216, w: 0.9739651}
        inSlope: {x: -0.3456509, y: -1.915635, z: 0.7291563, w: 0.3155984}
        outSlope: {x: -0.3456509, y: -1.915635, z: 0.7291563, w: 0.3155984}
        tangentMode: 1
        weightedMode: 0
        inWeight: {x: 0.3333333, y: 0.3333333, z: 0.3333333, w: 0.3333333}
        outWeight: {x: 0.3333333, y: 0.3333333, z: 0.3333333, w: 0.3333333}
      - serializedVersion: 3
        time: 0.2
        value: {x: -0.08336933, y: 0.06730386, z: 0.07456033, w: 0.9914437}
        inSlope: {x: 0.5108237, y: -2.1714, z: -0.3161676, w: 0.1976717}
        outSlope: {x: 0.5108237, y: -2.1714, z: -0.3161676, w: 0.1976717}
        tangentMode: 1
        weightedMode: 0
        inWeight: {x: 0.3333333, y: 0.3333333, z: 0.3333333, w: 0.3333333}
        outWeight: {x: 0.3333333, y: 0.3333333, z: 0.3333333, w: 0.3333333}
      - serializedVersion: 3
        time: 0.2666667
        value: {x: -0.03359055, y: -0.08705666, z: 0.04930134, w: 0.9944155}
        inSlope: {x: 0.7776409, y: -2.019377, z: -0.3367206, w: -0.1151946}
        outSlope: {x: 0.7776409, y: -2.019377, z: -0.3367206, w: -0.1151946}
        tangentMode: 1
        weightedMode: 0
        inWeight: {x: 0.3333333, y: 0.3333333, z: 0.3333333, w: 0.3333333}
        outWeight: {x: 0.3333333, y: 0.3333333, z: 0.3333333, w: 0.3333333}
      - serializedVersion: 3
        time: 0.3333334
        value: {x: 0.008922215, y: -0.1732377, z: 0.03154261, w: 0.9843344}
        inSlope: {x: 0.5060048, y: -0.6014912, z: -0.2334351, w: -0.09787022}
        outSlope: {x: 0.5060048, y: -0.6014912, z: -0.2334351, w: -0.09787022}
        tangentMode: 1
        weightedMode: 0
        inWeight: {x: 0.3333333, y: 0.3333333, z: 0.3333333, w: 0.3333333}
        outWeight: {x: 0.3333333, y: 0.3333333, z: 0.3333333, w: 0.3333333}
      - serializedVersion: 3
        time: 0.4666667
        value: {x: 0.07317392, y: -0.2085105, z: -0.001190419, w: 0.9752782}
        inSlope: {x: 0.3973681, y: -0.1408645, z: -0.2557626, w: -0.05949944}
        outSlope: {x: 0.3973681, y: -0.1408645, z: -0.2557626, w: -0.05949944}
        tangentMode: 1
        weightedMode: 0
        inWeight: {x: 0.3333333, y: 0.3333333, z: 0.3333333, w: 0.3333333}
        outWeight: {x: 0.3333333, y: 0.3333333, z: 0.3333333, w: 0.3333333}
      - serializedVersion: 3
        time: 0.5333334
        value: {x: 0.09220655, y: -0.2149172, z: -0.01819543, w: 0.9720995}
        inSlope: {x: 0.1331705, y: -0.05756396, z: -0.249898, w: -0.0295615}
        outSlope: {x: 0.1331705, y: -0.05756396, z: -0.249898, w: -0.0295615}
        tangentMode: 1
        weightedMode: 0
        inWeight: {x: 0.3333333, y: 0.3333333, z: 0.3333333, w: 0.3333333}
        outWeight: {x: 0.3333333, y: 0.3333333, z: 0.3333333, w: 0.3333333}
      - serializedVersion: 3
        time: 0.5666667
        value: {x: 0.09376658, y: -0.2162381, z: -0.02639672, w: 0.9714691}
        inSlope: {x: -0.07079455, y: 0.6079016, z: -0.3298717, w: 0.1178877}
        outSlope: {x: -0.07079455, y: 0.6079016, z: -0.3298717, w: 0.1178877}
        tangentMode: 1
        weightedMode: 0
        inWeight: {x: 0.3333333, y: 0.3333333, z: 0.3333333, w: 0.3333333}
        outWeight: {x: 0.3333333, y: 0.3333333, z: 0.3333333, w: 0.3333333}
      - serializedVersion: 3
        time: 0.6
        value: {x: 0.08748692, y: -0.1743904, z: -0.04018687, w: 0.9799587}
        inSlope: {x: -0.3030234, y: 2.240931, z: -0.4905533, w: 0.3273314}
        outSlope: {x: -0.3030234, y: 2.240931, z: -0.4905533, w: 0.3273314}
        tangentMode: 1
        weightedMode: 0
        inWeight: {x: 0.3333333, y: 0.3333333, z: 0.3333333, w: 0.3333333}
        outWeight: {x: 0.3333333, y: 0.3333333, z: 0.3333333, w: 0.3333333}
      - serializedVersion: 3
        time: 0.6333334
        value: {x: 0.07356502, y: -0.06684262, z: -0.05910028, w: 0.9932912}
        inSlope: {x: -0.5026778, y: 3.741699, z: -0.4859153, w: 0.1966487}
        outSlope: {x: -0.5026778, y: 3.741698, z: -0.4859154, w: 0.1966487}
        tangentMode: 1
        weightedMode: 0
        inWeight: {x: 0.3333333, y: 0.3333333, z: 0.3333333, w: 0.3333333}
        outWeight: {x: 0.3333333, y: 0.3333333, z: 0.3333333, w: 0.3333333}
      - serializedVersion: 3
        time: 0.6666667
        value: {x: 0.05397507, y: 0.07505611, z: -0.07258123, w: 0.9930686}
        inSlope: {x: -0.6219015, y: 4.245813, z: -0.228896, w: -0.3046495}
        outSlope: {x: -0.6219015, y: 4.245813, z: -0.228896, w: -0.3046495}
        tangentMode: 1
        weightedMode: 0
        inWeight: {x: 0.3333333, y: 0.3333333, z: 0.3333333, w: 0.3333333}
        outWeight: {x: 0.3333333, y: 0.3333333, z: 0.3333333, w: 0.3333333}
      - serializedVersion: 3
        time: 0.7
        value: {x: 0.03210492, y: 0.2162116, z: -0.07436, w: 0.9729812}
        inSlope: {x: -0.637705, y: 3.709923, z: 0.09477868, w: -0.7327707}
        outSlope: {x: -0.637705, y: 3.709923, z: 0.09477868, w: -0.7327707}
        tangentMode: 1
        weightedMode: 0
        inWeight: {x: 0.3333333, y: 0.3333333, z: 0.3333333, w: 0.3333333}
        outWeight: {x: 0.3333333, y: 0.3333333, z: 0.3333333, w: 0.3333333}
      - serializedVersion: 3
        time: 0.7333333
        value: {x: 0.0114614, y: 0.3223843, z: -0.06626266, w: 0.9442173}
        inSlope: {x: -0.578716, y: 2.223062, z: 0.2623708, w: -0.6525812}
        outSlope: {x: -0.578716, y: 2.223062, z: 0.2623708, w: -0.6525812}
        tangentMode: 1
        weightedMode: 0
        inWeight: {x: 0.3333333, y: 0.3333333, z: 0.3333333, w: 0.3333333}
        outWeight: {x: 0.3333333, y: 0.3333333, z: 0.3333333, w: 0.3333333}
      - serializedVersion: 3
        time: 0.7666667
        value: {x: -0.006476111, y: 0.3644155, z: -0.05686863, w: 0.9294758}
        inSlope: {x: -0.6111523, y: 0.4070612, z: 0.4452766, w: -0.1269199}
        outSlope: {x: 0, y: 0, z: 0, w: 0}
        tangentMode: 1
        weightedMode: 0
        inWeight: {x: 0.3333333, y: 0.3333333, z: 0.3333333, w: 0.3333333}
        outWeight: {x: 0.3333333, y: 0.3333333, z: 0.3333333, w: 0.3333333}
      m_PreInfinity: 2
      m_PostInfinity: 2
      m_RotationOrder: 4
    path: Dummy01/Box01/Line01
  - curve:
      serializedVersion: 2
      m_Curve:
      - serializedVersion: 3
        time: 1.490116E-08
        value: {x: 0.01290384, y: -0.4726231, z: 0.09562574, w: 0.8759661}
        inSlope: {x: 0, y: 0, z: 0, w: 0}
        outSlope: {x: -0.06487006, y: 0.1363988, z: 0.02085831, w: 0.06424606}
        tangentMode: 1
        weightedMode: 0
        inWeight: {x: 0.3333333, y: 0.3333333, z: 0.3333333, w: 0.3333333}
        outWeight: {x: 0.3333333, y: 0.3333333, z: 0.3333333, w: 0.3333333}
      - serializedVersion: 3
        time: 0.03333335
        value: {x: 0.003335737, y: -0.4299428, z: 0.1028866, w: 0.8969684}
        inSlope: {x: -0.6690628, y: 2.87693, z: 0.5044096, w: 1.117806}
        outSlope: {x: -0.6690628, y: 2.87693, z: 0.5044096, w: 1.117806}
        tangentMode: 1
        weightedMode: 0
        inWeight: {x: 0.3333333, y: 0.3333333, z: 0.3333333, w: 0.3333333}
        outWeight: {x: 0.3333333, y: 0.3333333, z: 0.3333333, w: 0.3333333}
      - serializedVersion: 3
        time: 0.06666668
        value: {x: -0.03170035, y: -0.2808278, z: 0.129253, w: 0.9504865}
        inSlope: {x: -1.275769, y: 5.196692, z: 0.9452921, w: 1.233423}
        outSlope: {x: -1.275769, y: 5.196692, z: 0.9452921, w: 1.233423}
        tangentMode: 1
        weightedMode: 0
        inWeight: {x: 0.3333333, y: 0.3333333, z: 0.3333333, w: 0.3333333}
        outWeight: {x: 0.3333333, y: 0.3333333, z: 0.3333333, w: 0.3333333}
      - serializedVersion: 3
        time: 0.1
        value: {x: -0.08171553, y: -0.08349673, z: 0.1659061, w: 0.9791966}
        inSlope: {x: -1.441616, y: 5.51651, z: 1.052982, w: 0.25729}
        outSlope: {x: -1.441616, y: 5.51651, z: 1.052982, w: 0.25729}
        tangentMode: 1
        weightedMode: 0
        inWeight: {x: 0.3333333, y: 0.3333333, z: 0.3333333, w: 0.3333333}
        outWeight: {x: 0.3333333, y: 0.3333333, z: 0.3333333, w: 0.3333333}
      - serializedVersion: 3
        time: 0.1333333
        value: {x: -0.1278081, y: 0.08693953, z: 0.1994518, w: 0.9676391}
        inSlope: {x: -1.002186, y: 3.615188, z: 0.7747213, w: -0.4119326}
        outSlope: {x: -1.002186, y: 3.615188, z: 0.7747213, w: -0.4119326}
        tangentMode: 1
        weightedMode: 0
        inWeight: {x: 0.3333333, y: 0.3333333, z: 0.3333333, w: 0.3333333}
        outWeight: {x: 0.3333333, y: 0.3333333, z: 0.3333333, w: 0.3333333}
      - serializedVersion: 3
        time: 0.1666667
        value: {x: -0.148528, y: 0.1575158, z: 0.2175542, w: 0.9517344}
        inSlope: {x: -0.1133266, y: 0.981458, z: 0.3207982, w: -0.2079318}
        outSlope: {x: -0.1133266, y: 0.9814581, z: 0.3207982, w: -0.2079318}
        tangentMode: 1
        weightedMode: 0
        inWeight: {x: 0.3333333, y: 0.3333333, z: 0.3333333, w: 0.3333333}
        outWeight: {x: 0.3333333, y: 0.3333333, z: 0.3333333, w: 0.3333333}
      - serializedVersion: 3
        time: 0.2
        value: {x: -0.1353632, y: 0.1523701, z: 0.2208384, w: 0.953777}
        inSlope: {x: 0.7180231, y: -0.2599231, z: 0.01489922, w: 0.1306388}
        outSlope: {x: 0.7180231, y: -0.2599231, z: 0.01489922, w: 0.1306388}
        tangentMode: 1
        weightedMode: 0
        inWeight: {x: 0.3333333, y: 0.3333333, z: 0.3333333, w: 0.3333333}
        outWeight: {x: 0.3333333, y: 0.3333333, z: 0.3333333, w: 0.3333333}
      - serializedVersion: 3
        time: 0.3
        value: {x: -0.01108277, y: 0.09990058, z: 0.2110641, w: 0.9722906}
        inSlope: {x: 1.143944, y: -0.7080606, z: -0.06902768, w: 0.1073151}
        outSlope: {x: 1.143944, y: -0.7080606, z: -0.06902771, w: 0.1073151}
        tangentMode: 1
        weightedMode: 0
        inWeight: {x: 0.3333333, y: 0.3333333, z: 0.3333333, w: 0.3333333}
        outWeight: {x: 0.3333333, y: 0.3333333, z: 0.3333333, w: 0.3333333}
      - serializedVersion: 3
        time: 0.4
        value: {x: 0.07091182, y: 0.01929209, z: 0.1748845, w: 0.9818425}
        inSlope: {x: 0.675229, y: -0.9261923, z: -0.8022136, w: 0.1092348}
        outSlope: {x: 0.675229, y: -0.9261922, z: -0.8022135, w: 0.1092348}
        tangentMode: 1
        weightedMode: 0
        inWeight: {x: 0.3333333, y: 0.3333333, z: 0.3333333, w: 0.3333333}
        outWeight: {x: 0.3333333, y: 0.3333333, z: 0.3333333, w: 0.3333333}
      - serializedVersion: 3
        time: 0.5333334
        value: {x: 0.1245064, y: -0.12828, z: 0.06815194, w: 0.9815283}
        inSlope: {x: 0.1190735, y: -1.231885, z: -0.3282223, w: -0.1515921}
        outSlope: {x: 0.1190736, y: -1.231885, z: -0.3282223, w: -0.1515921}
        tangentMode: 1
        weightedMode: 0
        inWeight: {x: 0.3333333, y: 0.3333333, z: 0.3333333, w: 0.3333333}
        outWeight: {x: 0.3333333, y: 0.3333333, z: 0.3333333, w: 0.3333333}
      - serializedVersion: 3
        time: 0.6
        value: {x: 0.1186404, y: -0.2215353, z: 0.07276846, w: 0.9651691}
        inSlope: {x: -0.4279394, y: -1.741937, z: 0.2971522, w: -0.3855603}
        outSlope: {x: -0.4279394, y: -1.741937, z: 0.2971522, w: -0.3855603}
        tangentMode: 1
        weightedMode: 0
        inWeight: {x: 0.3333333, y: 0.3333333, z: 0.3333333, w: 0.3333333}
        outWeight: {x: 0.3333333, y: 0.3333333, z: 0.3333333, w: 0.3333333}
      - serializedVersion: 3
        time: 0.6666667
        value: {x: 0.07250546, y: -0.353237, z: 0.09264202, w: 0.9281078}
        inSlope: {x: -0.7516358, y: -1.906919, z: 0.1763092, w: -0.6770709}
        outSlope: {x: -0.7516358, y: -1.906919, z: 0.1763092, w: -0.6770709}
        tangentMode: 1
        weightedMode: 0
        inWeight: {x: 0.3333333, y: 0.3333333, z: 0.3333333, w: 0.3333333}
        outWeight: {x: 0.3333333, y: 0.3333333, z: 0.3333333, w: 0.3333333}
      - serializedVersion: 3
        time: 0.7333333
        value: {x: 0.02788117, y: -0.4561758, z: 0.09525148, w: 0.8843378}
        inSlope: {x: -0.5235368, y: -0.90809, z: -0.006340743, w: -0.433845}
        outSlope: {x: -0.5235368, y: -0.90809, z: -0.006340748, w: -0.433845}
        tangentMode: 1
        weightedMode: 0
        inWeight: {x: 0.3333333, y: 0.3333333, z: 0.3333333, w: 0.3333333}
        outWeight: {x: 0.3333333, y: 0.3333333, z: 0.3333333, w: 0.3333333}
      - serializedVersion: 3
        time: 0.7666667
        value: {x: 0.01306772, y: -0.4736753, z: 0.09543861, w: 0.8754156}
        inSlope: {x: -0.5768198, y: 0.7129176, z: 0.2147897, w: 0.325373}
        outSlope: {x: 0, y: 0, z: 0, w: 0}
        tangentMode: 1
        weightedMode: 0
        inWeight: {x: 0.3333333, y: 0.3333333, z: 0.3333333, w: 0.3333333}
        outWeight: {x: 0.3333333, y: 0.3333333, z: 0.3333333, w: 0.3333333}
      m_PreInfinity: 2
      m_PostInfinity: 2
      m_RotationOrder: 4
    path: Dummy01/Box01/Line01/Line02
  - curve:
      serializedVersion: 2
      m_Curve:
      - serializedVersion: 3
        time: 1.490116E-08
        value: {x: 0.05297263, y: -0.4073661, z: -0.07513524, w: 0.9086261}
        inSlope: {x: 0, y: 0, z: 0, w: 0}
        outSlope: {x: 0.09529917, y: 0.1518519, z: 0.2815508, w: 0.08195132}
        tangentMode: 1
        weightedMode: 0
        inWeight: {x: 0.3333333, y: 0.3333333, z: 0.3333333, w: 0.3333333}
        outWeight: {x: 0.3333333, y: 0.3333333, z: 0.3333333, w: 0.3333333}
      - serializedVersion: 3
        time: 0.03333335
        value: {x: 0.04914052, y: -0.3690572, z: -0.07290792, w: 0.9252386}
        inSlope: {x: -0.5165551, y: 2.561221, z: 0.06683607, w: 0.903377}
        outSlope: {x: -0.5165551, y: 2.561221, z: 0.06683607, w: 0.903377}
        tangentMode: 1
        weightedMode: 0
        inWeight: {x: 0.3333333, y: 0.3333333, z: 0.3333333, w: 0.3333333}
        outWeight: {x: 0.3333333, y: 0.3333333, z: 0.3333333, w: 0.3333333}
      - serializedVersion: 3
        time: 0.06666668
        value: {x: 0.01853562, y: -0.236618, z: -0.0706795, w: 0.9688513}
        inSlope: {x: -1.325334, y: 4.595792, z: 0.4862677, w: 1.06804}
        outSlope: {x: -1.325334, y: 4.595792, z: 0.4862677, w: 1.06804}
        tangentMode: 1
        weightedMode: 0
        inWeight: {x: 0.3333333, y: 0.3333333, z: 0.3333333, w: 0.3333333}
        outWeight: {x: 0.3333333, y: 0.3333333, z: 0.3333333, w: 0.3333333}
      - serializedVersion: 3
        time: 0.1
        value: {x: -0.03921508, y: -0.06267115, z: -0.04049008, w: 0.9964412}
        inSlope: {x: -1.806376, y: 4.855739, z: 1.264877, w: 0.3304553}
        outSlope: {x: -1.806376, y: 4.855739, z: 1.264877, w: 0.3304553}
        tangentMode: 1
        weightedMode: 0
        inWeight: {x: 0.3333333, y: 0.3333333, z: 0.3333333, w: 0.3333333}
        outWeight: {x: 0.3333333, y: 0.3333333, z: 0.3333333, w: 0.3333333}
      - serializedVersion: 3
        time: 0.1333333
        value: {x: -0.1018894, y: 0.08709788, z: 0.0136456, w: 0.9908816}
        inSlope: {x: -1.413381, y: 3.26943, z: 1.456975, w: -0.2889998}
        outSlope: {x: -1.413381, y: 3.26943, z: 1.456975, w: -0.2889998}
        tangentMode: 1
        weightedMode: 0
        inWeight: {x: 0.3333333, y: 0.3333333, z: 0.3333333, w: 0.3333333}
        outWeight: {x: 0.3333333, y: 0.3333333, z: 0.3333333, w: 0.3333333}
      - serializedVersion: 3
        time: 0.1666667
        value: {x: -0.1334405, y: 0.1552909, z: 0.05664159, w: 0.9771746}
        inSlope: {x: -0.06738168, y: 1.203946, z: 0.8844045, w: -0.2015267}
        outSlope: {x: -0.06738168, y: 1.203946, z: 0.8844045, w: -0.2015267}
        tangentMode: 1
        weightedMode: 0
        inWeight: {x: 0.3333333, y: 0.3333333, z: 0.3333333, w: 0.3333333}
        outWeight: {x: 0.3333333, y: 0.3333333, z: 0.3333333, w: 0.3333333}
      - serializedVersion: 3
        time: 0.2
        value: {x: -0.1063816, y: 0.167361, z: 0.07260594, w: 0.9774465}
        inSlope: {x: 1.447129, y: 0.3668066, z: 0.2712391, w: 0.04499674}
        outSlope: {x: 1.447129, y: 0.3668066, z: 0.2712391, w: 0.04499674}
        tangentMode: 1
        weightedMode: 0
        inWeight: {x: 0.3333333, y: 0.3333333, z: 0.3333333, w: 0.3333333}
        outWeight: {x: 0.3333333, y: 0.3333333, z: 0.3333333, w: 0.3333333}
      - serializedVersion: 3
        time: 0.2666667
        value: {x: 0.04552026, y: 0.190446, z: 0.0683151, w: 0.9782593}
        inSlope: {x: 2.225501, y: 0.2617034, z: -0.220615, w: -0.1201522}
        outSlope: {x: 2.225501, y: 0.2617034, z: -0.220615, w: -0.1201522}
        tangentMode: 1
        weightedMode: 0
        inWeight: {x: 0.3333333, y: 0.3333333, z: 0.3333333, w: 0.3333333}
        outWeight: {x: 0.3333333, y: 0.3333333, z: 0.3333333, w: 0.3333333}
      - serializedVersion: 3
        time: 0.3
        value: {x: 0.1114014, y: 0.1971915, z: 0.06001653, w: 0.9721642}
        inSlope: {x: 1.314103, y: 0.1201852, z: -0.1803419, w: -0.1329963}
        outSlope: {x: 1.314103, y: 0.1201852, z: -0.1803419, w: -0.1329963}
        tangentMode: 1
        weightedMode: 0
        inWeight: {x: 0.3333333, y: 0.3333333, z: 0.3333333, w: 0.3333333}
        outWeight: {x: 0.3333333, y: 0.3333333, z: 0.3333333, w: 0.3333333}
      - serializedVersion: 3
        time: 0.3666667
        value: {x: 0.1398105, y: 0.1808746, z: 0.04176713, w: 0.9726217}
        inSlope: {x: 0.2468807, y: -0.8435907, z: -0.6629981, w: 0.134992}
        outSlope: {x: 0.2468808, y: -0.8435907, z: -0.6629981, w: 0.134992}
        tangentMode: 1
        weightedMode: 0
        inWeight: {x: 0.3333333, y: 0.3333333, z: 0.3333333, w: 0.3333333}
        outWeight: {x: 0.3333333, y: 0.3333333, z: 0.3333333, w: 0.3333333}
      - serializedVersion: 3
        time: 0.4666667
        value: {x: 0.1594845, y: 0.02468853, z: -0.06668221, w: 0.9846363}
        inSlope: {x: -0.04065613, y: -1.936268, z: -1.130914, w: -0.02090877}
        outSlope: {x: -0.04065612, y: -1.936268, z: -1.130914, w: -0.02090877}
        tangentMode: 1
        weightedMode: 0
        inWeight: {x: 0.3333333, y: 0.3333333, z: 0.3333333, w: 0.3333333}
        outWeight: {x: 0.3333333, y: 0.3333333, z: 0.3333333, w: 0.3333333}
      - serializedVersion: 3
        time: 0.5666667
        value: {x: 0.1354793, y: -0.1533099, z: -0.1279687, w: 0.970446}
        inSlope: {x: -0.2850095, y: -1.516051, z: 0.08837258, w: -0.1880685}
        outSlope: {x: -0.2850095, y: -1.516051, z: 0.0883726, w: -0.1880685}
        tangentMode: 1
        weightedMode: 0
        inWeight: {x: 0.3333333, y: 0.3333333, z: 0.3333333, w: 0.3333333}
        outWeight: {x: 0.3333333, y: 0.3333333, z: 0.3333333, w: 0.3333333}
      - serializedVersion: 3
        time: 0.6666667
        value: {x: 0.09943351, y: -0.316589, z: -0.09460063, w: 0.9385814}
        inSlope: {x: -0.4486071, y: -1.558282, z: 0.3460279, w: -0.436483}
        outSlope: {x: -0.4486071, y: -1.558282, z: 0.3460279, w: -0.436483}
        tangentMode: 1
        weightedMode: 0
        inWeight: {x: 0.3333333, y: 0.3333333, z: 0.3333333, w: 0.3333333}
        outWeight: {x: 0.3333333, y: 0.3333333, z: 0.3333333, w: 0.3333333}
      - serializedVersion: 3
        time: 0.7333333
        value: {x: 0.06852941, y: -0.3970766, z: -0.07619837, w: 0.9120459}
        inSlope: {x: -0.4509866, y: -0.6569188, z: 0.1568889, w: -0.2296357}
        outSlope: {x: -0.4509866, y: -0.6569188, z: 0.1568889, w: -0.2296357}
        tangentMode: 1
        weightedMode: 0
        inWeight: {x: 0.3333333, y: 0.3333333, z: 0.3333333, w: 0.3333333}
        outWeight: {x: 0.3333333, y: 0.3333333, z: 0.3333333, w: 0.3333333}
      - serializedVersion: 3
        time: 0.7666667
        value: {x: 0.05388313, y: -0.4081696, z: -0.07329373, w: 0.9083624}
        inSlope: {x: -0.5185458, y: 0.7397288, z: -0.01840064, w: 0.325763}
        outSlope: {x: 0, y: 0, z: 0, w: 0}
        tangentMode: 1
        weightedMode: 0
        inWeight: {x: 0.3333333, y: 0.3333333, z: 0.3333333, w: 0.3333333}
        outWeight: {x: 0.3333333, y: 0.3333333, z: 0.3333333, w: 0.3333333}
      m_PreInfinity: 2
      m_PostInfinity: 2
      m_RotationOrder: 4
    path: Dummy01/Box01/Line01/Line02/Line03
  - curve:
      serializedVersion: 2
      m_Curve:
      - serializedVersion: 3
        time: 1.490116E-08
        value: {x: 0.9292988, y: 0.08606125, z: 0.3591356, w: -0.004352495}
        inSlope: {x: 0, y: 0, z: 0, w: 0}
        outSlope: {x: -0.09298415, y: -0.08130749, z: 0.2716689, w: -0.08486623}
        tangentMode: 1
        weightedMode: 0
        inWeight: {x: 0.3333333, y: 0.3333333, z: 0.3333333, w: 0.3333333}
        outWeight: {x: 0.3333333, y: 0.3333333, z: 0.3333333, w: 0.3333333}
      - serializedVersion: 3
        time: 0.1
        value: {x: 0.9558182, y: 0.02683055, z: 0.2926113, w: 0.008386303}
        inSlope: {x: 0.4084879, y: -0.9527467, z: -1.275323, w: 0.1869432}
        outSlope: {x: 0.4084879, y: -0.9527467, z: -1.275323, w: 0.1869432}
        tangentMode: 1
        weightedMode: 0
        inWeight: {x: 0.3333333, y: 0.3333333, z: 0.3333333, w: 0.3333333}
        outWeight: {x: 0.3333333, y: 0.3333333, z: 0.3333333, w: 0.3333333}
      - serializedVersion: 3
        time: 0.2
        value: {x: 0.9923046, y: -0.04049258, z: 0.1158745, w: 0.01627969}
        inSlope: {x: 0.2644292, y: -0.2788619, z: -2.608893, w: -0.03880489}
        outSlope: {x: 0.2644292, y: -0.2788619, z: -2.608893, w: -0.03880489}
        tangentMode: 1
        weightedMode: 0
        inWeight: {x: 0.3333333, y: 0.3333333, z: 0.3333333, w: 0.3333333}
        outWeight: {x: 0.3333333, y: 0.3333333, z: 0.3333333, w: 0.3333333}
      - serializedVersion: 3
        time: 0.2333334
        value: {x: 0.9986517, y: -0.047045, z: 0.0171762, w: 0.01365962}
        inSlope: {x: 0.04800614, y: -0.1302012, z: -2.942979, w: -0.0943276}
        outSlope: {x: 0.04800614, y: -0.1302012, z: -2.942979, w: -0.0943276}
        tangentMode: 1
        weightedMode: 0
        inWeight: {x: 0.3333333, y: 0.3333333, z: 0.3333333, w: 0.3333333}
        outWeight: {x: 0.3333333, y: 0.3333333, z: 0.3333333, w: 0.3333333}
      - serializedVersion: 3
        time: 0.3
        value: {x: 0.9871685, y: -0.04877535, z: -0.1518873, w: 0.007040097}
        inSlope: {x: -0.182779, y: 0.01568458, z: -1.424745, w: -0.06315569}
        outSlope: {x: -0.182779, y: 0.0156846, z: -1.424745, w: -0.06315569}
        tangentMode: 1
        weightedMode: 0
        inWeight: {x: 0.3333333, y: 0.3333333, z: 0.3333333, w: 0.3333333}
        outWeight: {x: 0.3333333, y: 0.3333333, z: 0.3333333, w: 0.3333333}
      - serializedVersion: 3
        time: 0.3666667
        value: {x: 0.9830784, y: -0.04311002, z: -0.1780208, w: -0.00263544}
        inSlope: {x: -0.005594194, y: 0.2349295, z: -0.06921083, w: -0.3829099}
        outSlope: {x: -0.005594196, y: 0.2349295, z: -0.06921084, w: -0.3829099}
        tangentMode: 1
        weightedMode: 0
        inWeight: {x: 0.3333333, y: 0.3333333, z: 0.3333333, w: 0.3333333}
        outWeight: {x: 0.3333333, y: 0.3333333, z: 0.3333333, w: 0.3333333}
      - serializedVersion: 3
        time: 0.5333334
        value: {x: 0.9763097, y: 0.0322563, z: -0.1895553, w: -0.09923568}
        inSlope: {x: -0.05380417, y: 0.4451151, z: -0.07098147, w: -0.2692038}
        outSlope: {x: -0.05380417, y: 0.4451151, z: -0.07098147, w: -0.2692038}
        tangentMode: 1
        weightedMode: 0
        inWeight: {x: 0.3333333, y: 0.3333333, z: 0.3333333, w: 0.3333333}
        outWeight: {x: 0.3333333, y: 0.3333333, z: 0.3333333, w: 0.3333333}
      - serializedVersion: 3
        time: 0.6
        value: {x: 0.9818577, y: 0.06357554, z: -0.1519929, w: -0.09387204}
        inSlope: {x: 0.2599713, y: 0.5993487, z: 2.128953, w: 0.4336417}
        outSlope: {x: 0.2599713, y: 0.5993487, z: 2.128953, w: 0.4336417}
        tangentMode: 1
        weightedMode: 0
        inWeight: {x: 0.3333333, y: 0.3333333, z: 0.3333333, w: 0.3333333}
        outWeight: {x: 0.3333333, y: 0.3333333, z: 0.3333333, w: 0.3333333}
      - serializedVersion: 3
        time: 0.6333334
        value: {x: 0.9923087, y: 0.08572278, z: -0.04958561, w: -0.07427216}
        inSlope: {x: 0.1230346, y: 0.5442948, z: 3.564153, w: 0.661299}
        outSlope: {x: 0.1230346, y: 0.5442948, z: 3.564154, w: 0.661299}
        tangentMode: 1
        weightedMode: 0
        inWeight: {x: 0.3333333, y: 0.3333333, z: 0.3333333, w: 0.3333333}
        outWeight: {x: 0.3333333, y: 0.3333333, z: 0.3333333, w: 0.3333333}
      - serializedVersion: 3
        time: 0.6666667
        value: {x: 0.99006, y: 0.09986186, z: 0.08561732, w: -0.04978545}
        inSlope: {x: -0.3348289, y: 0.2179129, z: 4.04237, w: 0.7123775}
        outSlope: {x: -0.3348289, y: 0.2179129, z: 4.04237, w: 0.7123775}
        tangentMode: 1
        weightedMode: 0
        inWeight: {x: 0.3333333, y: 0.3333333, z: 0.3333333, w: 0.3333333}
        outWeight: {x: 0.3333333, y: 0.3333333, z: 0.3333333, w: 0.3333333}
      - serializedVersion: 3
        time: 0.7
        value: {x: 0.9699867, y: 0.1002503, z: 0.2199057, w: -0.02678033}
        inSlope: {x: -0.7102419, y: -0.1219402, z: 3.524294, w: 0.5847517}
        outSlope: {x: -0.7102419, y: -0.1219402, z: 3.524294, w: 0.5847517}
        tangentMode: 1
        weightedMode: 0
        inWeight: {x: 0.3333333, y: 0.3333333, z: 0.3333333, w: 0.3333333}
        outWeight: {x: 0.3333333, y: 0.3333333, z: 0.3333333, w: 0.3333333}
      - serializedVersion: 3
        time: 0.7333333
        value: {x: 0.9427105, y: 0.09173252, z: 0.3205703, w: -0.010802}
        inSlope: {x: -0.6147271, y: -0.2101935, z: 2.099092, w: 0.3273606}
        outSlope: {x: -0.6147271, y: -0.2101935, z: 2.099092, w: 0.3273606}
        tangentMode: 1
        weightedMode: 0
        inWeight: {x: 0.3333333, y: 0.3333333, z: 0.3333333, w: 0.3333333}
        outWeight: {x: 0.3333333, y: 0.3333333, z: 0.3333333, w: 0.3333333}
      - serializedVersion: 3
        time: 0.7666667
        value: {x: 0.929005, y: 0.08623741, z: 0.359845, w: -0.004956312}
        inSlope: {x: -0.1372562, y: -0.2299707, z: 0.4441073, w: 0.1315099}
        outSlope: {x: 0, y: 0, z: 0, w: 0}
        tangentMode: 1
        weightedMode: 0
        inWeight: {x: 0.3333333, y: 0.3333333, z: 0.3333333, w: 0.3333333}
        outWeight: {x: 0.3333333, y: 0.3333333, z: 0.3333333, w: 0.3333333}
      m_PreInfinity: 2
      m_PostInfinity: 2
      m_RotationOrder: 4
    path: Dummy01/Box01/Line15
  - curve:
      serializedVersion: 2
      m_Curve:
      - serializedVersion: 3
        time: 1.490116E-08
        value: {x: 0.05873937, y: -0.514451, z: 0.1449797, w: 0.8431315}
        inSlope: {x: 0, y: 0, z: 0, w: 0}
        outSlope: {x: 0.0394477, y: 0.1428674, z: 0.1952619, w: 0.04160821}
        tangentMode: 1
        weightedMode: 0
        inWeight: {x: 0.3333333, y: 0.3333333, z: 0.3333333, w: 0.3333333}
        outWeight: {x: 0.3333333, y: 0.3333333, z: 0.3333333, w: 0.3333333}
      - serializedVersion: 3
        time: 0.03333335
        value: {x: 0.05017364, y: -0.4688916, z: 0.1586487, w: 0.867441}
        inSlope: {x: -0.6938757, y: 3.094679, z: 0.6848983, w: 1.33244}
        outSlope: {x: -0.6938757, y: 3.094679, z: 0.6848983, w: 1.33244}
        tangentMode: 1
        weightedMode: 0
        inWeight: {x: 0.3333333, y: 0.3333333, z: 0.3333333, w: 0.3333333}
        outWeight: {x: 0.3333333, y: 0.3333333, z: 0.3333333, w: 0.3333333}
      - serializedVersion: 3
        time: 0.06666668
        value: {x: 0.01248099, y: -0.3081391, z: 0.1906396, w: 0.9319609}
        inSlope: {x: -1.362153, y: 5.657802, z: 0.9549474, w: 1.535418}
        outSlope: {x: -1.362153, y: 5.657802, z: 0.9549474, w: 1.535418}
        tangentMode: 1
        weightedMode: 0
        inWeight: {x: 0.3333333, y: 0.3333333, z: 0.3333333, w: 0.3333333}
        outWeight: {x: 0.3333333, y: 0.3333333, z: 0.3333333, w: 0.3333333}
      - serializedVersion: 3
        time: 0.1
        value: {x: -0.04063652, y: -0.09170482, z: 0.2223119, w: 0.9698022}
        inSlope: {x: -1.507293, y: 6.085974, z: 0.7511813, w: 0.4454524}
        outSlope: {x: -1.507293, y: 6.085974, z: 0.7511813, w: 0.4454524}
        tangentMode: 1
        weightedMode: 0
        inWeight: {x: 0.3333333, y: 0.3333333, z: 0.3333333, w: 0.3333333}
        outWeight: {x: 0.3333333, y: 0.3333333, z: 0.3333333, w: 0.3333333}
      - serializedVersion: 3
        time: 0.1333333
        value: {x: -0.08800518, y: 0.0975925, z: 0.2407183, w: 0.9616577}
        inSlope: {x: -1.010453, y: 4.031834, z: 0.3517386, w: -0.3438571}
        outSlope: {x: -1.010453, y: 4.031834, z: 0.3517386, w: -0.3438572}
        tangentMode: 1
        weightedMode: 0
        inWeight: {x: 0.3333333, y: 0.3333333, z: 0.3333333, w: 0.3333333}
        outWeight: {x: 0.3333333, y: 0.3333333, z: 0.3333333, w: 0.3333333}
      - serializedVersion: 3
        time: 0.1666667
        value: {x: -0.1080001, y: 0.1770842, z: 0.2457611, w: 0.9468784}
        inSlope: {x: -0.06464141, y: 1.153248, z: 0.02785022, w: -0.177284}
        outSlope: {x: -0.06464142, y: 1.153248, z: 0.02785021, w: -0.177284}
        tangentMode: 1
        weightedMode: 0
        inWeight: {x: 0.3333333, y: 0.3333333, z: 0.3333333, w: 0.3333333}
        outWeight: {x: 0.3333333, y: 0.3333333, z: 0.3333333, w: 0.3333333}
      - serializedVersion: 3
        time: 0.2
        value: {x: -0.09231462, y: 0.1744758, z: 0.242575, w: 0.9498388}
        inSlope: {x: 0.8196427, y: -0.1617334, z: -0.1707707, w: 0.1417539}
        outSlope: {x: 0.8196427, y: -0.1617334, z: -0.1707707, w: 0.1417539}
        tangentMode: 1
        weightedMode: 0
        inWeight: {x: 0.3333333, y: 0.3333333, z: 0.3333333, w: 0.3333333}
        outWeight: {x: 0.3333333, y: 0.3333333, z: 0.3333333, w: 0.3333333}
      - serializedVersion: 3
        time: 0.3
        value: {x: 0.04445911, y: 0.1308802, z: 0.2109893, w: 0.9676659}
        inSlope: {x: 1.212955, y: -0.7300677, z: -0.3896648, w: 0.1346611}
        outSlope: {x: 1.212955, y: -0.7300676, z: -0.3896648, w: 0.1346611}
        tangentMode: 1
        weightedMode: 0
        inWeight: {x: 0.3333333, y: 0.3333333, z: 0.3333333, w: 0.3333333}
        outWeight: {x: 0.3333333, y: 0.3333333, z: 0.3333333, w: 0.3333333}
      - serializedVersion: 3
        time: 0.4333333
        value: {x: 0.1333166, y: -0.005573073, z: 0.1282708, w: 0.9827219}
        inSlope: {x: 0.3444743, y: -1.242529, z: -0.7533438, w: 0.0442073}
        outSlope: {x: 0.3444743, y: -1.242529, z: -0.7533438, w: 0.0442073}
        tangentMode: 1
        weightedMode: 0
        inWeight: {x: 0.3333333, y: 0.3333333, z: 0.3333333, w: 0.3333333}
        outWeight: {x: 0.3333333, y: 0.3333333, z: 0.3333333, w: 0.3333333}
      - serializedVersion: 3
        time: 0.5666667
        value: {x: 0.1491657, y: -0.1862398, z: 0.07241646, w: 0.9684112}
        inSlope: {x: -0.146664, y: -1.555707, z: 0.1916201, w: -0.3019846}
        outSlope: {x: -0.146664, y: -1.555707, z: 0.1916201, w: -0.3019846}
        tangentMode: 1
        weightedMode: 0
        inWeight: {x: 0.3333333, y: 0.3333333, z: 0.3333333, w: 0.3333333}
        outWeight: {x: 0.3333333, y: 0.3333333, z: 0.3333333, w: 0.3333333}
      - serializedVersion: 3
        time: 0.6666667
        value: {x: 0.08865995, y: -0.3872488, z: 0.1212925, w: 0.9096515}
        inSlope: {x: -0.6867592, y: -2.079233, z: 0.3971019, w: -0.8592573}
        outSlope: {x: -0.6867592, y: -2.079233, z: 0.3971019, w: -0.8592573}
        tangentMode: 1
        weightedMode: 0
        inWeight: {x: 0.3333333, y: 0.3333333, z: 0.3333333, w: 0.3333333}
        outWeight: {x: 0.3333333, y: 0.3333333, z: 0.3333333, w: 0.3333333}
      - serializedVersion: 3
        time: 0.7333333
        value: {x: 0.05939034, y: -0.4983253, z: 0.1371698, w: 0.8540077}
        inSlope: {x: -0.1423911, y: -0.9473647, z: 0.2176588, w: -0.5569916}
        outSlope: {x: -0.1423911, y: -0.9473647, z: 0.2176588, w: -0.5569916}
        tangentMode: 1
        weightedMode: 0
        inWeight: {x: 0.3333333, y: 0.3333333, z: 0.3333333, w: 0.3333333}
        outWeight: {x: 0.3333333, y: 0.3333333, z: 0.3333333, w: 0.3333333}
      - serializedVersion: 3
        time: 0.7666667
        value: {x: 0.05950601, y: -0.515536, z: 0.1457664, w: 0.842279}
        inSlope: {x: -0.2099675, y: 0.8057795, z: 0.4818607, w: 0.3660341}
        outSlope: {x: 0, y: 0, z: 0, w: 0}
        tangentMode: 1
        weightedMode: 0
        inWeight: {x: 0.3333333, y: 0.3333333, z: 0.3333333, w: 0.3333333}
        outWeight: {x: 0.3333333, y: 0.3333333, z: 0.3333333, w: 0.3333333}
      m_PreInfinity: 2
      m_PostInfinity: 2
      m_RotationOrder: 4
    path: Dummy01/Box01/Line15/Line13
  - curve:
      serializedVersion: 2
      m_Curve:
      - serializedVersion: 3
        time: 1.490116E-08
        value: {x: 0.05744196, y: -0.3228067, z: -0.05962292, w: 0.9428369}
        inSlope: {x: 0, y: 0, z: 0, w: 0}
        outSlope: {x: -0.04053036, y: 0.1809324, z: 0.003833659, w: 0.05844177}
        tangentMode: 1
        weightedMode: 0
        inWeight: {x: 0.3333333, y: 0.3333333, z: 0.3333333, w: 0.3333333}
        outWeight: {x: 0.3333333, y: 0.3333333, z: 0.3333333, w: 0.3333333}
      - serializedVersion: 3
        time: 0.03333335
        value: {x: 0.05260023, y: -0.2880759, z: -0.06324692, w: 0.9540678}
        inSlope: {x: -0.3679926, y: 2.302861, z: -0.1311662, w: 0.5970839}
        outSlope: {x: -0.3679926, y: 2.302861, z: -0.1311662, w: 0.5970839}
        tangentMode: 1
        weightedMode: 0
        inWeight: {x: 0.3333333, y: 0.3333333, z: 0.3333333, w: 0.3333333}
        outWeight: {x: 0.3333333, y: 0.3333333, z: 0.3333333, w: 0.3333333}
      - serializedVersion: 3
        time: 0.06666668
        value: {x: 0.03290913, y: -0.1692827, z: -0.06836733, w: 0.9826425}
        inSlope: {x: -0.7753222, y: 4.092075, z: 0.06537846, w: 0.6611932}
        outSlope: {x: -0.7753222, y: 4.092075, z: 0.06537845, w: 0.6611932}
        tangentMode: 1
        weightedMode: 0
        inWeight: {x: 0.3333333, y: 0.3333333, z: 0.3333333, w: 0.3333333}
        outWeight: {x: 0.3333333, y: 0.3333333, z: 0.3333333, w: 0.3333333}
      - serializedVersion: 3
        time: 0.1
        value: {x: 0.0009120897, y: -0.01527088, z: -0.05888836, w: 0.9981474}
        inSlope: {x: -0.9705166, y: 4.284924, z: 0.5000275, w: 0.1415268}
        outSlope: {x: -0.9705166, y: 4.284924, z: 0.5000275, w: 0.1415268}
        tangentMode: 1
        weightedMode: 0
        inWeight: {x: 0.3333333, y: 0.3333333, z: 0.3333333, w: 0.3333333}
        outWeight: {x: 0.3333333, y: 0.3333333, z: 0.3333333, w: 0.3333333}
      - serializedVersion: 3
        time: 0.1333333
        value: {x: -0.03179198, y: 0.1163789, z: -0.03503217, w: 0.9920776}
        inSlope: {x: -0.7362906, y: 2.792929, z: 0.6738277, w: -0.2121108}
        outSlope: {x: -0.7362906, y: 2.792929, z: 0.6738277, w: -0.2121108}
        tangentMode: 1
        weightedMode: 0
        inWeight: {x: 0.3333333, y: 0.3333333, z: 0.3333333, w: 0.3333333}
        outWeight: {x: 0.3333333, y: 0.3333333, z: 0.3333333, w: 0.3333333}
      - serializedVersion: 3
        time: 0.1666667
        value: {x: -0.04817396, y: 0.1709244, z: -0.01396649, w: 0.9840066}
        inSlope: {x: 0.05241469, y: 0.8017164, z: 0.472116, w: -0.1052462}
        outSlope: {x: 0.05241469, y: 0.8017164, z: 0.472116, w: -0.1052462}
        tangentMode: 1
        weightedMode: 0
        inWeight: {x: 0.3333333, y: 0.3333333, z: 0.3333333, w: 0.3333333}
        outWeight: {x: 0.3333333, y: 0.3333333, z: 0.3333333, w: 0.3333333}
      - serializedVersion: 3
        time: 0.2
        value: {x: -0.02829768, y: 0.1698267, z: -0.003557752, w: 0.9850612}
        inSlope: {x: 1.051073, y: -0.04318469, z: 0.2484137, w: 0.02288911}
        outSlope: {x: 1.051073, y: -0.04318469, z: 0.2484137, w: 0.02288908}
        tangentMode: 1
        weightedMode: 0
        inWeight: {x: 0.3333333, y: 0.3333333, z: 0.3333333, w: 0.3333333}
        outWeight: {x: 0.3333333, y: 0.3333333, z: 0.3333333, w: 0.3333333}
      - serializedVersion: 3
        time: 0.2666667
        value: {x: 0.08140512, y: 0.1649482, z: 0.005912927, w: 0.9829193}
        inSlope: {x: 1.610205, y: -0.1376943, z: 0.07978833, w: -0.1014063}
        outSlope: {x: 1.610205, y: -0.1376943, z: 0.07978833, w: -0.1014063}
        tangentMode: 1
        weightedMode: 0
        inWeight: {x: 0.3333333, y: 0.3333333, z: 0.3333333, w: 0.3333333}
        outWeight: {x: 0.3333333, y: 0.3333333, z: 0.3333333, w: 0.3333333}
      - serializedVersion: 3
        time: 0.3
        value: {x: 0.1292446, y: 0.1588658, z: 0.00791364, w: 0.9787722}
        inSlope: {x: 0.9653611, y: -0.2641408, z: 0.05204692, w: -0.07016653}
        outSlope: {x: 0.9653611, y: -0.2641408, z: 0.05204692, w: -0.07016653}
        tangentMode: 1
        weightedMode: 0
        inWeight: {x: 0.3333333, y: 0.3333333, z: 0.3333333, w: 0.3333333}
        outWeight: {x: 0.3333333, y: 0.3333333, z: 0.3333333, w: 0.3333333}
      - serializedVersion: 3
        time: 0.3666667
        value: {x: 0.1501548, y: 0.12147, z: 0.0003497908, w: 0.981172}
        inSlope: {x: 0.1367391, y: -0.9953613, z: -0.4453998, w: 0.09236724}
        outSlope: {x: 0.1367392, y: -0.9953614, z: -0.4453998, w: 0.09236723}
        tangentMode: 1
        weightedMode: 0
        inWeight: {x: 0.3333333, y: 0.3333333, z: 0.3333333, w: 0.3333333}
        outWeight: {x: 0.3333333, y: 0.3333333, z: 0.3333333, w: 0.3333333}
      - serializedVersion: 3
        time: 0.4666667
        value: {x: 0.1549114, y: -0.02489275, z: -0.07632493, w: 0.984661}
        inSlope: {x: -0.1291735, y: -1.659621, z: -0.803795, w: -0.08260672}
        outSlope: {x: -0.1291735, y: -1.659621, z: -0.803795, w: -0.08260672}
        tangentMode: 1
        weightedMode: 0
        inWeight: {x: 0.3333333, y: 0.3333333, z: 0.3333333, w: 0.3333333}
        outWeight: {x: 0.3333333, y: 0.3333333, z: 0.3333333, w: 0.3333333}
      - serializedVersion: 3
        time: 0.5666667
        value: {x: 0.1317935, y: -0.1707533, z: -0.1192063, w: 0.9691561}
        inSlope: {x: -0.2355579, y: -1.13957, z: 0.09493112, w: -0.1545587}
        outSlope: {x: -0.2355579, y: -1.13957, z: 0.09493113, w: -0.1545587}
        tangentMode: 1
        weightedMode: 0
        inWeight: {x: 0.3333333, y: 0.3333333, z: 0.3333333, w: 0.3333333}
        outWeight: {x: 0.3333333, y: 0.3333333, z: 0.3333333, w: 0.3333333}
      - serializedVersion: 3
        time: 0.7333333
        value: {x: 0.07201914, y: -0.3181795, z: -0.06574111, w: 0.9430022}
        inSlope: {x: -0.4312835, y: -0.342349, z: 0.2352019, w: -0.06352192}
        outSlope: {x: -0.4312835, y: -0.342349, z: 0.2352019, w: -0.06352192}
        tangentMode: 1
        weightedMode: 0
        inWeight: {x: 0.3333333, y: 0.3333333, z: 0.3333333, w: 0.3333333}
        outWeight: {x: 0.3333333, y: 0.3333333, z: 0.3333333, w: 0.3333333}
      - serializedVersion: 3
        time: 0.7666667
        value: {x: 0.05750753, y: -0.3235207, z: -0.05949555, w: 0.9425962}
        inSlope: {x: -0.4793898, y: 0.743764, z: 0.0682783, w: 0.2620565}
        outSlope: {x: 0, y: 0, z: 0, w: 0}
        tangentMode: 1
        weightedMode: 0
        inWeight: {x: 0.3333333, y: 0.3333333, z: 0.3333333, w: 0.3333333}
        outWeight: {x: 0.3333333, y: 0.3333333, z: 0.3333333, w: 0.3333333}
      m_PreInfinity: 2
      m_PostInfinity: 2
      m_RotationOrder: 4
    path: Dummy01/Box01/Line15/Line13/Line14
  - curve:
      serializedVersion: 2
      m_Curve:
      - serializedVersion: 3
        time: 1.490116E-08
        value: {x: 0.09519554, y: 0, z: 0, w: 0.9954586}
        inSlope: {x: 0, y: 0, z: 0, w: 0}
        outSlope: {x: -0.10577, y: 0, z: 0, w: 0.009925962}
        tangentMode: 1
        weightedMode: 0
        inWeight: {x: 0.3333333, y: 0.3333333, z: 0.3333333, w: 0.3333333}
        outWeight: {x: 0.3333333, y: 0.3333333, z: 0.3333333, w: 0.3333333}
      - serializedVersion: 3
        time: 0.2666667
        value: {x: -0.03789983, y: 0, z: 0, w: 0.9992815}
        inSlope: {x: -0.5929224, y: 0, z: 0, w: -0.02174735}
        outSlope: {x: -0.5929224, y: 0, z: 0, w: -0.02174735}
        tangentMode: 1
        weightedMode: 0
        inWeight: {x: 0.3333333, y: 0.3333333, z: 0.3333333, w: 0.3333333}
        outWeight: {x: 0.3333333, y: 0.3333333, z: 0.3333333, w: 0.3333333}
      - serializedVersion: 3
        time: 0.4666667
        value: {x: -0.07116315, y: 0, z: 0, w: 0.9974647}
        inSlope: {x: 0.3644918, y: 0, z: 0, w: 0.02512068}
        outSlope: {x: 0.3644918, y: 0, z: 0, w: 0.02512068}
        tangentMode: 1
        weightedMode: 0
        inWeight: {x: 0.3333333, y: 0.3333333, z: 0.3333333, w: 0.3333333}
        outWeight: {x: 0.3333333, y: 0.3333333, z: 0.3333333, w: 0.3333333}
      - serializedVersion: 3
        time: 0.7
        value: {x: 0.05499297, y: 0, z: 0, w: 0.9984868}
        inSlope: {x: 0.3648503, y: 0, z: 0, w: -0.01921177}
        outSlope: {x: 0.3648503, y: 0, z: 0, w: -0.01921177}
        tangentMode: 1
        weightedMode: 0
        inWeight: {x: 0.3333333, y: 0.3333333, z: 0.3333333, w: 0.3333333}
        outWeight: {x: 0.3333333, y: 0.3333333, z: 0.3333333, w: 0.3333333}
      - serializedVersion: 3
        time: 0.7666667
        value: {x: 0.06764098, y: 0, z: 0, w: 0.9979888}
        inSlope: {x: -0.1724609, y: 0, z: 0, w: 0.009106396}
        outSlope: {x: 0, y: 0, z: 0, w: 0}
        tangentMode: 1
        weightedMode: 0
        inWeight: {x: 0.3333333, y: 0.3333333, z: 0.3333333, w: 0.3333333}
        outWeight: {x: 0.3333333, y: 0.3333333, z: 0.3333333, w: 0.3333333}
      m_PreInfinity: 2
      m_PostInfinity: 2
      m_RotationOrder: 4
    path: Dummy01/Box01/Box02
  - curve:
      serializedVersion: 2
      m_Curve:
      - serializedVersion: 3
        time: 1.490116E-08
        value: {x: 0.4455901, y: 0.5490441, z: 0.4455902, w: 0.5490441}
        inSlope: {x: 0, y: 0, z: 0, w: 0}
        outSlope: {x: 0.05554498, y: -0.04523456, z: 0.05554498, w: -0.04523456}
        tangentMode: 1
        weightedMode: 0
        inWeight: {x: 0.3333333, y: 0.3333333, z: 0.3333333, w: 0.3333333}
        outWeight: {x: 0.3333333, y: 0.3333333, z: 0.3333333, w: 0.3333333}
      - serializedVersion: 3
        time: 0.2666667
        value: {x: 0.5115753, y: 0.4881502, z: 0.5115754, w: 0.4881502}
        inSlope: {x: 0.2765376, y: -0.2891194, z: 0.2765376, w: -0.2891194}
        outSlope: {x: 0.2765376, y: -0.2891194, z: 0.2765376, w: -0.2891194}
        tangentMode: 1
        weightedMode: 0
        inWeight: {x: 0.3333333, y: 0.3333333, z: 0.3333333, w: 0.3333333}
        outWeight: {x: 0.3333333, y: 0.3333333, z: 0.3333333, w: 0.3333333}
      - serializedVersion: 3
        time: 0.4666667
        value: {x: 0.5269752, y: 0.471484, z: 0.5269753, w: 0.471484}
        inSlope: {x: -0.1604873, y: 0.1785686, z: -0.1604873, w: 0.1785686}
        outSlope: {x: -0.1604873, y: 0.1785686, z: -0.1604873, w: 0.1785686}
        tangentMode: 1
        weightedMode: 0
        inWeight: {x: 0.3333333, y: 0.3333333, z: 0.3333333, w: 0.3333333}
        outWeight: {x: 0.3333333, y: 0.3333333, z: 0.3333333, w: 0.3333333}
      - serializedVersion: 3
        time: 0.7333333
        value: {x: 0.4633346, y: 0.5341545, z: 0.4633346, w: 0.5341545}
        inSlope: {x: -0.09900534, y: 0.08638063, z: -0.09900534, w: 0.08638063}
        outSlope: {x: -0.09900534, y: 0.08638062, z: -0.09900534, w: 0.08638062}
        tangentMode: 1
        weightedMode: 0
        inWeight: {x: 0.3333333, y: 0.3333333, z: 0.3333333, w: 0.3333333}
        outWeight: {x: 0.3333333, y: 0.3333333, z: 0.3333333, w: 0.3333333}
      - serializedVersion: 3
        time: 0.7666667
        value: {x: 0.4623678, y: 0.5351064, z: 0.4623679, w: 0.5351064}
        inSlope: {x: 0.07080132, y: -0.05882616, z: 0.07080221, w: -0.05882705}
        outSlope: {x: 0, y: 0, z: 0, w: 0}
        tangentMode: 1
        weightedMode: 0
        inWeight: {x: 0.3333333, y: 0.3333333, z: 0.3333333, w: 0.3333333}
        outWeight: {x: 0.3333333, y: 0.3333333, z: 0.3333333, w: 0.3333333}
      m_PreInfinity: 2
      m_PostInfinity: 2
      m_RotationOrder: 4
    path: Dummy01/Box01/Box02/Box03
  - curve:
      serializedVersion: 2
      m_Curve:
      - serializedVersion: 3
        time: 1.490116E-08
        value: {x: -0.01560547, y: -0.09244347, z: -0.1657227, w: 0.981706}
        inSlope: {x: 0, y: 0, z: 0, w: 0}
        outSlope: {x: 0.02506558, y: 0.1484833, z: -0.002295971, w: 0.01360417}
        tangentMode: 1
        weightedMode: 0
        inWeight: {x: 0.3333333, y: 0.3333333, z: 0.3333333, w: 0.3333333}
        outWeight: {x: 0.3333333, y: 0.3333333, z: 0.3333333, w: 0.3333333}
      - serializedVersion: 3
        time: 0.1666667
        value: {x: 0.0004052556, y: 0.002400648, z: -0.1664554, w: 0.986046}
        inSlope: {x: 0.1538719, y: 0.911504, z: 0.000511185, w: -0.003029113}
        outSlope: {x: 0.1538719, y: 0.911504, z: 0.0005111852, w: -0.003029114}
        tangentMode: 1
        weightedMode: 0
        inWeight: {x: 0.3333333, y: 0.3333333, z: 0.3333333, w: 0.3333333}
        outWeight: {x: 0.3333333, y: 0.3333333, z: 0.3333333, w: 0.3333333}
      - serializedVersion: 3
        time: 0.4333333
        value: {x: 0.02590467, y: 0.1534537, z: -0.1644278, w: 0.9740351}
        inSlope: {x: -0.0545973, y: -0.3234227, z: -0.008313504, w: 0.04924803}
        outSlope: {x: -0.0545973, y: -0.3234227, z: -0.008313504, w: 0.04924802}
        tangentMode: 1
        weightedMode: 0
        inWeight: {x: 0.3333333, y: 0.3333333, z: 0.3333333, w: 0.3333333}
        outWeight: {x: 0.3333333, y: 0.3333333, z: 0.3333333, w: 0.3333333}
      - serializedVersion: 3
        time: 0.6333334
        value: {x: -0.002545696, y: -0.01508016, z: -0.1664364, w: 0.9859336}
        inSlope: {x: -0.1579644, y: -0.9357476, z: 0.002145322, w: -0.01270832}
        outSlope: {x: -0.1579644, y: -0.9357474, z: 0.002145322, w: -0.01270832}
        tangentMode: 1
        weightedMode: 0
        inWeight: {x: 0.3333333, y: 0.3333333, z: 0.3333333, w: 0.3333333}
        outWeight: {x: 0.3333333, y: 0.3333333, z: 0.3333333, w: 0.3333333}
      - serializedVersion: 3
        time: 0.7333333
        value: {x: -0.01423771, y: -0.08434116, z: -0.1658458, w: 0.9824353}
        inSlope: {x: -0.0550477, y: -0.3260908, z: 0.004440401, w: -0.02630445}
        outSlope: {x: -0.0550477, y: -0.3260908, z: 0.004440401, w: -0.02630445}
        tangentMode: 1
        weightedMode: 0
        inWeight: {x: 0.3333333, y: 0.3333333, z: 0.3333333, w: 0.3333333}
        outWeight: {x: 0.3333333, y: 0.3333333, z: 0.3333333, w: 0.3333333}
      - serializedVersion: 3
        time: 0.7666667
        value: {x: -0.01480865, y: -0.08772325, z: -0.1658612, w: 0.9825266}
        inSlope: {x: 0.03846139, y: 0.2278371, z: -0.004774104, w: 0.0282794}
        outSlope: {x: 0, y: 0, z: 0, w: 0}
        tangentMode: 1
        weightedMode: 0
        inWeight: {x: 0.3333333, y: 0.3333333, z: 0.3333333, w: 0.3333333}
        outWeight: {x: 0.3333333, y: 0.3333333, z: 0.3333333, w: 0.3333333}
      m_PreInfinity: 2
      m_PostInfinity: 2
      m_RotationOrder: 4
    path: Dummy01/Box01/Line05
  - curve:
      serializedVersion: 2
      m_Curve:
      - serializedVersion: 3
        time: 1.490116E-08
        value: {x: -0.08280822, y: 0, z: 0, w: 0.9965655}
        inSlope: {x: 0, y: 0, z: 0, w: 0}
        outSlope: {x: 0.161811, y: 0, z: 0, w: 0.01300514}
        tangentMode: 1
        weightedMode: 0
        inWeight: {x: 0.3333333, y: 0.3333333, z: 0.3333333, w: 0.3333333}
        outWeight: {x: 0.3333333, y: 0.3333333, z: 0.3333333, w: 0.3333333}
      - serializedVersion: 3
        time: 0.1666667
        value: {x: 0.02050198, y: 0, z: 0, w: 0.9997898}
        inSlope: {x: 0.9921244, y: 0, z: 0, w: -0.02129138}
        outSlope: {x: 0.9921244, y: 0, z: 0, w: -0.02129138}
        tangentMode: 1
        weightedMode: 0
        inWeight: {x: 0.3333333, y: 0.3333333, z: 0.3333333, w: 0.3333333}
        outWeight: {x: 0.3333333, y: 0.3333333, z: 0.3333333, w: 0.3333333}
      - serializedVersion: 3
        time: 0.4333333
        value: {x: 0.1846176, y: 0, z: 0, w: 0.9828104}
        inSlope: {x: -0.3480228, y: 0, z: 0, w: 0.06339934}
        outSlope: {x: -0.3480228, y: 0, z: 0, w: 0.06339935}
        tangentMode: 1
        weightedMode: 0
        inWeight: {x: 0.3333333, y: 0.3333333, z: 0.3333333, w: 0.3333333}
        outWeight: {x: 0.3333333, y: 0.3333333, z: 0.3333333, w: 0.3333333}
      - serializedVersion: 3
        time: 0.6
        value: {x: 0.03832234, y: 0, z: 0, w: 0.9992654}
        inSlope: {x: -1.08415, y: 0, z: 0, w: 0.04223855}
        outSlope: {x: -1.08415, y: 0, z: 0, w: 0.04223856}
        tangentMode: 1
        weightedMode: 0
        inWeight: {x: 0.3333333, y: 0.3333333, z: 0.3333333, w: 0.3333333}
        outWeight: {x: 0.3333333, y: 0.3333333, z: 0.3333333, w: 0.3333333}
      - serializedVersion: 3
        time: 0.7333333
        value: {x: -0.07217358, y: 0, z: 0, w: 0.9973921}
        inSlope: {x: -0.3529622, y: 0, z: 0, w: -0.02359452}
        outSlope: {x: -0.3529622, y: 0, z: 0, w: -0.02359452}
        tangentMode: 1
        weightedMode: 0
        inWeight: {x: 0.3333333, y: 0.3333333, z: 0.3333333, w: 0.3333333}
        outWeight: {x: 0.3333333, y: 0.3333333, z: 0.3333333, w: 0.3333333}
      - serializedVersion: 3
        time: 0.7666667
        value: {x: -0.07582891, y: 0, z: 0, w: 0.9975671}
        inSlope: {x: 0.2467651, y: 0, z: 0, w: 0.02789674}
        outSlope: {x: 0, y: 0, z: 0, w: 0}
        tangentMode: 1
        weightedMode: 0
        inWeight: {x: 0.3333333, y: 0.3333333, z: 0.3333333, w: 0.3333333}
        outWeight: {x: 0.3333333, y: 0.3333333, z: 0.3333333, w: 0.3333333}
      m_PreInfinity: 2
      m_PostInfinity: 2
      m_RotationOrder: 4
    path: Dummy01/Box01/Line04
  - curve:
      serializedVersion: 2
      m_Curve:
      - serializedVersion: 3
        time: 1.490116E-08
        value: {x: -0.08714011, y: -0.0125152, z: 0.1416109, w: 0.9860002}
        inSlope: {x: 0, y: 0, z: 0, w: 0}
        outSlope: {x: 0.1371043, y: 0.01969113, z: 0.001694262, w: 0.01179636}
        tangentMode: 1
        weightedMode: 0
        inWeight: {x: 0.3333333, y: 0.3333333, z: 0.3333333, w: 0.3333333}
        outWeight: {x: 0.3333333, y: 0.3333333, z: 0.3333333, w: 0.3333333}
      - serializedVersion: 3
        time: 0.2
        value: {x: 0.02925552, y: 0.004201723, z: 0.1421007, w: 0.9894109}
        inSlope: {x: 0.8651305, y: 0.1242514, z: -0.003673955, w: -0.02558023}
        outSlope: {x: 0.8651305, y: 0.1242514, z: -0.003673956, w: -0.02558023}
        tangentMode: 1
        weightedMode: 0
        inWeight: {x: 0.3333333, y: 0.3333333, z: 0.3333333, w: 0.3333333}
        outWeight: {x: 0.3333333, y: 0.3333333, z: 0.3333333, w: 0.3333333}
      - serializedVersion: 3
        time: 0.4333333
        value: {x: 0.1403906, y: 0.02016312, z: 0.1407257, w: 0.9798368}
        inSlope: {x: -0.2727605, y: -0.0391743, z: 0.005440413, w: 0.03787993}
        outSlope: {x: -0.2727605, y: -0.03917429, z: 0.005440412, w: 0.03787993}
        tangentMode: 1
        weightedMode: 0
        inWeight: {x: 0.3333333, y: 0.3333333, z: 0.3333333, w: 0.3333333}
        outWeight: {x: 0.3333333, y: 0.3333333, z: 0.3333333, w: 0.3333333}
      - serializedVersion: 3
        time: 0.6333334
        value: {x: -0.001524282, y: -0.0002189198, z: 0.1421627, w: 0.9898421}
        inSlope: {x: -0.7877709, y: -0.1131409, z: -1.162407E-05, w: -8.047556E-05}
        outSlope: {x: -0.7877709, y: -0.1131409, z: -1.162424E-05, w: -8.047558E-05}
        tangentMode: 1
        weightedMode: 0
        inWeight: {x: 0.3333333, y: 0.3333333, z: 0.3333333, w: 0.3333333}
        outWeight: {x: 0.3333333, y: 0.3333333, z: 0.3333333, w: 0.3333333}
      - serializedVersion: 3
        time: 0.7333333
        value: {x: -0.05987407, y: -0.008599206, z: 0.1419025, w: 0.9880308}
        inSlope: {x: -0.2749431, y: -0.03948776, z: -0.002221989, w: -0.0154701}
        outSlope: {x: -0.2749431, y: -0.03948776, z: -0.002221989, w: -0.0154701}
        tangentMode: 1
        weightedMode: 0
        inWeight: {x: 0.3333333, y: 0.3333333, z: 0.3333333, w: 0.3333333}
        outWeight: {x: 0.3333333, y: 0.3333333, z: 0.3333333, w: 0.3333333}
      - serializedVersion: 3
        time: 0.7666667
        value: {x: -0.06271842, y: -0.009007717, z: 0.1419164, w: 0.9881274}
        inSlope: {x: 0.1922903, y: 0.02761705, z: 0.00255592, w: 0.01779912}
        outSlope: {x: 0, y: 0, z: 0, w: 0}
        tangentMode: 1
        weightedMode: 0
        inWeight: {x: 0.3333333, y: 0.3333333, z: 0.3333333, w: 0.3333333}
        outWeight: {x: 0.3333333, y: 0.3333333, z: 0.3333333, w: 0.3333333}
      m_PreInfinity: 2
      m_PostInfinity: 2
      m_RotationOrder: 4
    path: Dummy01/Box01/Line06
  - curve:
      serializedVersion: 2
      m_Curve:
      - serializedVersion: 3
        time: 1.490116E-08
        value: {x: 0.6618215, y: 0.2459968, z: 0.6960294, w: 0.1304646}
        inSlope: {x: 0, y: 0, z: 0, w: 0}
        outSlope: {x: 0.0002592802, y: 0.01509011, z: -0.01861453, w: 0.06884784}
        tangentMode: 1
        weightedMode: 0
        inWeight: {x: 0.3333333, y: 0.3333333, z: 0.3333333, w: 0.3333333}
        outWeight: {x: 0.3333333, y: 0.3333333, z: 0.3333333, w: 0.3333333}
      - serializedVersion: 3
        time: 0.3333334
        value: {x: 0.664912, y: 0.2687843, z: 0.6557978, w: 0.2357461}
        inSlope: {x: 0.0125581, y: 0.04797041, z: -0.1128629, w: 0.2257503}
        outSlope: {x: 0.0125581, y: 0.04797041, z: -0.1128629, w: 0.2257503}
        tangentMode: 1
        weightedMode: 0
        inWeight: {x: 0.3333333, y: 0.3333333, z: 0.3333333, w: 0.3333333}
        outWeight: {x: 0.3333333, y: 0.3333333, z: 0.3333333, w: 0.3333333}
      - serializedVersion: 3
        time: 0.7666667
        value: {x: 0.6618215, y: 0.2459968, z: 0.6960294, w: 0.1304646}
        inSlope: {x: 0.01622197, y: -0.159496, z: 0.09907892, w: -0.3112428}
        outSlope: {x: 0, y: 0, z: 0, w: 0}
        tangentMode: 1
        weightedMode: 0
        inWeight: {x: 0.3333333, y: 0.3333333, z: 0.3333333, w: 0.3333333}
        outWeight: {x: 0.3333333, y: 0.3333333, z: 0.3333333, w: 0.3333333}
      m_PreInfinity: 2
      m_PostInfinity: 2
      m_RotationOrder: 4
    path: Dummy01/Box01/Line12
  - curve:
      serializedVersion: 2
      m_Curve:
      - serializedVersion: 3
        time: 1.490116E-08
        value: {x: 3.012999E-07, y: 3.986169E-08, z: 0.3230313, w: 0.9463883}
        inSlope: {x: 0, y: 0, z: 0, w: 0}
        outSlope: {x: -0.0006295561, y: 0.02040505, z: 0.113056, w: -0.03884912}
        tangentMode: 1
        weightedMode: 0
        inWeight: {x: 0.3333333, y: 0.3333333, z: 0.3333333, w: 0.3333333}
        outWeight: {x: 0.3333333, y: 0.3333333, z: 0.3333333, w: 0.3333333}
      - serializedVersion: 3
        time: 0.2333334
        value: {x: -0.003289854, y: 0.02131072, z: 0.4394363, w: 0.8980149}
        inSlope: {x: -0.03444621, y: 0.1209147, z: 0.6540118, w: -0.322441}
        outSlope: {x: -0.03444621, y: 0.1209147, z: 0.6540118, w: -0.322441}
        tangentMode: 1
        weightedMode: 0
        inWeight: {x: 0.3333333, y: 0.3333333, z: 0.3333333, w: 0.3333333}
        outWeight: {x: 0.3333333, y: 0.3333333, z: 0.3333333, w: 0.3333333}
      - serializedVersion: 3
        time: 0.4666667
        value: {x: -0.006629641, y: 0.03084449, z: 0.4909306, w: 0.8706272}
        inSlope: {x: 0.03177191, y: -0.07764569, z: -0.4193698, w: 0.2376518}
        outSlope: {x: 0.03177191, y: -0.07764569, z: -0.4193698, w: 0.2376518}
        tangentMode: 1
        weightedMode: 0
        inWeight: {x: 0.3333333, y: 0.3333333, z: 0.3333333, w: 0.3333333}
        outWeight: {x: 0.3333333, y: 0.3333333, z: 0.3333333, w: 0.3333333}
      - serializedVersion: 3
        time: 0.6666667
        value: {x: -0.0004023264, y: 0.006299589, z: 0.3577688, w: 0.9337889}
        inSlope: {x: 0.0116404, y: -0.110086, z: -0.6037855, w: 0.2337036}
        outSlope: {x: 0.0116404, y: -0.110086, z: -0.6037855, w: 0.2337036}
        tangentMode: 1
        weightedMode: 0
        inWeight: {x: 0.3333333, y: 0.3333333, z: 0.3333333, w: 0.3333333}
        outWeight: {x: 0.3333333, y: 0.3333333, z: 0.3333333, w: 0.3333333}
      - serializedVersion: 3
        time: 0.7666667
        value: {x: 3.536386E-05, y: 0.0002148218, z: 0.3242289, w: 0.946067}
        inSlope: {x: -0.003210545, y: -0.003820724, z: -0.02091608, w: 0.004241477}
        outSlope: {x: 0, y: 0, z: 0, w: 0}
        tangentMode: 1
        weightedMode: 0
        inWeight: {x: 0.3333333, y: 0.3333333, z: 0.3333333, w: 0.3333333}
        outWeight: {x: 0.3333333, y: 0.3333333, z: 0.3333333, w: 0.3333333}
      m_PreInfinity: 2
      m_PostInfinity: 2
      m_RotationOrder: 4
    path: Dummy01/Box01/Line12/Line10
  - curve:
      serializedVersion: 2
      m_Curve:
      - serializedVersion: 3
        time: 1.490116E-08
        value: {x: 0.6900112, y: 0.1545464, z: 0.6674498, w: 0.2334752}
        inSlope: {x: 0, y: 0, z: 0, w: 0}
        outSlope: {x: -0.01934588, y: 0.06951303, z: 0.001269579, w: 0.00715524}
        tangentMode: 1
        weightedMode: 0
        inWeight: {x: 0.3333333, y: 0.3333333, z: 0.3333333, w: 0.3333333}
        outWeight: {x: 0.3333333, y: 0.3333333, z: 0.3333333, w: 0.3333333}
      - serializedVersion: 3
        time: 0.3333334
        value: {x: 0.6497172, y: 0.2606781, z: 0.6710551, w: 0.2441301}
        inSlope: {x: -0.1106331, y: 0.2273994, z: 0.0114128, w: 0.02204016}
        outSlope: {x: -0.1106331, y: 0.2273994, z: 0.0114128, w: 0.02204015}
        tangentMode: 1
        weightedMode: 0
        inWeight: {x: 0.3333333, y: 0.3333333, z: 0.3333333, w: 0.3333333}
        outWeight: {x: 0.3333333, y: 0.3333333, z: 0.3333333, w: 0.3333333}
      - serializedVersion: 3
        time: 0.7333333
        value: {x: 0.6863104, y: 0.1662225, z: 0.6671197, w: 0.2372753}
        inSlope: {x: 0.119573, y: -0.3697548, z: 0.005374258, w: -0.1009759}
        outSlope: {x: 0.119573, y: -0.3697547, z: 0.005374258, w: -0.1009759}
        tangentMode: 1
        weightedMode: 0
        inWeight: {x: 0.3333333, y: 0.3333333, z: 0.3333333, w: 0.3333333}
        outWeight: {x: 0.3333333, y: 0.3333333, z: 0.3333333, w: 0.3333333}
      - serializedVersion: 3
        time: 0.7666667
        value: {x: 0.6904229, y: 0.1537267, z: 0.6677305, w: 0.2320624}
        inSlope: {x: 0.1268112, y: -0.3813625, z: 0.03143369, w: -0.2133712}
        outSlope: {x: 0, y: 0, z: 0, w: 0}
        tangentMode: 1
        weightedMode: 0
        inWeight: {x: 0.3333333, y: 0.3333333, z: 0.3333333, w: 0.3333333}
        outWeight: {x: 0.3333333, y: 0.3333333, z: 0.3333333, w: 0.3333333}
      m_PreInfinity: 2
      m_PostInfinity: 2
      m_RotationOrder: 4
    path: Dummy01/Box01/Line07
  - curve:
      serializedVersion: 2
      m_Curve:
      - serializedVersion: 3
        time: 1.490116E-08
        value: {x: 5.47166E-09, y: -1.786304E-08, z: 0.2928798, w: 0.9561493}
        inSlope: {x: 0, y: 0, z: 0, w: 0}
        outSlope: {x: 0.000768694, y: -0.01434156, z: 0.1185805, w: -0.03659606}
        tangentMode: 1
        weightedMode: 0
        inWeight: {x: 0.3333333, y: 0.3333333, z: 0.3333333, w: 0.3333333}
        outWeight: {x: 0.3333333, y: 0.3333333, z: 0.3333333, w: 0.3333333}
      - serializedVersion: 3
        time: 0.2
        value: {x: 0.00187117, y: -0.01201498, z: 0.3914846, w: 0.9201043}
        inSlope: {x: 0.02327642, y: -0.08776844, z: 0.7172804, w: -0.3063789}
        outSlope: {x: 0.02327642, y: -0.08776844, z: 0.7172804, w: -0.3063789}
        tangentMode: 1
        weightedMode: 0
        inWeight: {x: 0.3333333, y: 0.3333333, z: 0.3333333, w: 0.3333333}
        outWeight: {x: 0.3333333, y: 0.3333333, z: 0.3333333, w: 0.3333333}
      - serializedVersion: 3
        time: 0.4666667
        value: {x: 0.005303931, y: -0.02155493, z: 0.4695809, w: 0.8826104}
        inSlope: {x: -0.02434105, y: 0.05386877, z: -0.4428373, w: 0.2351601}
        outSlope: {x: -0.02434105, y: 0.05386877, z: -0.4428373, w: 0.2351601}
        tangentMode: 1
        weightedMode: 0
        inWeight: {x: 0.3333333, y: 0.3333333, z: 0.3333333, w: 0.3333333}
        outWeight: {x: 0.3333333, y: 0.3333333, z: 0.3333333, w: 0.3333333}
      - serializedVersion: 3
        time: 0.6666667
        value: {x: 0.0003893532, y: -0.004423826, z: 0.329338, w: 0.9442016}
        inSlope: {x: -0.01016443, y: 0.07721765, z: -0.6342008, w: 0.2232823}
        outSlope: {x: -0.01016443, y: 0.07721765, z: -0.6342008, w: 0.2232823}
        tangentMode: 1
        weightedMode: 0
        inWeight: {x: 0.3333333, y: 0.3333333, z: 0.3333333, w: 0.3333333}
        outWeight: {x: 0.3333333, y: 0.3333333, z: 0.3333333, w: 0.3333333}
      - serializedVersion: 3
        time: 0.7666667
        value: {x: -2.497823E-05, y: -0.0001458048, z: 0.2940816, w: 0.9558805}
        inSlope: {x: 0.002501051, y: 0.001610481, z: -0.01226508, w: 0.0005802514}
        outSlope: {x: 0, y: 0, z: 0, w: 0}
        tangentMode: 1
        weightedMode: 0
        inWeight: {x: 0.3333333, y: 0.3333333, z: 0.3333333, w: 0.3333333}
        outWeight: {x: 0.3333333, y: 0.3333333, z: 0.3333333, w: 0.3333333}
      m_PreInfinity: 2
      m_PostInfinity: 2
      m_RotationOrder: 4
    path: Dummy01/Box01/Line07/Line08
  - curve:
      serializedVersion: 2
      m_Curve:
      - serializedVersion: 3
        time: 0
        value: {x: 7.783066E-09, y: -5.909431E-08, z: 0.1305782, w: 0.991438}
        inSlope: {x: 0, y: 0, z: 0, w: 0}
        outSlope: {x: 0, y: 0, z: 0, w: 0}
        tangentMode: 1
        weightedMode: 0
        inWeight: {x: 0.3333333, y: 0.3333333, z: 0.3333333, w: 0.3333333}
        outWeight: {x: 0.3333333, y: 0.3333333, z: 0.3333333, w: 0.3333333}
      - serializedVersion: 3
        time: 0.8333333
        value: {x: 7.783066E-09, y: -5.909431E-08, z: 0.1305782, w: 0.991438}
        inSlope: {x: 0, y: 0, z: 0, w: 0}
        outSlope: {x: 0, y: 0, z: 0, w: 0}
        tangentMode: 1
        weightedMode: 0
        inWeight: {x: 0.3333333, y: 0.3333333, z: 0.3333333, w: 0.3333333}
        outWeight: {x: 0.3333333, y: 0.3333333, z: 0.3333333, w: 0.3333333}
      m_PreInfinity: 2
      m_PostInfinity: 2
      m_RotationOrder: 4
    path: path_380977984
  m_CompressedRotationCurves: []
  m_EulerCurves: []
  m_PositionCurves:
  - curve:
      serializedVersion: 2
      m_Curve:
      - serializedVersion: 3
        time: 0
        value: {x: 1.312214, y: -870.902, z: 4298.059}
        inSlope: {x: 0, y: 0, z: 0}
        outSlope: {x: 0, y: 0.007149056, z: -0.05301336}
        tangentMode: 1
        weightedMode: 0
        inWeight: {x: 0.3333333, y: 0.3333333, z: 0.3333333}
        outWeight: {x: 0.3333333, y: 0.3333333, z: 0.3333333}
      - serializedVersion: 3
        time: 0.6
        value: {x: 1.312212, y: -866.2244, z: 4298.282}
        inSlope: {x: -2.043591E-06, y: -43.92059, z: 2.523719}
        outSlope: {x: -2.758842E-05, y: -43.92051, z: 2.645087}
        tangentMode: 1
        weightedMode: 0
        inWeight: {x: 0.3333333, y: 0.3333333, z: 0.3333333}
        outWeight: {x: 0.3333333, y: 0.3333333, z: 0.3333333}
      - serializedVersion: 3
        time: 0.7666667
        value: {x: 1.312212, y: -869.0558, z: 4298.461}
        inSlope: {x: 6.705522E-06, y: 22.58926, z: -1.170044}
        outSlope: {x: 0, y: 0, z: 0}
        tangentMode: 1
        weightedMode: 0
        inWeight: {x: 0.3333333, y: 0.3333333, z: 0.3333333}
        outWeight: {x: 0.3333333, y: 0.3333333, z: 0.3333333}
      m_PreInfinity: 2
      m_PostInfinity: 2
      m_RotationOrder: 4
    path: Dummy01/Box01
  m_ScaleCurves: []
  m_FloatCurves: []
  m_PPtrCurves: []
  m_SampleRate: 30
  m_WrapMode: 0
  m_Bounds:
    m_Center: {x: 0, y: 0, z: 0}
    m_Extent: {x: 0, y: 0, z: 0}
  m_ClipBindingConstant:
    genericBindings:
    - path: 3319776015
      attribute: 1
      script: {fileID: 0}
      classID: 4
      customType: 0
      isPPtrCurve: 0
    - path: 2019433565
      attribute: 2
      script: {fileID: 0}
      classID: 4
      customType: 0
      isPPtrCurve: 0
    - path: 3588953318
      attribute: 2
      script: {fileID: 0}
      classID: 4
      customType: 0
      isPPtrCurve: 0
    - path: 200014843
      attribute: 2
      script: {fileID: 0}
      classID: 4
      customType: 0
      isPPtrCurve: 0
    - path: 1713957125
      attribute: 2
      script: {fileID: 0}
      classID: 4
      customType: 0
      isPPtrCurve: 0
    - path: 684068744
      attribute: 2
      script: {fileID: 0}
      classID: 4
      customType: 0
      isPPtrCurve: 0
    - path: 1934737206
      attribute: 2
      script: {fileID: 0}
      classID: 4
      customType: 0
      isPPtrCurve: 0
    - path: 4253907229
      attribute: 2
      script: {fileID: 0}
      classID: 4
      customType: 0
      isPPtrCurve: 0
    - path: 3584002479
      attribute: 2
      script: {fileID: 0}
      classID: 4
      customType: 0
      isPPtrCurve: 0
    - path: 2134104132
      attribute: 2
      script: {fileID: 0}
      classID: 4
      customType: 0
      isPPtrCurve: 0
    - path: 137685202
      attribute: 2
      script: {fileID: 0}
      classID: 4
      customType: 0
      isPPtrCurve: 0
    - path: 3862596094
      attribute: 2
      script: {fileID: 0}
      classID: 4
      customType: 0
      isPPtrCurve: 0
    - path: 4165762214
      attribute: 2
      script: {fileID: 0}
      classID: 4
      customType: 0
      isPPtrCurve: 0
    - path: 3138017067
      attribute: 2
      script: {fileID: 0}
      classID: 4
      customType: 0
      isPPtrCurve: 0
    - path: 2436741480
      attribute: 2
      script: {fileID: 0}
      classID: 4
      customType: 0
      isPPtrCurve: 0
    - path: 4082234495
      attribute: 2
      script: {fileID: 0}
      classID: 4
      customType: 0
      isPPtrCurve: 0
    - path: 380977984
      attribute: 2
      script: {fileID: 0}
      classID: 4
      customType: 0
      isPPtrCurve: 0
    pptrCurveMapping: []
  m_AnimationClipSettings:
    serializedVersion: 2
    m_AdditiveReferencePoseClip: {fileID: 0}
    m_AdditiveReferencePoseTime: 0
    m_StartTime: 0
    m_StopTime: 0.7666667
    m_OrientationOffsetY: 0
    m_Level: 0
    m_CycleOffset: 0
    m_HasAdditiveReferencePose: 0
    m_LoopTime: 1
    m_LoopBlend: 0
    m_LoopBlendOrientation: 0
    m_LoopBlendPositionY: 0
    m_LoopBlendPositionXZ: 0
    m_KeepOriginalOrientation: 0
    m_KeepOriginalPositionY: 1
    m_KeepOriginalPositionXZ: 0
    m_HeightFromFeet: 0
    m_Mirror: 0
  m_EditorCurves: []
  m_EulerEditorCurves: []
  m_HasGenericRootTransform: 0
  m_HasMotionFloatCurves: 0
  m_GenerateMotionCurves: 0
  m_Events: []
