%YAML 1.1
%TAG !u! tag:unity3d.com,2011:
--- !u!1 &1000013417806422
GameObject:
  m_ObjectHideFlags: 0
  m_CorrespondingSourceObject: {fileID: 0}
  m_PrefabInstance: {fileID: 0}
  m_PrefabAsset: {fileID: 0}
  serializedVersion: 6
  m_Component:
  - component: {fileID: 4000011213849232}
  - component: {fileID: 114000011734215162}
  m_Layer: 0
  m_Name: ClubArenaAtlas
  m_TagString: Untagged
  m_Icon: {fileID: 0}
  m_NavMeshLayer: 0
  m_StaticEditorFlags: 0
  m_IsActive: 1
--- !u!4 &4000011213849232
Transform:
  m_ObjectHideFlags: 0
  m_CorrespondingSourceObject: {fileID: 0}
  m_PrefabInstance: {fileID: 0}
  m_PrefabAsset: {fileID: 0}
  m_GameObject: {fileID: 1000013417806422}
  m_LocalRotation: {x: 0, y: 0, z: 0, w: 1}
  m_LocalPosition: {x: 0, y: 0, z: 0}
  m_LocalScale: {x: 1, y: 1, z: 1}
  m_Children: []
  m_Father: {fileID: 0}
  m_RootOrder: 0
  m_LocalEulerAnglesHint: {x: 0, y: 0, z: 0}
--- !u!114 &114000011734215162
MonoBehaviour:
  m_ObjectHideFlags: 0
  m_CorrespondingSourceObject: {fileID: 0}
  m_PrefabInstance: {fileID: 0}
  m_PrefabAsset: {fileID: 0}
  m_GameObject: {fileID: 1000013417806422}
  m_Enabled: 1
  m_EditorHideFlags: 0
  m_Script: {fileID: 11500000, guid: 4d0c51bb0b6e93049af5e88f93826e3b, type: 3}
  m_Name: 
  m_EditorClassIdentifier: 
  material: {fileID: 2100000, guid: 95bec55ce5364c4418f26a180300f3ac, type: 2}
  mSprites:
  - name: bg_shenfudiban
    x: 918
    y: 743
    width: 77
    height: 97
    borderLeft: 20
    borderRight: 20
    borderTop: 20
    borderBottom: 20
    paddingLeft: 0
    paddingRight: 0
    paddingTop: 0
    paddingBottom: 0
  - name: bg_wuguan_1
    x: 318
    y: 425
    width: 177
    height: 237
    borderLeft: 0
    borderRight: 0
    borderTop: 0
    borderBottom: 0
    paddingLeft: 16
    paddingRight: 16
    paddingTop: 5
    paddingBottom: 4
  - name: bg_wuguan_2
    x: 496
    y: 425
    width: 177
    height: 237
    borderLeft: 0
    borderRight: 0
    borderTop: 0
    borderBottom: 0
    paddingLeft: 16
    paddingRight: 16
    paddingTop: 5
    paddingBottom: 4
  - name: bg_wuguan_3
    x: 738
    y: 543
    width: 179
    height: 240
    borderLeft: 0
    borderRight: 0
    borderTop: 0
    borderBottom: 0
    paddingLeft: 15
    paddingRight: 15
    paddingTop: 3
    paddingBottom: 3
  - name: bg_wuguan_4
    x: 714
    y: 784
    width: 196
    height: 240
    borderLeft: 0
    borderRight: 0
    borderTop: 0
    borderBottom: 0
    paddingLeft: 7
    paddingRight: 6
    paddingTop: 3
    paddingBottom: 3
  - name: bg_wuguan_5
    x: 515
    y: 785
    width: 198
    height: 239
    borderLeft: 0
    borderRight: 0
    borderTop: 0
    borderBottom: 0
    paddingLeft: 6
    paddingRight: 5
    paddingTop: 4
    paddingBottom: 3
  - name: bg_wuguan_6
    x: 305
    y: 778
    width: 209
    height: 246
    borderLeft: 0
    borderRight: 0
    borderTop: 0
    borderBottom: 0
    paddingLeft: 0
    paddingRight: 0
    paddingTop: 0
    paddingBottom: 0
  - name: btn_fenxiang
    x: 955
    y: 241
    width: 54
    height: 54
    borderLeft: 0
    borderRight: 0
    borderTop: 0
    borderBottom: 0
    paddingLeft: 0
    paddingRight: 0
    paddingTop: 0
    paddingBottom: 0
  - name: btn_guanzhan
    x: 674
    y: 557
    width: 54
    height: 54
    borderLeft: 0
    borderRight: 0
    borderTop: 0
    borderBottom: 0
    paddingLeft: 0
    paddingRight: 0
    paddingTop: 0
    paddingBottom: 0
  - name: btn_zhanji
    x: 923
    y: 359
    width: 90
    height: 84
    borderLeft: 0
    borderRight: 0
    borderTop: 0
    borderBottom: 0
    paddingLeft: 0
    paddingRight: 0
    paddingTop: 0
    paddingBottom: 0
  - name: pic_fengexian
    x: 236
    y: 300
    width: 26
    height: 2
    borderLeft: 0
    borderRight: 0
    borderTop: 0
    borderBottom: 0
    paddingLeft: 0
    paddingRight: 0
    paddingTop: 0
    paddingBottom: 0
  - name: pic_guanmingchendi
    x: 707
    y: 252
    width: 176
    height: 43
    borderLeft: 0
    borderRight: 0
    borderTop: 0
    borderBottom: 0
    paddingLeft: 0
    paddingRight: 0
    paddingTop: 0
    paddingBottom: 0
  - name: pic_guanzhu
    x: 911
    y: 841
    width: 99
    height: 91
    borderLeft: 0
    borderRight: 0
    borderTop: 0
    borderBottom: 0
    paddingLeft: 0
    paddingRight: 0
    paddingTop: 0
    paddingBottom: 24
  - name: pic_guanzhumingzidi
    x: 674
    y: 500
    width: 287
    height: 42
    borderLeft: 0
    borderRight: 0
    borderTop: 0
    borderBottom: 0
    paddingLeft: 2
    paddingRight: 1
    paddingTop: 0
    paddingBottom: 2
  - name: pic_heisemengban
    x: 1010
    y: 160
    width: 10
    height: 152
    borderLeft: 0
    borderRight: 0
    borderTop: 0
    borderBottom: 0
    paddingLeft: 0
    paddingRight: 0
    paddingTop: 0
    paddingBottom: 0
  - name: pic_lansefenge
    x: 0
    y: 661
    width: 304
    height: 363
    borderLeft: 0
    borderRight: 0
    borderTop: 0
    borderBottom: 0
    paddingLeft: 0
    paddingRight: 0
    paddingTop: 0
    paddingBottom: 0
  - name: pic_putongdi_1
    x: 741
    y: 296
    width: 235
    height: 43
    borderLeft: 0
    borderRight: 0
    borderTop: 0
    borderBottom: 0
    paddingLeft: 1
    paddingRight: 0
    paddingTop: 0
    paddingBottom: 0
  - name: pic_putongdi_2
    x: 0
    y: 215
    width: 235
    height: 43
    borderLeft: 0
    borderRight: 0
    borderTop: 0
    borderBottom: 0
    paddingLeft: 1
    paddingRight: 0
    paddingTop: 0
    paddingBottom: 0
  - name: pic_putongdi_3
    x: 505
    y: 296
    width: 235
    height: 43
    borderLeft: 0
    borderRight: 0
    borderTop: 0
    borderBottom: 0
    paddingLeft: 1
    paddingRight: 0
    paddingTop: 0
    paddingBottom: 0
  - name: pic_putongdi_4
    x: 236
    y: 253
    width: 235
    height: 43
    borderLeft: 0
    borderRight: 0
    borderTop: 0
    borderBottom: 0
    paddingLeft: 1
    paddingRight: 0
    paddingTop: 0
    paddingBottom: 0
  - name: pic_putongdi_5
    x: 269
    y: 297
    width: 235
    height: 43
    borderLeft: 0
    borderRight: 0
    borderTop: 0
    borderBottom: 0
    paddingLeft: 1
    paddingRight: 0
    paddingTop: 0
    paddingBottom: 0
  - name: pic_putongdi_6
    x: 0
    y: 259
    width: 235
    height: 43
    borderLeft: 0
    borderRight: 0
    borderTop: 0
    borderBottom: 0
    paddingLeft: 1
    paddingRight: 0
    paddingTop: 0
    paddingBottom: 0
  - name: pic_result_pingju
    x: 905
    y: 340
    width: 66
    height: 18
    borderLeft: 0
    borderRight: 0
    borderTop: 0
    borderBottom: 0
    paddingLeft: 0
    paddingRight: 0
    paddingTop: 0
    paddingBottom: 0
  - name: pic_result_shangsheng
    x: 884
    y: 243
    width: 70
    height: 52
    borderLeft: 0
    borderRight: 0
    borderTop: 0
    borderBottom: 0
    paddingLeft: 0
    paddingRight: 0
    paddingTop: 0
    paddingBottom: 0
  - name: pic_result_shibaidiwen
    x: 807
    y: 340
    width: 97
    height: 18
    borderLeft: 0
    borderRight: 0
    borderTop: 0
    borderBottom: 0
    paddingLeft: 0
    paddingRight: 0
    paddingTop: 0
    paddingBottom: 0
  - name: pic_result_tishidiwen
    x: 305
    y: 663
    width: 432
    height: 114
    borderLeft: 50
    borderRight: 50
    borderTop: 0
    borderBottom: 0
    paddingLeft: 0
    paddingRight: 0
    paddingTop: 0
    paddingBottom: 0
  - name: pic_result_xiajiang
    x: 674
    y: 612
    width: 63
    height: 50
    borderLeft: 0
    borderRight: 0
    borderTop: 0
    borderBottom: 0
    paddingLeft: 0
    paddingRight: 7
    paddingTop: 1
    paddingBottom: 1
  - name: pic_result_xinguanzhu
    x: 911
    y: 933
    width: 108
    height: 91
    borderLeft: 0
    borderRight: 0
    borderTop: 0
    borderBottom: 0
    paddingLeft: 0
    paddingRight: 12
    paddingTop: 6
    paddingBottom: 24
  - name: pic_shangsheng
    x: 962
    y: 503
    width: 37
    height: 45
    borderLeft: 0
    borderRight: 0
    borderTop: 0
    borderBottom: 0
    paddingLeft: 0
    paddingRight: 1
    paddingTop: 0
    paddingBottom: 5
  - name: pic_shengli
    x: 918
    y: 549
    width: 71
    height: 95
    borderLeft: 0
    borderRight: 0
    borderTop: 0
    borderBottom: 0
    paddingLeft: 0
    paddingRight: 0
    paddingTop: 1
    paddingBottom: 1
  - name: pic_shibai
    x: 918
    y: 645
    width: 71
    height: 97
    borderLeft: 0
    borderRight: 0
    borderTop: 0
    borderBottom: 0
    paddingLeft: 0
    paddingRight: 0
    paddingTop: 0
    paddingBottom: 0
  - name: pic_wanjiaxinxidi
    x: 674
    y: 424
    width: 153
    height: 75
    borderLeft: 0
    borderRight: 0
    borderTop: 0
    borderBottom: 0
    paddingLeft: 0
    paddingRight: 0
    paddingTop: 0
    paddingBottom: 0
  - name: pic_wuguanbeijingguang
    x: 0
    y: 425
    width: 317
    height: 235
    borderLeft: 0
    borderRight: 0
    borderTop: 0
    borderBottom: 0
    paddingLeft: 0
    paddingRight: 0
    paddingTop: 0
    paddingBottom: 0
  - name: pic_wuguanxinxidi
    x: 0
    y: 387
    width: 384
    height: 37
    borderLeft: 40
    borderRight: 40
    borderTop: 30
    borderBottom: 30
    paddingLeft: 0
    paddingRight: 0
    paddingTop: 0
    paddingBottom: 0
  - name: pic_xiajiang
    x: 977
    y: 313
    width: 37
    height: 45
    borderLeft: 0
    borderRight: 0
    borderTop: 0
    borderBottom: 0
    paddingLeft: 1
    paddingRight: 0
    paddingTop: 5
    paddingBottom: 0
  - name: pic_zhanlidiwen
    x: 472
    y: 260
    width: 234
    height: 35
    borderLeft: 0
    borderRight: 0
    borderTop: 0
    borderBottom: 0
    paddingLeft: 0
    paddingRight: 0
    paddingTop: 0
    paddingBottom: 0
  - name: pic_zhanlitubiao
    x: 981
    y: 477
    width: 26
    height: 25
    borderLeft: 0
    borderRight: 0
    borderTop: 0
    borderBottom: 0
    paddingLeft: 2
    paddingRight: 2
    paddingTop: 2
    paddingBottom: 2
  - name: pic_zuoyouanniu
    x: 828
    y: 444
    width: 152
    height: 55
    borderLeft: 0
    borderRight: 0
    borderTop: 0
    borderBottom: 0
    paddingLeft: 0
    paddingRight: 0
    paddingTop: 0
    paddingBottom: 0
  - name: text_suozaiguan_1
    x: 538
    y: 340
    width: 268
    height: 41
    borderLeft: 0
    borderRight: 0
    borderTop: 0
    borderBottom: 0
    paddingLeft: 0
    paddingRight: 0
    paddingTop: 0
    paddingBottom: 0
  - name: text_suozaiguan_2
    x: 0
    y: 345
    width: 268
    height: 41
    borderLeft: 0
    borderRight: 0
    borderTop: 0
    borderBottom: 0
    paddingLeft: 0
    paddingRight: 0
    paddingTop: 0
    paddingBottom: 0
  - name: text_suozaiguan_3
    x: 385
    y: 383
    width: 268
    height: 41
    borderLeft: 0
    borderRight: 0
    borderTop: 0
    borderBottom: 0
    paddingLeft: 0
    paddingRight: 0
    paddingTop: 0
    paddingBottom: 0
  - name: text_suozaiguan_4
    x: 269
    y: 341
    width: 268
    height: 41
    borderLeft: 0
    borderRight: 0
    borderTop: 0
    borderBottom: 0
    paddingLeft: 0
    paddingRight: 0
    paddingTop: 0
    paddingBottom: 0
  - name: text_suozaiguan_5
    x: 0
    y: 303
    width: 268
    height: 41
    borderLeft: 0
    borderRight: 0
    borderTop: 0
    borderBottom: 0
    paddingLeft: 0
    paddingRight: 0
    paddingTop: 0
    paddingBottom: 0
  - name: text_suozaiguan_6
    x: 654
    y: 382
    width: 268
    height: 41
    borderLeft: 0
    borderRight: 0
    borderTop: 0
    borderBottom: 0
    paddingLeft: 0
    paddingRight: 0
    paddingTop: 0
    paddingBottom: 0
  - name: text_wuguantiaozhan
    x: 472
    y: 213
    width: 69
    height: 46
    borderLeft: 0
    borderRight: 0
    borderTop: 0
    borderBottom: 0
    paddingLeft: 67
    paddingRight: 62
    paddingTop: 14
    paddingBottom: 21
  mPixelSize: 1
  mReplacement: {fileID: 0}
  mCoordinates: 0
  sprites: []
