%YAML 1.1
%TAG !u! tag:unity3d.com,2011:
--- !u!221 &22100000
AnimatorOverrideController:
  m_ObjectHideFlags: 0
  m_PrefabParentObject: {fileID: 0}
  m_PrefabInternal: {fileID: 0}
  m_Name: Animator13012
  m_Controller: {fileID: 9100000, guid: 217e3c3e719851a47b0ee794c54d3908, type: 2}
  m_Clips:
  - m_OriginalClip: {fileID: 7400000, guid: a7a271524f41dfa49b5bd4f3d466da7b, type: 2}
    m_OverrideClip: {fileID: 7400000, guid: a7a271524f41dfa49b5bd4f3d466da7b, type: 2}
  - m_OriginalClip: {fileID: 7400000, guid: c599e063fc13b024daa36b49b8f466ef, type: 2}
    m_OverrideClip: {fileID: 0}
  - m_OriginalClip: {fileID: 7400000, guid: cd8254bfe0c0ea142acb97c0b094903a, type: 2}
    m_OverrideClip: {fileID: 7400000, guid: cd8254bfe0c0ea142acb97c0b094903a, type: 2}
  - m_OriginalClip: {fileID: 7400000, guid: 1f7eba713d48b7a47bc0d403b1609ed0, type: 2}
    m_OverrideClip: {fileID: 0}
  - m_OriginalClip: {fileID: 7400000, guid: eab1c68c98c7a9147be3e794acaa2b6e, type: 2}
    m_OverrideClip: {fileID: 0}
  - m_OriginalClip: {fileID: 7400000, guid: c49b092e9c3e0d142aa49fe6862e8351, type: 2}
    m_OverrideClip: {fileID: 0}
  - m_OriginalClip: {fileID: 7400000, guid: f2154b87d6362214d937b82910d5725a, type: 2}
    m_OverrideClip: {fileID: 0}
  - m_OriginalClip: {fileID: 7400000, guid: e1ae3f505a5dbf145ace35bd10537c0d, type: 2}
    m_OverrideClip: {fileID: 0}
  - m_OriginalClip: {fileID: 7400000, guid: 9c1cc5ed1a2078941b1fdbf3d30db798, type: 2}
    m_OverrideClip: {fileID: 0}
  - m_OriginalClip: {fileID: 7400000, guid: cd2ed5bc3c48d7b428a6f75c470aa466, type: 2}
    m_OverrideClip: {fileID: 0}
  - m_OriginalClip: {fileID: 7400000, guid: 2ac17f9a6e4453f409641044fb2bf046, type: 2}
    m_OverrideClip: {fileID: 0}
  - m_OriginalClip: {fileID: 7400000, guid: e8ec6e8376b586740bd5608e2a8e0475, type: 2}
    m_OverrideClip: {fileID: 0}
  - m_OriginalClip: {fileID: 7400000, guid: 73458c8b2c4c8be47a56ef5d4081b283, type: 2}
    m_OverrideClip: {fileID: 0}
  - m_OriginalClip: {fileID: 7400000, guid: e93e49eabe566be4c9741c1fc4f5c874, type: 2}
    m_OverrideClip: {fileID: 0}
  - m_OriginalClip: {fileID: 7400000, guid: 975546f4fa5f811408bbbb9ad7ae1f26, type: 2}
    m_OverrideClip: {fileID: 0}
  - m_OriginalClip: {fileID: 7400000, guid: 5ef5d11e3bb950b409644ee7db5d1971, type: 2}
    m_OverrideClip: {fileID: 0}
  - m_OriginalClip: {fileID: 7400000, guid: ca181e8542f51a342bfe2be7af2c3cc1, type: 2}
    m_OverrideClip: {fileID: 0}
  - m_OriginalClip: {fileID: 7400000, guid: d51e0dda713b96044adc09e480e2beed, type: 2}
    m_OverrideClip: {fileID: 0}
  - m_OriginalClip: {fileID: 7400000, guid: 02c8698732fc07143b677466bbf0cc14, type: 2}
    m_OverrideClip: {fileID: 0}
  - m_OriginalClip: {fileID: 7400000, guid: 8de2f4d5fa2041a4c91193181ebed747, type: 2}
    m_OverrideClip: {fileID: 0}
  - m_OriginalClip: {fileID: 7400000, guid: 266e85a296753f94cbfcadb1ec69cbb8, type: 2}
    m_OverrideClip: {fileID: 7400000, guid: 266e85a296753f94cbfcadb1ec69cbb8, type: 2}
  - m_OriginalClip: {fileID: 7400000, guid: 46e87f9258f22f74eab998f8f1ab1364, type: 2}
    m_OverrideClip: {fileID: 0}
  - m_OriginalClip: {fileID: 7400000, guid: 8e60b581b7a11284bb0d7ebbea3bd425, type: 2}
    m_OverrideClip: {fileID: 0}
  - m_OriginalClip: {fileID: 7400000, guid: a91e86c0d61166d4fb2c03c09892cf30, type: 2}
    m_OverrideClip: {fileID: 0}
  - m_OriginalClip: {fileID: 7400000, guid: 2d0bde7f0a4387c40b7cfd87935d2c45, type: 2}
    m_OverrideClip: {fileID: 0}
  - m_OriginalClip: {fileID: 7400000, guid: bb34a7db82b887d43b7047b8072895e4, type: 2}
    m_OverrideClip: {fileID: 0}
  - m_OriginalClip: {fileID: 7400000, guid: c2c625e80910a2942959b5b281fffd23, type: 2}
    m_OverrideClip: {fileID: 0}
  - m_OriginalClip: {fileID: 7400000, guid: 467d982598c9c71408acbbe06cb52e9c, type: 2}
    m_OverrideClip: {fileID: 0}
  - m_OriginalClip: {fileID: 7400000, guid: 714cd113f30962e4da686bbf58ec753e, type: 2}
    m_OverrideClip: {fileID: 0}
  - m_OriginalClip: {fileID: 7400000, guid: ef5353cfcef96cf4284a5c62bd94f373, type: 2}
    m_OverrideClip: {fileID: 0}
  - m_OriginalClip: {fileID: 7400000, guid: f1dc6c9bcc0d8174487c154745958f7c, type: 2}
    m_OverrideClip: {fileID: 0}
  - m_OriginalClip: {fileID: 7400000, guid: 622a538366e43ca408c55cb3fed0f411, type: 2}
    m_OverrideClip: {fileID: 0}
  - m_OriginalClip: {fileID: 7400000, guid: e78110c57a2d2004699b0281637250a7, type: 2}
    m_OverrideClip: {fileID: 0}
  - m_OriginalClip: {fileID: 7400000, guid: 71935265890590d4bbdc54d3817fc12b, type: 2}
    m_OverrideClip: {fileID: 0}
  - m_OriginalClip: {fileID: 7400000, guid: 2686e910eb7e27d4b86797efd21db0af, type: 2}
    m_OverrideClip: {fileID: 0}
  - m_OriginalClip: {fileID: 7400000, guid: e4a01950541005b4183b20c3a1dc32fe, type: 2}
    m_OverrideClip: {fileID: 0}
  - m_OriginalClip: {fileID: 7400000, guid: da4aff3f189b039469341c3b176e74b4, type: 2}
    m_OverrideClip: {fileID: 0}
  - m_OriginalClip: {fileID: 7400000, guid: c30bc07a2077fd345b8536e51ca95aa5, type: 2}
    m_OverrideClip: {fileID: 0}
  - m_OriginalClip: {fileID: 7400000, guid: bb92d4e7e815aab43b6110555d0602f3, type: 2}
    m_OverrideClip: {fileID: 0}
  - m_OriginalClip: {fileID: 7400000, guid: 60783e27b0b650148a75b4b1017457cd, type: 2}
    m_OverrideClip: {fileID: 0}
  - m_OriginalClip: {fileID: 7400000, guid: d5d7ecb944b97774095008bcdf77fed6, type: 2}
    m_OverrideClip: {fileID: 0}
  - m_OriginalClip: {fileID: 7400000, guid: c4946c6c1c2d1b44da57c5c91be4b7b1, type: 2}
    m_OverrideClip: {fileID: 0}
  - m_OriginalClip: {fileID: 7400000, guid: 579d0f03494999c45b34f6ebbcf63556, type: 2}
    m_OverrideClip: {fileID: 0}
  - m_OriginalClip: {fileID: 7400000, guid: be0b4a2537d41a94b9948ea7f00de4c1, type: 2}
    m_OverrideClip: {fileID: 0}
  - m_OriginalClip: {fileID: 7400000, guid: f7bd9b421013a0341992ba82b0bc3eff, type: 2}
    m_OverrideClip: {fileID: 0}
  - m_OriginalClip: {fileID: 7400000, guid: d5cac5f5ca6efa14f8054784bb171a17, type: 2}
    m_OverrideClip: {fileID: 0}
  - m_OriginalClip: {fileID: 7400000, guid: 26ade4ba8e058934290c5bbff23f3a00, type: 2}
    m_OverrideClip: {fileID: 0}
  - m_OriginalClip: {fileID: 7400000, guid: 3544299663a9f9540bd6431f8a080737, type: 2}
    m_OverrideClip: {fileID: 0}
  - m_OriginalClip: {fileID: 7400000, guid: 9e6c50c08bfdaf146a9e58fca8180b61, type: 2}
    m_OverrideClip: {fileID: 0}
  - m_OriginalClip: {fileID: 7400000, guid: 3f512d6c8c559bd429bb72fa242ec44f, type: 2}
    m_OverrideClip: {fileID: 0}
  - m_OriginalClip: {fileID: 7400000, guid: d62a7e87a06fa474996b573c4f98377f, type: 2}
    m_OverrideClip: {fileID: 0}
  - m_OriginalClip: {fileID: 7400000, guid: 834e2ceb601ab9c429ef56bdcf5373e7, type: 2}
    m_OverrideClip: {fileID: 0}
  - m_OriginalClip: {fileID: 7400000, guid: 56c1bd3d0861725418aacceb966f46d5, type: 2}
    m_OverrideClip: {fileID: 0}
  - m_OriginalClip: {fileID: 7400000, guid: 5f377cb31944f6d40b04cc28afb7d620, type: 2}
    m_OverrideClip: {fileID: 0}
