%YAML 1.1
%TAG !u! tag:unity3d.com,2011:
--- !u!74 &7400000
AnimationClip:
  m_ObjectHideFlags: 0
  m_PrefabParentObject: {fileID: 0}
  m_PrefabInternal: {fileID: 0}
  m_Name: 406_attack1
  serializedVersion: 6
  m_Legacy: 0
  m_Compressed: 0
  m_UseHighQualityCurve: 1
  m_RotationCurves:
  - curve:
      serializedVersion: 2
      m_Curve:
      - time: 0
        value: {x: 0.184, y: 0.184, z: 0.683, w: 0.683}
        inSlope: {x: 0, y: 0, z: 0, w: 0}
        outSlope: {x: 0, y: 0, z: 0, w: 0}
        tangentMode: 0
      - time: 1.3333334
        value: {x: 0.184, y: 0.184, z: 0.683, w: 0.683}
        inSlope: {x: 0, y: 0, z: 0, w: 0}
        outSlope: {x: 0, y: 0, z: 0, w: 0}
        tangentMode: 0
      m_PreInfinity: 2
      m_PostInfinity: 2
      m_RotationOrder: 4
    path: Bone054
  - curve:
      serializedVersion: 2
      m_Curve:
      - time: 0
        value: {x: 0.002, y: -0.002, z: -0.708, w: 0.706}
        inSlope: {x: -0.059, y: 0.06, z: 0.035, w: 0.035}
        outSlope: {x: -0.059, y: 0.06, z: 0.035, w: 0.035}
        tangentMode: 0
      - time: 0.4666667
        value: {x: 0, y: 0, z: -0.723, w: 0.691}
        inSlope: {x: 0, y: 0, z: -0.03, w: -0.031}
        outSlope: {x: 0, y: 0, z: -0.03, w: -0.031}
        tangentMode: 0
      - time: 0.90000004
        value: {x: 0, y: 0, z: -0.71, w: 0.705}
        inSlope: {x: 0, y: 0, z: 0.081, w: 0.082}
        outSlope: {x: 0, y: 0, z: 0.081, w: 0.082}
        tangentMode: 0
      - time: 0.9333334
        value: {x: 0, y: 0, z: -0.707, w: 0.707}
        inSlope: {x: 0, y: 0, z: 0.296, w: 0.29}
        outSlope: {x: 0, y: 0, z: 0.296, w: 0.29}
        tangentMode: 0
      - time: 0.9666667
        value: {x: 0, y: 0, z: -0.69, w: 0.724}
        inSlope: {x: 0, y: 0, z: 0.235, w: 0.229}
        outSlope: {x: 0, y: 0, z: 0.235, w: 0.229}
        tangentMode: 0
      - time: 1.0333334
        value: {x: 0, y: 0, z: -0.695, w: 0.719}
        inSlope: {x: 0, y: 0, z: -0.134, w: -0.13}
        outSlope: {x: 0, y: 0, z: -0.134, w: -0.13}
        tangentMode: 0
      - time: 1.2666668
        value: {x: 0, y: 0, z: -0.758, w: 0.653}
        inSlope: {x: 0, y: 0, z: -0.23, w: -0.266}
        outSlope: {x: 0, y: 0, z: -0.23, w: -0.266}
        tangentMode: 0
      - time: 1.3333334
        value: {x: 0, y: 0, z: -0.766, w: 0.643}
        inSlope: {x: 0, y: 0, z: -0.07, w: -0.083}
        outSlope: {x: 0, y: 0, z: -0.07, w: -0.083}
        tangentMode: 0
      m_PreInfinity: 2
      m_PostInfinity: 2
      m_RotationOrder: 4
    path: Bone054/Bone048
  - curve:
      serializedVersion: 2
      m_Curve:
      - time: 0
        value: {x: -0.177, y: -0.177, z: -0.685, w: 0.685}
        inSlope: {x: 0, y: 0, z: 0, w: 0}
        outSlope: {x: 0, y: 0, z: 0, w: 0}
        tangentMode: 0
      - time: 1.3333334
        value: {x: -0.177, y: -0.177, z: -0.685, w: 0.685}
        inSlope: {x: 0, y: 0, z: 0, w: 0}
        outSlope: {x: 0, y: 0, z: 0, w: 0}
        tangentMode: 0
      m_PreInfinity: 2
      m_PostInfinity: 2
      m_RotationOrder: 4
    path: Bone054/Bone043
  - curve:
      serializedVersion: 2
      m_Curve:
      - time: 0
        value: {x: -0.134, y: -0.229, z: -0.669, w: 0.694}
        inSlope: {x: 0, y: 0, z: 0, w: 0}
        outSlope: {x: 0, y: 0, z: 0, w: 0}
        tangentMode: 0
      - time: 1.3333334
        value: {x: -0.134, y: -0.229, z: -0.669, w: 0.694}
        inSlope: {x: 0, y: 0, z: 0, w: 0}
        outSlope: {x: 0, y: 0, z: 0, w: 0}
        tangentMode: 0
      m_PreInfinity: 2
      m_PostInfinity: 2
      m_RotationOrder: 4
    path: Bone054/Bone040
  m_CompressedRotationCurves: []
  m_EulerCurves: []
  m_PositionCurves:
  - curve:
      serializedVersion: 2
      m_Curve:
      - time: 0
        value: {x: 0, y: 0.124, z: 0}
        inSlope: {x: 0, y: 0, z: 0}
        outSlope: {x: 0, y: 0, z: 0}
        tangentMode: 0
      - time: 1.3333334
        value: {x: 0, y: 0.124, z: 0}
        inSlope: {x: 0, y: 0, z: 0}
        outSlope: {x: 0, y: 0, z: 0}
        tangentMode: 0
      m_PreInfinity: 2
      m_PostInfinity: 2
      m_RotationOrder: 4
    path: Bone054
  - curve:
      serializedVersion: 2
      m_Curve:
      - time: 0
        value: {x: 0.266, y: -0.396, z: 0}
        inSlope: {x: 0, y: 0, z: 0}
        outSlope: {x: 0, y: 0, z: 0}
        tangentMode: 0
      - time: 0.033333335
        value: {x: 0.266, y: -0.396, z: 0}
        inSlope: {x: 0, y: 0, z: 0}
        outSlope: {x: 0, y: 0, z: 0}
        tangentMode: 0
      - time: 0.56666666
        value: {x: 0.266, y: -0.422, z: 0.015}
        inSlope: {x: 0, y: 0, z: 0}
        outSlope: {x: 0, y: 0, z: 0}
        tangentMode: 0
      - time: 0.93333334
        value: {x: 0.266, y: -0.396, z: 0}
        inSlope: {x: 0, y: 0, z: 0}
        outSlope: {x: 0, y: 0, z: 0}
        tangentMode: 0
      - time: 1.2666668
        value: {x: 0.266, y: -0.396, z: 0}
        inSlope: {x: 0, y: 0, z: 0}
        outSlope: {x: 0, y: 0, z: 0}
        tangentMode: 0
      - time: 1.3333334
        value: {x: 0.266, y: -0.396, z: 0}
        inSlope: {x: 0, y: 0, z: 0}
        outSlope: {x: 0, y: 0, z: 0}
        tangentMode: 0
      m_PreInfinity: 2
      m_PostInfinity: 2
      m_RotationOrder: 4
    path: Bone054/Bone048
  - curve:
      serializedVersion: 2
      m_Curve:
      - time: 0
        value: {x: 0.409, y: -1.14, z: -0.023}
        inSlope: {x: 0, y: 0, z: 0}
        outSlope: {x: 0, y: 0, z: 0}
        tangentMode: 0
      - time: 0.13333334
        value: {x: 0.416, y: -1.138, z: -0.023}
        inSlope: {x: 0.053, y: -0.002, z: 0.001}
        outSlope: {x: 0.053, y: -0.002, z: 0.001}
        tangentMode: 0
      - time: 0.73333335
        value: {x: 0.424, y: -1.139, z: -0.022}
        inSlope: {x: -0.045, y: 0.002, z: -0.001}
        outSlope: {x: -0.045, y: 0.002, z: -0.001}
        tangentMode: 0
      - time: 1.2666668
        value: {x: 0.411, y: -1.138, z: -0.023}
        inSlope: {x: 0, y: 0, z: 0}
        outSlope: {x: 0, y: 0, z: 0}
        tangentMode: 0
      - time: 1.3333334
        value: {x: 0.411, y: -1.138, z: -0.023}
        inSlope: {x: 0, y: 0, z: 0}
        outSlope: {x: 0, y: 0, z: 0}
        tangentMode: 0
      m_PreInfinity: 2
      m_PostInfinity: 2
      m_RotationOrder: 4
    path: Bone054/Bone043
  - curve:
      serializedVersion: 2
      m_Curve:
      - time: 0
        value: {x: 0.063, y: 0.312, z: 0.242}
        inSlope: {x: 0, y: 0, z: 0}
        outSlope: {x: 0, y: 0, z: 0}
        tangentMode: 0
      - time: 0.033333335
        value: {x: 0.064, y: 0.308, z: 0.242}
        inSlope: {x: 0, y: 0, z: 0}
        outSlope: {x: 0, y: 0, z: 0}
        tangentMode: 0
      - time: 0.70000005
        value: {x: 0.064, y: 0.349, z: 0.219}
        inSlope: {x: 0, y: -0.088, z: 0.051}
        outSlope: {x: 0, y: -0.088, z: 0.051}
        tangentMode: 0
      - time: 1.1
        value: {x: 0.064, y: 0.308, z: 0.242}
        inSlope: {x: 0, y: 0, z: 0}
        outSlope: {x: 0, y: 0, z: 0}
        tangentMode: 0
      - time: 1.3333334
        value: {x: 0.064, y: 0.308, z: 0.242}
        inSlope: {x: 0, y: 0, z: 0}
        outSlope: {x: 0, y: 0, z: 0}
        tangentMode: 0
      m_PreInfinity: 2
      m_PostInfinity: 2
      m_RotationOrder: 4
    path: Bone054/Bone040
  m_ScaleCurves:
  - curve:
      serializedVersion: 2
      m_Curve:
      - time: 0
        value: {x: 1, y: 1, z: 1}
        inSlope: {x: 0, y: 0, z: 0}
        outSlope: {x: 0, y: 0, z: 0}
        tangentMode: 0
      - time: 1.3333334
        value: {x: 1, y: 1, z: 1}
        inSlope: {x: 0, y: 0, z: 0}
        outSlope: {x: 0, y: 0, z: 0}
        tangentMode: 0
      m_PreInfinity: 2
      m_PostInfinity: 2
      m_RotationOrder: 4
    path: Bone054
  - curve:
      serializedVersion: 2
      m_Curve:
      - time: 0
        value: {x: 1, y: 1, z: 1}
        inSlope: {x: 0, y: 0, z: 0}
        outSlope: {x: 0, y: 0, z: 0}
        tangentMode: 0
      - time: 1.3333334
        value: {x: 1, y: 1, z: 1}
        inSlope: {x: 0, y: 0, z: 0}
        outSlope: {x: 0, y: 0, z: 0}
        tangentMode: 0
      m_PreInfinity: 2
      m_PostInfinity: 2
      m_RotationOrder: 4
    path: Bone054/Bone048
  - curve:
      serializedVersion: 2
      m_Curve:
      - time: 0
        value: {x: 1, y: 1, z: 1}
        inSlope: {x: 0, y: 0, z: 0}
        outSlope: {x: 0, y: 0, z: 0}
        tangentMode: 0
      - time: 1.3333334
        value: {x: 1, y: 1, z: 1}
        inSlope: {x: 0, y: 0, z: 0}
        outSlope: {x: 0, y: 0, z: 0}
        tangentMode: 0
      m_PreInfinity: 2
      m_PostInfinity: 2
      m_RotationOrder: 4
    path: Bone054/Bone043
  - curve:
      serializedVersion: 2
      m_Curve:
      - time: 0
        value: {x: 1, y: 1, z: 1}
        inSlope: {x: 0, y: 0, z: 0}
        outSlope: {x: 0, y: 0, z: 0}
        tangentMode: 0
      - time: 1.3333334
        value: {x: 1, y: 1, z: 1}
        inSlope: {x: 0, y: 0, z: 0}
        outSlope: {x: 0, y: 0, z: 0}
        tangentMode: 0
      m_PreInfinity: 2
      m_PostInfinity: 2
      m_RotationOrder: 4
    path: Bone054/Bone040
  m_FloatCurves: []
  m_PPtrCurves: []
  m_SampleRate: 30
  m_WrapMode: 0
  m_Bounds:
    m_Center: {x: 0, y: 0, z: 0}
    m_Extent: {x: 0, y: 0, z: 0}
  m_ClipBindingConstant:
    genericBindings:
    - path: 1773626717
      attribute: 1
      script: {fileID: 0}
      classID: 4
      customType: 0
      isPPtrCurve: 0
    - path: 4268080341
      attribute: 1
      script: {fileID: 0}
      classID: 4
      customType: 0
      isPPtrCurve: 0
    - path: 1735191919
      attribute: 1
      script: {fileID: 0}
      classID: 4
      customType: 0
      isPPtrCurve: 0
    - path: 1773626717
      attribute: 2
      script: {fileID: 0}
      classID: 4
      customType: 0
      isPPtrCurve: 0
    - path: 978197295
      attribute: 1
      script: {fileID: 0}
      classID: 4
      customType: 0
      isPPtrCurve: 0
    - path: 978197295
      attribute: 2
      script: {fileID: 0}
      classID: 4
      customType: 0
      isPPtrCurve: 0
    - path: 4268080341
      attribute: 2
      script: {fileID: 0}
      classID: 4
      customType: 0
      isPPtrCurve: 0
    - path: 1735191919
      attribute: 2
      script: {fileID: 0}
      classID: 4
      customType: 0
      isPPtrCurve: 0
    - path: 978197295
      attribute: 3
      script: {fileID: 0}
      classID: 4
      customType: 0
      isPPtrCurve: 0
    - path: 1773626717
      attribute: 3
      script: {fileID: 0}
      classID: 4
      customType: 0
      isPPtrCurve: 0
    - path: 4268080341
      attribute: 3
      script: {fileID: 0}
      classID: 4
      customType: 0
      isPPtrCurve: 0
    - path: 1735191919
      attribute: 3
      script: {fileID: 0}
      classID: 4
      customType: 0
      isPPtrCurve: 0
    pptrCurveMapping: []
  m_AnimationClipSettings:
    serializedVersion: 2
    m_AdditiveReferencePoseClip: {fileID: 0}
    m_AdditiveReferencePoseTime: 0
    m_StartTime: 0
    m_StopTime: 1.3333334
    m_OrientationOffsetY: 0
    m_Level: 0
    m_CycleOffset: 0
    m_HasAdditiveReferencePose: 0
    m_LoopTime: 0
    m_LoopBlend: 0
    m_LoopBlendOrientation: 0
    m_LoopBlendPositionY: 0
    m_LoopBlendPositionXZ: 0
    m_KeepOriginalOrientation: 0
    m_KeepOriginalPositionY: 1
    m_KeepOriginalPositionXZ: 0
    m_HeightFromFeet: 0
    m_Mirror: 0
  m_EditorCurves: []
  m_EulerEditorCurves: []
  m_HasGenericRootTransform: 0
  m_HasMotionFloatCurves: 0
  m_GenerateMotionCurves: 0
  m_Events: []
