%YAML 1.1
%TAG !u! tag:unity3d.com,2011:
--- !u!1 &1000010143003082
GameObject:
  m_ObjectHideFlags: 0
  m_CorrespondingSourceObject: {fileID: 0}
  m_PrefabInstance: {fileID: 0}
  m_PrefabAsset: {fileID: 0}
  serializedVersion: 6
  m_Component:
  - component: {fileID: 4000013566523972}
  - component: {fileID: 114000011833694394}
  m_Layer: 0
  m_Name: ArenaAtlas
  m_TagString: Untagged
  m_Icon: {fileID: 0}
  m_NavMeshLayer: 0
  m_StaticEditorFlags: 0
  m_IsActive: 1
--- !u!4 &4000013566523972
Transform:
  m_ObjectHideFlags: 0
  m_CorrespondingSourceObject: {fileID: 0}
  m_PrefabInstance: {fileID: 0}
  m_PrefabAsset: {fileID: 0}
  m_GameObject: {fileID: 1000010143003082}
  m_LocalRotation: {x: 0, y: 0, z: 0, w: 1}
  m_LocalPosition: {x: 0, y: 0, z: 0}
  m_LocalScale: {x: 1, y: 1, z: 1}
  m_ConstrainProportionsScale: 0
  m_Children: []
  m_Father: {fileID: 0}
  m_RootOrder: 0
  m_LocalEulerAnglesHint: {x: 0, y: 0, z: 0}
--- !u!114 &114000011833694394
MonoBehaviour:
  m_ObjectHideFlags: 0
  m_CorrespondingSourceObject: {fileID: 0}
  m_PrefabInstance: {fileID: 0}
  m_PrefabAsset: {fileID: 0}
  m_GameObject: {fileID: 1000010143003082}
  m_Enabled: 1
  m_EditorHideFlags: 0
  m_Script: {fileID: 11500000, guid: 4d0c51bb0b6e93049af5e88f93826e3b, type: 3}
  m_Name: 
  m_EditorClassIdentifier: 
  material: {fileID: 2100000, guid: f9323b99eefba2740a11920c2cc69ca9, type: 2}
  mSprites:
  - name: 0
    x: 980
    y: 242
    width: 73
    height: 112
    borderLeft: 0
    borderRight: 0
    borderTop: 0
    borderBottom: 0
    paddingLeft: 7
    paddingRight: 6
    paddingTop: 1
    paddingBottom: 1
  - name: 1
    x: 1109
    y: 526
    width: 62
    height: 113
    borderLeft: 0
    borderRight: 0
    borderTop: 0
    borderBottom: 0
    paddingLeft: 12
    paddingRight: 12
    paddingTop: 0
    paddingBottom: 1
  - name: 2
    x: 904
    y: 277
    width: 75
    height: 111
    borderLeft: 0
    borderRight: 0
    borderTop: 0
    borderBottom: 0
    paddingLeft: 6
    paddingRight: 5
    paddingTop: 1
    paddingBottom: 2
  - name: 3
    x: 980
    y: 29
    width: 74
    height: 114
    borderLeft: 0
    borderRight: 0
    borderTop: 0
    borderBottom: 0
    paddingLeft: 6
    paddingRight: 6
    paddingTop: 0
    paddingBottom: 0
  - name: 4
    x: 1022
    y: 644
    width: 86
    height: 112
    borderLeft: 0
    borderRight: 0
    borderTop: 0
    borderBottom: 0
    paddingLeft: 0
    paddingRight: 0
    paddingTop: 1
    paddingBottom: 1
  - name: 5
    x: 1022
    y: 532
    width: 86
    height: 111
    borderLeft: 0
    borderRight: 0
    borderTop: 0
    borderBottom: 0
    paddingLeft: 0
    paddingRight: 0
    paddingTop: 1
    paddingBottom: 2
  - name: 6
    x: 980
    y: 355
    width: 74
    height: 111
    borderLeft: 0
    borderRight: 0
    borderTop: 0
    borderBottom: 0
    paddingLeft: 6
    paddingRight: 6
    paddingTop: 1
    paddingBottom: 2
  - name: 7
    x: 819
    y: 32
    width: 83
    height: 112
    borderLeft: 0
    borderRight: 0
    borderTop: 0
    borderBottom: 0
    paddingLeft: 2
    paddingRight: 1
    paddingTop: 1
    paddingBottom: 1
  - name: 8
    x: 903
    y: 29
    width: 76
    height: 114
    borderLeft: 0
    borderRight: 0
    borderTop: 0
    borderBottom: 0
    paddingLeft: 5
    paddingRight: 5
    paddingTop: 0
    paddingBottom: 0
  - name: 9
    x: 736
    y: 30
    width: 82
    height: 114
    borderLeft: 0
    borderRight: 0
    borderTop: 0
    borderBottom: 0
    paddingLeft: 2
    paddingRight: 2
    paddingTop: 0
    paddingBottom: 0
  - name: aspo_1003
    x: 736
    y: 145
    width: 100
    height: 94
    borderLeft: 0
    borderRight: 0
    borderTop: 0
    borderBottom: 0
    paddingLeft: 0
    paddingRight: 0
    paddingTop: 6
    paddingBottom: 0
  - name: aspo_1003_hover
    x: 921
    y: 550
    width: 100
    height: 100
    borderLeft: 0
    borderRight: 0
    borderTop: 0
    borderBottom: 0
    paddingLeft: 0
    paddingRight: 0
    paddingTop: 0
    paddingBottom: 0
  - name: bg_andi
    x: 0
    y: 148
    width: 145
    height: 408
    borderLeft: 0
    borderRight: 0
    borderTop: 0
    borderBottom: 0
    paddingLeft: 0
    paddingRight: 0
    paddingTop: 0
    paddingBottom: 0
  - name: bg_duanweibiwudi_02
    x: 1089
    y: 471
    width: 42
    height: 54
    borderLeft: 21
    borderRight: 21
    borderTop: 0
    borderBottom: 0
    paddingLeft: 0
    paddingRight: 0
    paddingTop: 0
    paddingBottom: 0
  - name: bg_fenge
    x: 510
    y: 197
    width: 119
    height: 27
    borderLeft: 0
    borderRight: 0
    borderTop: 0
    borderBottom: 0
    paddingLeft: 0
    paddingRight: 0
    paddingTop: 0
    paddingBottom: 0
  - name: bg_fuwendikuang
    x: 725
    y: 240
    width: 178
    height: 75
    borderLeft: 85
    borderRight: 85
    borderTop: 0
    borderBottom: 0
    paddingLeft: 0
    paddingRight: 0
    paddingTop: 0
    paddingBottom: 0
  - name: bg_fuwendikuang03
    x: 1054
    y: 269
    width: 85
    height: 85
    borderLeft: 0
    borderRight: 0
    borderTop: 0
    borderBottom: 0
    paddingLeft: 0
    paddingRight: 0
    paddingTop: 0
    paddingBottom: 0
  - name: bg_fuwenxuanzhongkuang
    x: 903
    y: 144
    width: 95
    height: 95
    borderLeft: 0
    borderRight: 0
    borderTop: 0
    borderBottom: 0
    paddingLeft: 0
    paddingRight: 0
    paddingTop: 0
    paddingBottom: 0
  - name: bg_fuwenyijingbeixuanzhong
    x: 922
    y: 661
    width: 95
    height: 95
    borderLeft: 0
    borderRight: 0
    borderTop: 0
    borderBottom: 0
    paddingLeft: 0
    paddingRight: 0
    paddingTop: 0
    paddingBottom: 0
  - name: bg_guanzhandiban
    x: 146
    y: 255
    width: 289
    height: 129
    borderLeft: 220
    borderRight: 16
    borderTop: 50
    borderBottom: 41
    paddingLeft: 0
    paddingRight: 0
    paddingTop: 0
    paddingBottom: 0
  - name: bg_hongsedi
    x: 1783
    y: 707
    width: 215
    height: 317
    borderLeft: 0
    borderRight: 0
    borderTop: 0
    borderBottom: 0
    paddingLeft: 0
    paddingRight: 0
    paddingTop: 0
    paddingBottom: 0
  - name: bg_hongsekuang
    x: 363
    y: 385
    width: 176
    height: 261
    borderLeft: 0
    borderRight: 0
    borderTop: 0
    borderBottom: 0
    paddingLeft: 0
    paddingRight: 0
    paddingTop: 0
    paddingBottom: 0
  - name: bg_hongsemingzidi
    x: 146
    y: 186
    width: 363
    height: 68
    borderLeft: 32
    borderRight: 32
    borderTop: 0
    borderBottom: 0
    paddingLeft: 0
    paddingRight: 0
    paddingTop: 0
    paddingBottom: 0
  - name: bg_hongsemingzidihui
    x: 372
    y: 48
    width: 363
    height: 68
    borderLeft: 32
    borderRight: 32
    borderTop: 0
    borderBottom: 0
    paddingLeft: 0
    paddingRight: 0
    paddingTop: 0
    paddingBottom: 0
  - name: bg_huobantouxiangtianjia
    x: 1227
    y: 326
    width: 74
    height: 74
    borderLeft: 0
    borderRight: 0
    borderTop: 0
    borderBottom: 0
    paddingLeft: 0
    paddingRight: 0
    paddingTop: 0
    paddingBottom: 0
  - name: bg_lanse
    x: 0
    y: 557
    width: 216
    height: 307
    borderLeft: 0
    borderRight: 0
    borderTop: 0
    borderBottom: 0
    paddingLeft: 0
    paddingRight: 0
    paddingTop: 0
    paddingBottom: 0
  - name: bg_lansekuang
    x: 625
    y: 603
    width: 176
    height: 261
    borderLeft: 0
    borderRight: 0
    borderTop: 0
    borderBottom: 0
    paddingLeft: 0
    paddingRight: 0
    paddingTop: 0
    paddingBottom: 0
  - name: bg_lansemingzidi
    x: 372
    y: 117
    width: 363
    height: 68
    borderLeft: 32
    borderRight: 32
    borderTop: 0
    borderBottom: 0
    paddingLeft: 0
    paddingRight: 0
    paddingTop: 0
    paddingBottom: 0
  - name: bg_lansemingzidihuise
    x: 436
    y: 316
    width: 363
    height: 68
    borderLeft: 32
    borderRight: 32
    borderTop: 0
    borderBottom: 0
    paddingLeft: 0
    paddingRight: 0
    paddingTop: 0
    paddingBottom: 0
  - name: bg_liangdi
    x: 217
    y: 456
    width: 145
    height: 408
    borderLeft: 0
    borderRight: 0
    borderTop: 0
    borderBottom: 0
    paddingLeft: 0
    paddingRight: 0
    paddingTop: 0
    paddingBottom: 0
  - name: bg_neirongdi
    x: 540
    y: 392
    width: 298
    height: 52
    borderLeft: 221
    borderRight: 74
    borderTop: 20
    borderBottom: 20
    paddingLeft: 0
    paddingRight: 0
    paddingTop: 0
    paddingBottom: 0
  - name: bg_shuzhidi02
    x: 1142
    y: 394
    width: 75
    height: 51
    borderLeft: 0
    borderRight: 0
    borderTop: 0
    borderBottom: 0
    paddingLeft: 0
    paddingRight: 0
    paddingTop: 0
    paddingBottom: 0
  - name: bg_shuzidiguang
    x: 802
    y: 757
    width: 351
    height: 107
    borderLeft: 0
    borderRight: 0
    borderTop: 0
    borderBottom: 0
    paddingLeft: 0
    paddingRight: 0
    paddingTop: 0
    paddingBottom: 0
  - name: bg_touxiangdikuang
    x: 1142
    y: 446
    width: 77
    height: 79
    borderLeft: 0
    borderRight: 0
    borderTop: 0
    borderBottom: 0
    paddingLeft: 0
    paddingRight: 0
    paddingTop: 0
    paddingBottom: 0
  - name: bg_xinxidi
    x: 1154
    y: 640
    width: 54
    height: 224
    borderLeft: 27
    borderRight: 27
    borderTop: 0
    borderBottom: 0
    paddingLeft: 0
    paddingRight: 0
    paddingTop: 0
    paddingBottom: 0
  - name: btn_chongbo
    x: 1209
    y: 682
    width: 75
    height: 78
    borderLeft: 0
    borderRight: 0
    borderTop: 0
    borderBottom: 0
    paddingLeft: 7
    paddingRight: 4
    paddingTop: 4
    paddingBottom: 1
  - name: btn_guanzhan
    x: 1140
    y: 299
    width: 86
    height: 83
    borderLeft: 0
    borderRight: 0
    borderTop: 0
    borderBottom: 0
    paddingLeft: 0
    paddingRight: 0
    paddingTop: 0
    paddingBottom: 0
  - name: btn_jiangli
    x: 1220
    y: 401
    width: 75
    height: 78
    borderLeft: 0
    borderRight: 0
    borderTop: 0
    borderBottom: 0
    paddingLeft: 7
    paddingRight: 4
    paddingTop: 4
    paddingBottom: 1
  - name: btn_jiangli2
    x: 1055
    y: 383
    width: 86
    height: 83
    borderLeft: 0
    borderRight: 0
    borderTop: 0
    borderBottom: 0
    paddingLeft: 0
    paddingRight: 0
    paddingTop: 0
    paddingBottom: 0
  - name: btn_paiming
    x: 1172
    y: 559
    width: 75
    height: 80
    borderLeft: 0
    borderRight: 0
    borderTop: 0
    borderBottom: 0
    paddingLeft: 0
    paddingRight: 0
    paddingTop: 0
    paddingBottom: 0
  - name: btn_qingdengdaianniu
    x: 999
    y: 185
    width: 146
    height: 56
    borderLeft: 0
    borderRight: 0
    borderTop: 0
    borderBottom: 0
    paddingLeft: 0
    paddingRight: 0
    paddingTop: 0
    paddingBottom: 0
  - name: btn_zhandou
    x: 540
    y: 445
    width: 154
    height: 157
    borderLeft: 0
    borderRight: 0
    borderTop: 0
    borderBottom: 0
    paddingLeft: 0
    paddingRight: 0
    paddingTop: 0
    paddingBottom: 0
  - name: btn_zudui
    x: 1220
    y: 480
    width: 75
    height: 78
    borderLeft: 0
    borderRight: 0
    borderTop: 0
    borderBottom: 0
    paddingLeft: 0
    paddingRight: 0
    paddingTop: 0
    paddingBottom: 0
  - name: pic_deco_arena_history
    x: 1258
    y: 841
    width: 524
    height: 183
    borderLeft: 0
    borderRight: 0
    borderTop: 0
    borderBottom: 0
    paddingLeft: 0
    paddingRight: 0
    paddingTop: 0
    paddingBottom: 0
  - name: pic_deco_yjwarfuben
    x: 0
    y: 33
    width: 371
    height: 114
    borderLeft: 0
    borderRight: 0
    borderTop: 0
    borderBottom: 0
    paddingLeft: 0
    paddingRight: 0
    paddingTop: 0
    paddingBottom: 0
  - name: pic_diguang
    x: 363
    y: 647
    width: 261
    height: 217
    borderLeft: 0
    borderRight: 0
    borderTop: 0
    borderBottom: 0
    paddingLeft: 0
    paddingRight: 0
    paddingTop: 15
    paddingBottom: 16
  - name: pic_gongpindoujidi
    x: 1054
    y: 242
    width: 26
    height: 26
    borderLeft: 13
    borderRight: 13
    borderTop: 13
    borderBottom: 13
    paddingLeft: 0
    paddingRight: 0
    paddingTop: 0
    paddingBottom: 0
  - name: pic_guankan
    x: 881
    y: 324
    width: 20
    height: 12
    borderLeft: 0
    borderRight: 0
    borderTop: 0
    borderBottom: 0
    paddingLeft: 0
    paddingRight: 0
    paddingTop: 3
    paddingBottom: 2
  - name: pic_hongsefuwendi
    x: 300
    y: 395
    width: 60
    height: 60
    borderLeft: 0
    borderRight: 0
    borderTop: 0
    borderBottom: 0
    paddingLeft: 0
    paddingRight: 0
    paddingTop: 0
    paddingBottom: 0
  - name: pic_hongsefuwendikuang
    x: 0
    y: 865
    width: 628
    height: 159
    borderLeft: 0
    borderRight: 0
    borderTop: 0
    borderBottom: 0
    paddingLeft: 0
    paddingRight: 0
    paddingTop: 0
    paddingBottom: 0
  - name: pic_iconshop_world
    x: 1209
    y: 761
    width: 75
    height: 79
    borderLeft: 0
    borderRight: 0
    borderTop: 0
    borderBottom: 0
    paddingLeft: 7
    paddingRight: 4
    paddingTop: 4
    paddingBottom: 0
  - name: pic_jiahao
    x: 1109
    y: 712
    width: 44
    height: 44
    borderLeft: 0
    borderRight: 0
    borderTop: 0
    borderBottom: 0
    paddingLeft: 0
    paddingRight: 0
    paddingTop: 0
    paddingBottom: 0
  - name: pic_jinse
    x: 802
    y: 651
    width: 119
    height: 105
    borderLeft: 0
    borderRight: 0
    borderTop: 0
    borderBottom: 0
    paddingLeft: 0
    paddingRight: 0
    paddingTop: 1
    paddingBottom: 1
  - name: pic_lansefuwendikuang
    x: 629
    y: 865
    width: 628
    height: 159
    borderLeft: 0
    borderRight: 0
    borderTop: 0
    borderBottom: 0
    paddingLeft: 0
    paddingRight: 0
    paddingTop: 0
    paddingBottom: 0
  - name: pic_rongyu
    x: 1172
    y: 531
    width: 31
    height: 27
    borderLeft: 0
    borderRight: 0
    borderTop: 0
    borderBottom: 0
    paddingLeft: 0
    paddingRight: 0
    paddingTop: 0
    paddingBottom: 0
  - name: pic_shijian
    x: 881
    y: 337
    width: 18
    height: 17
    borderLeft: 0
    borderRight: 0
    borderTop: 0
    borderBottom: 0
    paddingLeft: 0
    paddingRight: 0
    paddingTop: 0
    paddingBottom: 0
  - name: pic_tongse
    x: 839
    y: 389
    width: 119
    height: 105
    borderLeft: 0
    borderRight: 0
    borderTop: 0
    borderBottom: 0
    paddingLeft: 0
    paddingRight: 0
    paddingTop: 1
    paddingBottom: 1
  - name: pic_vs
    x: 695
    y: 462
    width: 105
    height: 140
    borderLeft: 0
    borderRight: 0
    borderTop: 0
    borderBottom: 0
    paddingLeft: 0
    paddingRight: 0
    paddingTop: 0
    paddingBottom: 0
  - name: pic_wenhao
    x: 1109
    y: 664
    width: 38
    height: 47
    borderLeft: 0
    borderRight: 0
    borderTop: 0
    borderBottom: 0
    paddingLeft: 0
    paddingRight: 0
    paddingTop: 0
    paddingBottom: 0
  - name: pic_yinse
    x: 801
    y: 495
    width: 119
    height: 107
    borderLeft: 0
    borderRight: 0
    borderTop: 0
    borderBottom: 0
    paddingLeft: 0
    paddingRight: 0
    paddingTop: 0
    paddingBottom: 0
  - name: pic_zitishuzidiwen
    x: 0
    y: 1
    width: 23
    height: 31
    borderLeft: 1
    borderRight: 21
    borderTop: 0
    borderBottom: 0
    paddingLeft: 0
    paddingRight: 0
    paddingTop: 0
    paddingBottom: 0
  - name: text_1
    x: 2023
    y: 935
    width: 23
    height: 43
    borderLeft: 0
    borderRight: 0
    borderTop: 0
    borderBottom: 0
    paddingLeft: 0
    paddingRight: 0
    paddingTop: 1
    paddingBottom: 4
  - name: text_1_1
    x: 1999
    y: 935
    width: 23
    height: 43
    borderLeft: 0
    borderRight: 0
    borderTop: 0
    borderBottom: 0
    paddingLeft: 0
    paddingRight: 0
    paddingTop: 1
    paddingBottom: 4
  - name: text_2
    x: 175
    y: 512
    width: 28
    height: 44
    borderLeft: 0
    borderRight: 0
    borderTop: 0
    borderBottom: 0
    paddingLeft: 0
    paddingRight: 0
    paddingTop: 0
    paddingBottom: 4
  - name: text_2_1
    x: 146
    y: 467
    width: 28
    height: 44
    borderLeft: 0
    borderRight: 0
    borderTop: 0
    borderBottom: 0
    paddingLeft: 0
    paddingRight: 0
    paddingTop: 0
    paddingBottom: 4
  - name: text_3
    x: 1999
    y: 979
    width: 27
    height: 45
    borderLeft: 0
    borderRight: 0
    borderTop: 0
    borderBottom: 0
    paddingLeft: 0
    paddingRight: 1
    paddingTop: 0
    paddingBottom: 3
  - name: text_3_1
    x: 175
    y: 466
    width: 27
    height: 45
    borderLeft: 0
    borderRight: 0
    borderTop: 0
    borderBottom: 0
    paddingLeft: 0
    paddingRight: 1
    paddingTop: 0
    paddingBottom: 3
  - name: text_4
    x: 801
    y: 451
    width: 35
    height: 43
    borderLeft: 0
    borderRight: 0
    borderTop: 0
    borderBottom: 0
    paddingLeft: 0
    paddingRight: 0
    paddingTop: 1
    paddingBottom: 4
  - name: text_4_1
    x: 884
    y: 607
    width: 35
    height: 43
    borderLeft: 0
    borderRight: 0
    borderTop: 0
    borderBottom: 0
    paddingLeft: 0
    paddingRight: 0
    paddingTop: 1
    paddingBottom: 4
  - name: text_5
    x: 867
    y: 151
    width: 28
    height: 44
    borderLeft: 0
    borderRight: 0
    borderTop: 0
    borderBottom: 0
    paddingLeft: 0
    paddingRight: 0
    paddingTop: 1
    paddingBottom: 3
  - name: text_5_1
    x: 146
    y: 512
    width: 28
    height: 44
    borderLeft: 0
    borderRight: 0
    borderTop: 0
    borderBottom: 0
    paddingLeft: 0
    paddingRight: 0
    paddingTop: 1
    paddingBottom: 3
  - name: text_6
    x: 921
    y: 504
    width: 30
    height: 45
    borderLeft: 0
    borderRight: 0
    borderTop: 0
    borderBottom: 0
    paddingLeft: 0
    paddingRight: 0
    paddingTop: 0
    paddingBottom: 3
  - name: text_6_1
    x: 674
    y: 2
    width: 30
    height: 45
    borderLeft: 0
    borderRight: 0
    borderTop: 0
    borderBottom: 0
    paddingLeft: 0
    paddingRight: 0
    paddingTop: 0
    paddingBottom: 3
  - name: text_7
    x: 837
    y: 150
    width: 29
    height: 43
    borderLeft: 0
    borderRight: 0
    borderTop: 0
    borderBottom: 0
    paddingLeft: 0
    paddingRight: 0
    paddingTop: 1
    paddingBottom: 4
  - name: text_7_1
    x: 867
    y: 196
    width: 29
    height: 43
    borderLeft: 0
    borderRight: 0
    borderTop: 0
    borderBottom: 0
    paddingLeft: 0
    paddingRight: 0
    paddingTop: 1
    paddingBottom: 4
  - name: text_8
    x: 612
    y: 2
    width: 30
    height: 45
    borderLeft: 0
    borderRight: 0
    borderTop: 0
    borderBottom: 0
    paddingLeft: 0
    paddingRight: 0
    paddingTop: 0
    paddingBottom: 3
  - name: text_8_1
    x: 643
    y: 2
    width: 30
    height: 45
    borderLeft: 0
    borderRight: 0
    borderTop: 0
    borderBottom: 0
    paddingLeft: 0
    paddingRight: 0
    paddingTop: 0
    paddingBottom: 3
  - name: text_9
    x: 705
    y: 2
    width: 29
    height: 45
    borderLeft: 0
    borderRight: 0
    borderTop: 0
    borderBottom: 0
    paddingLeft: 0
    paddingRight: 0
    paddingTop: 0
    paddingBottom: 3
  - name: text_9_1
    x: 837
    y: 194
    width: 29
    height: 45
    borderLeft: 0
    borderRight: 0
    borderTop: 0
    borderBottom: 0
    paddingLeft: 0
    paddingRight: 0
    paddingTop: 0
    paddingBottom: 3
  - name: text_biwuchang
    x: 959
    y: 467
    width: 129
    height: 64
    borderLeft: 0
    borderRight: 0
    borderTop: 0
    borderBottom: 0
    paddingLeft: 8
    paddingRight: 6
    paddingTop: 1
    paddingBottom: 4
  - name: text_biwuchongbo
    x: 1209
    y: 847
    width: 45
    height: 17
    borderLeft: 0
    borderRight: 0
    borderTop: 0
    borderBottom: 0
    paddingLeft: 0
    paddingRight: 0
    paddingTop: 0
    paddingBottom: 0
  - name: text_duan_1
    x: 904
    y: 241
    width: 74
    height: 35
    borderLeft: 0
    borderRight: 0
    borderTop: 0
    borderBottom: 0
    paddingLeft: 5
    paddingRight: 4
    paddingTop: 6
    paddingBottom: 5
  - name: text_duan_2
    x: 292
    y: 150
    width: 79
    height: 35
    borderLeft: 0
    borderRight: 0
    borderTop: 0
    borderBottom: 0
    paddingLeft: 3
    paddingRight: 1
    paddingTop: 6
    paddingBottom: 5
  - name: text_duan_3
    x: 800
    y: 319
    width: 80
    height: 35
    borderLeft: 0
    borderRight: 0
    borderTop: 0
    borderBottom: 0
    paddingLeft: 3
    paddingRight: 0
    paddingTop: 6
    paddingBottom: 5
  - name: text_duan_4
    x: 540
    y: 611
    width: 81
    height: 35
    borderLeft: 0
    borderRight: 0
    borderTop: 0
    borderBottom: 0
    paddingLeft: 2
    paddingRight: 0
    paddingTop: 6
    paddingBottom: 5
  - name: text_duan_5
    x: 453
    y: 12
    width: 79
    height: 35
    borderLeft: 0
    borderRight: 0
    borderTop: 0
    borderBottom: 0
    paddingLeft: 3
    paddingRight: 1
    paddingTop: 6
    paddingBottom: 5
  - name: text_duan_6
    x: 802
    y: 615
    width: 81
    height: 35
    borderLeft: 0
    borderRight: 0
    borderTop: 0
    borderBottom: 0
    paddingLeft: 2
    paddingRight: 0
    paddingTop: 6
    paddingBottom: 5
  - name: text_duan_7
    x: 533
    y: 12
    width: 78
    height: 35
    borderLeft: 0
    borderRight: 0
    borderTop: 0
    borderBottom: 0
    paddingLeft: 4
    paddingRight: 1
    paddingTop: 6
    paddingBottom: 5
  - name: text_duan_8
    x: 372
    y: 12
    width: 80
    height: 35
    borderLeft: 0
    borderRight: 0
    borderTop: 0
    borderBottom: 0
    paddingLeft: 3
    paddingRight: 0
    paddingTop: 6
    paddingBottom: 5
  - name: text_duanwei
    x: 436
    y: 280
    width: 60
    height: 35
    borderLeft: 0
    borderRight: 0
    borderTop: 0
    borderBottom: 0
    paddingLeft: 21
    paddingRight: 20
    paddingTop: 2
    paddingBottom: 3
  - name: text_gongpinbiwuchang
    x: 146
    y: 385
    width: 153
    height: 70
    borderLeft: 0
    borderRight: 0
    borderTop: 0
    borderBottom: 0
    paddingLeft: 0
    paddingRight: 0
    paddingTop: 0
    paddingBottom: 0
  - name: text_guanzhanbiaoti
    x: 1140
    y: 244
    width: 105
    height: 54
    borderLeft: 0
    borderRight: 0
    borderTop: 0
    borderBottom: 0
    paddingLeft: 0
    paddingRight: 0
    paddingTop: 0
    paddingBottom: 0
  - name: text_qingdenghou
    x: 630
    y: 191
    width: 89
    height: 33
    borderLeft: 0
    borderRight: 0
    borderTop: 0
    borderBottom: 0
    paddingLeft: 19
    paddingRight: 19
    paddingTop: 12
    paddingBottom: 4
  - name: text_queding_xuanze
    x: 800
    y: 355
    width: 85
    height: 33
    borderLeft: 0
    borderRight: 0
    borderTop: 0
    borderBottom: 0
    paddingLeft: 1
    paddingRight: 1
    paddingTop: 31
    paddingBottom: 32
  - name: text_wodeduanwei
    x: 146
    y: 151
    width: 145
    height: 34
    borderLeft: 0
    borderRight: 0
    borderTop: 0
    borderBottom: 0
    paddingLeft: 8
    paddingRight: 9
    paddingTop: 6
    paddingBottom: 7
  - name: text_worldbalancearena
    x: 510
    y: 225
    width: 214
    height: 90
    borderLeft: 0
    borderRight: 0
    borderTop: 0
    borderBottom: 0
    paddingLeft: 0
    paddingRight: 0
    paddingTop: 0
    paddingBottom: 0
  mPixelSize: 1
  mReplacement: {fileID: 0}
  mCoordinates: 0
  sprites: []
