%YAML 1.1
%TAG !u! tag:unity3d.com,2011:
--- !u!21 &2100000
Material:
  serializedVersion: 6
  m_ObjectHideFlags: 0
  m_PrefabParentObject: {fileID: 0}
  m_PrefabInternal: {fileID: 0}
  m_Name: dilie_135_add02
  m_Shader: {fileID: 200, guid: 0000000000000000f000000000000000, type: 0}
  m_ShaderKeywords: _POSTERIZE_SWITCH_ON
  m_LightmapFlags: 5
  m_CustomRenderQueue: -1
  stringTagMap: {}
  m_SavedProperties:
    serializedVersion: 2
    m_TexEnvs:
    - first:
        name: _Diss_Tex
      second:
        m_Texture: {fileID: 2800000, guid: 6475569e57de23843b4c52854998a6af, type: 3}
        m_Scale: {x: 1, y: 1}
        m_Offset: {x: 0, y: 0}
    - first:
        name: _Liuguang01
      second:
        m_Texture: {fileID: 2800000, guid: e9b173c0d6ac89c44898e6fd7b99a15f, type: 3}
        m_Scale: {x: 1, y: 1}
        m_Offset: {x: 0, y: 0}
    - first:
        name: _Liuguang02
      second:
        m_Texture: {fileID: 2800000, guid: 7acc33f24a06fcd46baa112415b42195, type: 3}
        m_Scale: {x: 1, y: 1}
        m_Offset: {x: 0, y: 0}
    - first:
        name: _MainTex
      second:
        m_Texture: {fileID: 2800000, guid: 5cdb72705453a354abaad5ee441d0822, type: 3}
        m_Scale: {x: 1, y: 1}
        m_Offset: {x: 0, y: 0}
    - first:
        name: _Mask
      second:
        m_Texture: {fileID: 0}
        m_Scale: {x: 1, y: 1}
        m_Offset: {x: 0, y: 0}
    m_Floats:
    - first:
        name: _Alpha
      second: 1
    - first:
        name: _Color_Swith
      second: 0
    - first:
        name: _Cutoff
      second: 0.5
    - first:
        name: _Diss
      second: 0
    - first:
        name: _Diss_Swith
      second: 0
    - first:
        name: _InvFade
      second: 1
    - first:
        name: _Liuguang_ZT
      second: 10
    - first:
        name: _Liuguang_power
      second: 1.3
    - first:
        name: _Posterize
      second: 3
    - first:
        name: _Posterize_Switch
      second: 1
    - first:
        name: _U_Speed01
      second: 0
    - first:
        name: _U_Speed02
      second: 0
    - first:
        name: _V_Speed01
      second: -5
    - first:
        name: _V_Speed02
      second: -10
    - first:
        name: _ZT
      second: 1
    m_Colors:
    - first:
        name: _TintColor
      second: {r: 0.6911765, g: 0.6911765, b: 0.6911765, a: 0.678}
