%YAML 1.1
%TAG !u! tag:unity3d.com,2011:
--- !u!21 &2100000
Material:
  serializedVersion: 6
  m_ObjectHideFlags: 0
  m_CorrespondingSourceObject: {fileID: 0}
  m_PrefabInstance: {fileID: 0}
  m_PrefabAsset: {fileID: 0}
  m_Name: FX_crack_008_cq003
  m_Shader: {fileID: 200, guid: 0000000000000000f000000000000000, type: 0}
  m_ShaderKeywords: 
  m_LightmapFlags: 4
  m_EnableInstancingVariants: 1
  m_DoubleSidedGI: 0
  m_CustomRenderQueue: -1
  stringTagMap: {}
  disabledShaderPasses: []
  m_SavedProperties:
    serializedVersion: 3
    m_TexEnvs:
    - _MainTex:
        m_Texture: {fileID: 2800000, guid: ebbd9ad634297124593b225c24a3d510, type: 3}
        m_Scale: {x: -1, y: 1}
        m_Offset: {x: 0, y: 0}
    - _node_8566:
        m_Texture: {fileID: 0}
        m_Scale: {x: 1, y: 1}
        m_Offset: {x: 0, y: 0}
    m_Floats:
    - _Cutoff: 0.5
    - _Dis_Threshold: 1
    - _InvFade: 1
    - _NormalThreshold: 0
    - _node_6248: 1
    - _smooth: 0
    - _threshold: 0.03
    m_Colors:
    - _Main_color: {r: 1, g: 1, b: 1, a: 0.7568628}
    - _TintColor: {r: 1.498039, g: 1.364706, b: 0.7137255, a: 0.5}
  m_BuildTextureStacks: []
