%YAML 1.1
%TAG !u! tag:unity3d.com,2011:
--- !u!21 &2100000
Material:
  serializedVersion: 6
  m_ObjectHideFlags: 0
  m_CorrespondingSourceObject: {fileID: 0}
  m_PrefabInstance: {fileID: 0}
  m_PrefabAsset: {fileID: 0}
  m_Name: Ms_008zsw_0_fly2
  m_Shader: {fileID: 200, guid: 0000000000000000f000000000000000, type: 0}
  m_ShaderKeywords: 
  m_LightmapFlags: 4
  m_EnableInstancingVariants: 1
  m_DoubleSidedGI: 0
  m_CustomRenderQueue: -1
  stringTagMap: {}
  disabledShaderPasses: []
  m_SavedProperties:
    serializedVersion: 3
    m_TexEnvs:
    - _MainTex:
        m_Texture: {fileID: 2800000, guid: 4b68f4f6e36674c488cc55b699c5f81d, type: 3}
        m_Scale: {x: 1, y: 1}
        m_Offset: {x: 0, y: 0}
    - _MaskTex:
        m_Texture: {fileID: 0}
        m_Scale: {x: 1, y: 1}
        m_Offset: {x: 0, y: 0}
    - _TurbulenceTex:
        m_Texture: {fileID: 0}
        m_Scale: {x: 1, y: 1}
        m_Offset: {x: 0, y: 0}
    m_Floats:
    - _Brightness: 1
    - _ColorMask: 15
    - _Contrast: 1.5
    - _Cutoff: 0.5
    - _FrenselValue: 1
    - _FresnelBrightness: 1
    - _FresnelMultiplyAlpha: 0
    - _InvFade: 1
    - _MainTexBrightness: 1.24
    - _MainTexContrast: 1
    - _MainTexPannerX: 0
    - _MainTexPannerY: -1.5
    - _MaskTexDynmatic: 0
    - _MaskTexPannerX: 0
    - _MaskTexPannerY: 0
    - _N_BY_KD: 0
    - _N_BY_QD: 3
    - _N_mask: 1.63
    - _NormalTexPannerX: 0
    - _NormalTexPannerY: 0
    - _Stencil: 0
    - _StencilComp: 8
    - _StencilOp: 0
    - _StencilReadMask: 255
    - _StencilWriteMask: 255
    - _TurbulencePower: 0
    - _TurbulenceTexPannerX: 0
    - _TurbulenceTexPannerY: 0
    - _UVEffectPower: 0
    m_Colors:
    - _C_BYcolor: {r: 1, g: 1, b: 1, a: 1}
    - _ColorAlpha: {r: 1.647059, g: 1.513726, b: 1.513726, a: 1}
    - _FrenselColor: {r: 1, g: 1, b: 1, a: 1}
    - _MainColor: {r: 1, g: 1, b: 1, a: 1}
    - _TintColor: {r: 0.5, g: 0.5, b: 0.5, a: 1}
  m_BuildTextureStacks: []
