%YAML 1.1
%TAG !u! tag:unity3d.com,2011:
--- !u!21 &2100000
Material:
  serializedVersion: 6
  m_ObjectHideFlags: 0
  m_PrefabParentObject: {fileID: 0}
  m_PrefabInternal: {fileID: 0}
  m_Name: trail_107_ble02
  m_Shader: {fileID: 4800000, guid: 6bfcd1542904c7e46913c2dd13ff16d4, type: 3}
  m_ShaderKeywords: _TEX2_SWITCH_ON
  m_LightmapFlags: 5
  m_CustomRenderQueue: 3001
  stringTagMap: {}
  m_SavedProperties:
    serializedVersion: 2
    m_TexEnvs:
    - first:
        name: _MainTex
      second:
        m_Texture: {fileID: 2800000, guid: 31f5b789fa4b4a14297f0c8a29fd1cba, type: 3}
        m_Scale: {x: 1, y: 1}
        m_Offset: {x: 0, y: 0}
    - first:
        name: _MainTexPar
      second:
        m_Texture: {fileID: 2800000, guid: 31f5b789fa4b4a14297f0c8a29fd1cba, type: 3}
        m_Scale: {x: 1, y: 1}
        m_Offset: {x: 0, y: 0}
    - first:
        name: _MainTex_Par
      second:
        m_Texture: {fileID: 2800000, guid: 19a44783a4ef18d46a594ed1dd296813, type: 3}
        m_Scale: {x: 1, y: 1}
        m_Offset: {x: 0, y: 0}
    - first:
        name: _Mask
      second:
        m_Texture: {fileID: 2800000, guid: ef38b713110e3b346bc25e147c1669f7, type: 3}
        m_Scale: {x: 1, y: 1}
        m_Offset: {x: 0, y: 0}
    - first:
        name: _Tex2
      second:
        m_Texture: {fileID: 0}
        m_Scale: {x: 1, y: 1}
        m_Offset: {x: 0, y: 0}
    m_Floats:
    - first:
        name: _Alpha
      second: 2
    - first:
        name: _Cutoff
      second: 0.5
    - first:
        name: _InvFade
      second: 1
    - first:
        name: _LightingLevels
      second: 2
    - first:
        name: _SuduU
      second: 0.1
    - first:
        name: _SuduV
      second: 0.1
    - first:
        name: _Tex2LightingLevels
      second: 2
    - first:
        name: _Tex2_Switch
      second: 1
    - first:
        name: _UroVPar
      second: 0
    - first:
        name: _UroV_Par
      second: 0
    - first:
        name: _ZT
      second: 2
    m_Colors:
    - first:
        name: _Tex2_Color
      second: {r: 0.5, g: 0.5, b: 0.5, a: 1}
    - first:
        name: _TintColor
      second: {r: 1, g: 1, b: 1, a: 1}
