%YAML 1.1
%TAG !u! tag:unity3d.com,2011:
--- !u!21 &2100000
Material:
  serializedVersion: 6
  m_ObjectHideFlags: 0
  m_PrefabParentObject: {fileID: 0}
  m_PrefabInternal: {fileID: 0}
  m_Name: partner_crit_02_bian2
  m_Shader: {fileID: 4800000, guid: 9434858aee97e4a47bf7e07248432be3, type: 3}
  m_ShaderKeywords: _EMISSION
  m_LightmapFlags: 1
  m_CustomRenderQueue: 3001
  stringTagMap: {}
  m_SavedProperties:
    serializedVersion: 2
    m_TexEnvs:
    - first:
        name: _Blend_Texture
      second:
        m_Texture: {fileID: 2800000, guid: 7acc33f24a06fcd46baa112415b42195, type: 3}
        m_Scale: {x: 1, y: 1}
        m_Offset: {x: 0, y: 0}
    - first:
        name: _Blend_Texture01
      second:
        m_Texture: {fileID: 2800000, guid: 7acc33f24a06fcd46baa112415b42195, type: 3}
        m_Scale: {x: 5, y: 1}
        m_Offset: {x: 0, y: 0}
    - first:
        name: _BumpMap
      second:
        m_Texture: {fileID: 0}
        m_Scale: {x: 1, y: 1}
        m_Offset: {x: 0, y: 0}
    - first:
        name: _DetailAlbedoMap
      second:
        m_Texture: {fileID: 0}
        m_Scale: {x: 1, y: 1}
        m_Offset: {x: 0, y: 0}
    - first:
        name: _DetailMask
      second:
        m_Texture: {fileID: 0}
        m_Scale: {x: 1, y: 1}
        m_Offset: {x: 0, y: 0}
    - first:
        name: _DetailNormalMap
      second:
        m_Texture: {fileID: 0}
        m_Scale: {x: 1, y: 1}
        m_Offset: {x: 0, y: 0}
    - first:
        name: _Dissolve_Tex
      second:
        m_Texture: {fileID: 2800000, guid: af3955d40bbddee49bb309a60150a452, type: 3}
        m_Scale: {x: 1, y: 1}
        m_Offset: {x: 0, y: 0}
    - first:
        name: _Distort_Tex
      second:
        m_Texture: {fileID: 2800000, guid: f32d8cbdfa3df5e48a885c48e037a62b, type: 3}
        m_Scale: {x: 1, y: 1.5}
        m_Offset: {x: 0, y: 0}
    - first:
        name: _EmissionMap
      second:
        m_Texture: {fileID: 0}
        m_Scale: {x: 1, y: 1}
        m_Offset: {x: 0, y: 0}
    - first:
        name: _MASK
      second:
        m_Texture: {fileID: 0}
        m_Scale: {x: 1, y: 1}
        m_Offset: {x: 0, y: 0}
    - first:
        name: _MainTex
      second:
        m_Texture: {fileID: 2800000, guid: 552f91bd349ddae48bdf73fa6a10f76b, type: 3}
        m_Scale: {x: 1, y: 1}
        m_Offset: {x: 0, y: 0}
    - first:
        name: _Mask
      second:
        m_Texture: {fileID: 2800000, guid: 91626235e844fba4ab77102d7eab36a0, type: 3}
        m_Scale: {x: 0.65, y: 1}
        m_Offset: {x: 0.15, y: 0}
    - first:
        name: _MaskTex
      second:
        m_Texture: {fileID: 2800000, guid: 91626235e844fba4ab77102d7eab36a0, type: 3}
        m_Scale: {x: 0.65, y: 1}
        m_Offset: {x: 0.15, y: 0}
    - first:
        name: _MetallicGlossMap
      second:
        m_Texture: {fileID: 0}
        m_Scale: {x: 1, y: 1}
        m_Offset: {x: 0, y: 0}
    - first:
        name: _OcclusionMap
      second:
        m_Texture: {fileID: 0}
        m_Scale: {x: 1, y: 1}
        m_Offset: {x: 0, y: 0}
    - first:
        name: _ParallaxMap
      second:
        m_Texture: {fileID: 0}
        m_Scale: {x: 1, y: 1}
        m_Offset: {x: 0, y: 0}
    - first:
        name: _Tex_Dis
      second:
        m_Texture: {fileID: 2800000, guid: f32d8cbdfa3df5e48a885c48e037a62b, type: 3}
        m_Scale: {x: 1.5, y: 1.5}
        m_Offset: {x: 0, y: 0}
    m_Floats:
    - first:
        name: _BumpScale
      second: 1
    - first:
        name: _Color_Sweitch
      second: 0
    - first:
        name: _Cutoff
      second: 0.5
    - first:
        name: _DetailNormalMapScale
      second: 1
    - first:
        name: _Dis_U_Speed
      second: -5
    - first:
        name: _Dis_V_Speed
      second: 4
    - first:
        name: _Dist_SppedX
      second: -2
    - first:
        name: _Dist_SppedY
      second: 5
    - first:
        name: _Dist_amountX
      second: 0.75
    - first:
        name: _Dist_amountY
      second: 0.35
    - first:
        name: _Disturbance
      second: 1.5
    - first:
        name: _DstBlend
      second: 0
    - first:
        name: _GlossMapScale
      second: 1
    - first:
        name: _Glossiness
      second: 0.5
    - first:
        name: _GlossyReflections
      second: 1
    - first:
        name: _InvFade
      second: 1
    - first:
        name: _Lighten
      second: 1.5
    - first:
        name: _LightenMain
      second: 1
    - first:
        name: _MT_Rotate
      second: 0.25
    - first:
        name: _MainTex_Power
      second: 1.25
    - first:
        name: _Metallic
      second: 0
    - first:
        name: _Mode
      second: 0
    - first:
        name: _OcclusionStrength
      second: 1
    - first:
        name: _Parallax
      second: 0.02
    - first:
        name: _Power
      second: 1
    - first:
        name: _SmoothnessTextureChannel
      second: 0
    - first:
        name: _SpecularHighlights
      second: 1
    - first:
        name: _Speed00
      second: 0
    - first:
        name: _Speed01
      second: -5
    - first:
        name: _Speed02
      second: -5
    - first:
        name: _SrcBlend
      second: 1
    - first:
        name: _UVSec
      second: 0
    - first:
        name: _U_Sapeed
      second: 0
    - first:
        name: _V_Speed
      second: 0
    - first:
        name: _ZT
      second: 2.5
    - first:
        name: _ZWrite
      second: 1
    - first:
        name: _diss_amount
      second: -0.01
    - first:
        name: _node_8634
      second: 1
    - first:
        name: _particle_controlA
      second: 0
    m_Colors:
    - first:
        name: _Color
      second: {r: 1, g: 1, b: 1, a: 1}
    - first:
        name: _Color01
      second: {r: 1, g: 0.86369175, b: 0.29411763, a: 1}
    - first:
        name: _Color02
      second: {r: 1, g: 0.7302231, b: 0.4852941, a: 1}
    - first:
        name: _Color03
      second: {r: 1, g: 1, b: 1, a: 1}
    - first:
        name: _EmissionColor
      second: {r: 0, g: 0, b: 0, a: 1}
    - first:
        name: _MainColor
      second: {r: 1, g: 0.8793103, b: 0.4852941, a: 1}
    - first:
        name: _TintColor
      second: {r: 0.50735295, g: 0.44699547, b: 0.24994594, a: 1}
