
launch3.png
size: 1024,2048
format: RGBA8888
filter: Linear,Linear
repeat: none
Layer 2
  rotate: false
  xy: 403, 1098
  size: 421, 189
  orig: 421, 189
  offset: 0, 0
  index: -1
Layer 3
  rotate: false
  xy: 1, 1326
  size: 279, 143
  orig: 279, 143
  offset: 0, 0
  index: -1
Untitled-1/flare
  rotate: false
  xy: 1, 1098
  size: 400, 226
  orig: 400, 226
  offset: 0, 0
  index: -1
Untitled-1/Layer_33
  rotate: false
  xy: 716, 964
  size: 86, 129
  orig: 86, 129
  offset: 0, 0
  index: -1
Untitled-1/Layer_34
  rotate: false
  xy: 519, 1583
  size: 67, 26
  orig: 67, 26
  offset: 0, 0
  index: -1
Untitled-1/Layer_38
  rotate: false
  xy: 1, 443
  size: 316, 505
  orig: 316, 505
  offset: 0, 0
  index: -1
Untitled-1/Layer_37
  rotate: false
  xy: 1, 950
  size: 713, 146
  orig: 713, 146
  offset: 0, 0
  index: -1
Untitled-1/Layer_6
  rotate: false
  xy: 716, 579
  size: 266, 383
  orig: 266, 383
  offset: 0, 0
  index: -1
Untitled-1/Layer_7
  rotate: false
  xy: 319, 579
  size: 263, 260
  orig: 263, 260
  offset: 0, 0
  index: -1
Untitled-1/Layer_8
  rotate: false
  xy: 790, 1
  size: 210, 425
  orig: 210, 425
  offset: 0, 0
  index: -1
Untitled-1/Layer_9
  rotate: false
  xy: 826, 964
  size: 159, 388
  orig: 159, 388
  offset: 0, 0
  index: -1
Untitled-1/Layer_10
  rotate: false
  xy: 584, 579
  size: 46, 190
  orig: 46, 190
  offset: 0, 0
  index: -1
Untitled-1/Layer_11
  rotate: false
  xy: 632, 579
  size: 61, 96
  orig: 61, 96
  offset: 0, 0
  index: -1
Untitled-1/Layer_12
  rotate: false
  xy: 608, 857
  size: 87, 72
  orig: 87, 72
  offset: 0, 0
  index: -1
Untitled-1/Layer_13
  rotate: false
  xy: 635, 1289
  size: 111, 53
  orig: 111, 53
  offset: 0, 0
  index: -1
Untitled-1/Layer_14
  rotate: false
  xy: 984, 834
  size: 30, 75
  orig: 30, 75
  offset: 0, 0
  index: -1
Untitled-1/Layer_15
  rotate: false
  xy: 984, 759
  size: 36, 73
  orig: 36, 73
  offset: 0, 0
  index: -1
Untitled-1/Layer_16
  rotate: false
  xy: 913, 428
  size: 91, 95
  orig: 91, 95
  offset: 0, 0
  index: -1
Untitled-1/Layer_17
  rotate: false
  xy: 984, 525
  size: 38, 111
  orig: 38, 111
  offset: 0, 0
  index: -1
Untitled-1/Layer_18
  rotate: false
  xy: 790, 428
  size: 121, 145
  orig: 121, 145
  offset: 0, 0
  index: -1
Untitled-1/Layer_19
  rotate: false
  xy: 378, 1583
  size: 139, 159
  orig: 139, 159
  offset: 0, 0
  index: -1
Untitled-1/Layer_20
  rotate: false
  xy: 849, 1354
  size: 50, 33
  orig: 50, 33
  offset: 0, 0
  index: -1
Untitled-1/Layer_26
  rotate: false
  xy: 584, 771
  size: 17, 60
  orig: 17, 60
  offset: 0, 0
  index: -1
Untitled-1/Layer_27
  rotate: false
  xy: 748, 1289
  size: 71, 60
  orig: 71, 60
  offset: 0, 0
  index: -1
Untitled-1/Layer_28
  rotate: false
  xy: 477, 916
  size: 70, 29
  orig: 70, 29
  offset: 0, 0
  index: -1
Untitled-1/Layer_29
  rotate: false
  xy: 632, 677
  size: 51, 91
  orig: 51, 91
  offset: 0, 0
  index: -1
Untitled-1/Layer_30
  rotate: false
  xy: 549, 916
  size: 44, 22
  orig: 44, 22
  offset: 0, 0
  index: -1
Untitled-1/Layer_31
  rotate: false
  xy: 608, 771
  size: 76, 84
  orig: 76, 84
  offset: 0, 0
  index: -1
Untitled-1/Layer_32
  rotate: false
  xy: 913, 525
  size: 58, 45
  orig: 58, 45
  offset: 0, 0
  index: -1
Untitled-1/Layer_21
  rotate: false
  xy: 984, 638
  size: 34, 119
  orig: 34, 119
  offset: 0, 0
  index: -1
Untitled-1/Layer_22
  rotate: false
  xy: 635, 1354
  size: 212, 243
  orig: 212, 243
  offset: 0, 0
  index: -1
Untitled-1/Layer_23
  rotate: false
  xy: 282, 1326
  size: 94, 395
  orig: 94, 395
  offset: 0, 0
  index: -1
Untitled-1/Layer_24
  rotate: false
  xy: 477, 841
  size: 129, 73
  orig: 129, 73
  offset: 0, 0
  index: -1
Untitled-1/Layer_25
  rotate: false
  xy: 319, 443
  size: 113, 122
  orig: 113, 122
  offset: 0, 0
  index: -1
Untitled-1/Layer_5
  rotate: false
  xy: 319, 841
  size: 156, 86
  orig: 156, 86
  offset: 0, 0
  index: -1
Untitled-1/Layer_3
  rotate: false
  xy: 457, 1
  size: 331, 576
  orig: 331, 576
  offset: 0, 0
  index: -1
Untitled-1/Layer_2
  rotate: false
  xy: 1, 1
  size: 454, 440
  orig: 454, 440
  offset: 0, 0
  index: -1
Untitled-1/Layer_4
  rotate: false
  xy: 403, 1289
  size: 230, 292
  orig: 230, 292
  offset: 0, 0
  index: -1
