%YAML 1.1
%TAG !u! tag:unity3d.com,2011:
--- !u!114 &11400000
MonoBehaviour:
  m_ObjectHideFlags: 0
  m_PrefabParentObject: {fileID: 0}
  m_PrefabInternal: {fileID: 0}
  m_GameObject: {fileID: 0}
  m_Enabled: 1
  m_EditorHideFlags: 0
  m_Script: {fileID: 11500000, guid: a6b194f808b1af6499c93410e504af42, type: 3}
  m_Name: 308_Atlas
  m_EditorClassIdentifier: 
  atlasFile: {fileID: 4900000, guid: 9449aebe13bcd5749bab19361499a751, type: 3}
  materials:
  - {fileID: 2100000, guid: 6f93bac45454d9346a96133f6f56bd20, type: 2}
  - {fileID: 2100000, guid: b7da021723d254a4789d84fc327083a7, type: 2}
