%YAML 1.1
%TAG !u! tag:unity3d.com,2011:
--- !u!90 &9000000
Avatar:
  m_ObjectHideFlags: 0
  m_CorrespondingSourceObject: {fileID: 0}
  m_PrefabInstance: {fileID: 0}
  m_PrefabAsset: {fileID: 0}
  m_Name: ms_006yglsw_dz_0
  m_AvatarSize: 12364
  m_Avatar:
    serializedVersion: 3
    m_AvatarSkeleton:
      data:
        m_Node:
        - m_ParentId: -1
          m_AxesId: -1
        - m_ParentId: 0
          m_AxesId: -1
        - m_ParentId: 0
          m_AxesId: -1
        - m_ParentId: 0
          m_AxesId: -1
        - m_ParentId: 0
          m_AxesId: -1
        - m_ParentId: 4
          m_AxesId: -1
        - m_ParentId: 5
          m_AxesId: -1
        - m_ParentId: 6
          m_AxesId: -1
        - m_ParentId: 7
          m_AxesId: -1
        - m_ParentId: 8
          m_AxesId: -1
        - m_ParentId: 9
          m_AxesId: -1
        - m_ParentId: 10
          m_AxesId: -1
        - m_ParentId: 9
          m_AxesId: -1
        - m_ParentId: 8
          m_AxesId: -1
        - m_ParentId: 6
          m_AxesId: -1
        - m_ParentId: 14
          m_AxesId: -1
        - m_ParentId: 15
          m_AxesId: -1
        - m_ParentId: 16
          m_AxesId: -1
        - m_ParentId: 17
          m_AxesId: -1
        - m_ParentId: 16
          m_AxesId: -1
        - m_ParentId: 15
          m_AxesId: -1
        - m_ParentId: 6
          m_AxesId: -1
        - m_ParentId: 21
          m_AxesId: -1
        - m_ParentId: 22
          m_AxesId: -1
        - m_ParentId: 23
          m_AxesId: -1
        - m_ParentId: 24
          m_AxesId: -1
        - m_ParentId: 25
          m_AxesId: -1
        - m_ParentId: 26
          m_AxesId: -1
        - m_ParentId: 27
          m_AxesId: -1
        - m_ParentId: 28
          m_AxesId: -1
        - m_ParentId: 25
          m_AxesId: -1
        - m_ParentId: 30
          m_AxesId: -1
        - m_ParentId: 31
          m_AxesId: -1
        - m_ParentId: 32
          m_AxesId: -1
        - m_ParentId: 25
          m_AxesId: -1
        - m_ParentId: 34
          m_AxesId: -1
        - m_ParentId: 35
          m_AxesId: -1
        - m_ParentId: 36
          m_AxesId: -1
        - m_ParentId: 25
          m_AxesId: -1
        - m_ParentId: 24
          m_AxesId: -1
        - m_ParentId: 22
          m_AxesId: -1
        - m_ParentId: 21
          m_AxesId: -1
        - m_ParentId: 41
          m_AxesId: -1
        - m_ParentId: 42
          m_AxesId: -1
        - m_ParentId: 43
          m_AxesId: -1
        - m_ParentId: 44
          m_AxesId: -1
        - m_ParentId: 45
          m_AxesId: -1
        - m_ParentId: 46
          m_AxesId: -1
        - m_ParentId: 47
          m_AxesId: -1
        - m_ParentId: 44
          m_AxesId: -1
        - m_ParentId: 49
          m_AxesId: -1
        - m_ParentId: 50
          m_AxesId: -1
        - m_ParentId: 51
          m_AxesId: -1
        - m_ParentId: 44
          m_AxesId: -1
        - m_ParentId: 53
          m_AxesId: -1
        - m_ParentId: 54
          m_AxesId: -1
        - m_ParentId: 55
          m_AxesId: -1
        - m_ParentId: 41
          m_AxesId: -1
        - m_ParentId: 21
          m_AxesId: -1
        - m_ParentId: 58
          m_AxesId: -1
        - m_ParentId: 58
          m_AxesId: -1
        - m_ParentId: 6
          m_AxesId: -1
        - m_ParentId: 6
          m_AxesId: -1
        - m_ParentId: 6
          m_AxesId: -1
        - m_ParentId: 6
          m_AxesId: -1
        - m_ParentId: 64
          m_AxesId: -1
        - m_ParentId: 65
          m_AxesId: -1
        - m_ParentId: 66
          m_AxesId: -1
        - m_ParentId: 67
          m_AxesId: -1
        - m_ParentId: 6
          m_AxesId: -1
        - m_ParentId: 69
          m_AxesId: -1
        - m_ParentId: 70
          m_AxesId: -1
        - m_ParentId: 71
          m_AxesId: -1
        - m_ParentId: 72
          m_AxesId: -1
        - m_ParentId: 6
          m_AxesId: -1
        - m_ParentId: 74
          m_AxesId: -1
        - m_ParentId: 75
          m_AxesId: -1
        - m_ParentId: 76
          m_AxesId: -1
        - m_ParentId: 77
          m_AxesId: -1
        - m_ParentId: 6
          m_AxesId: -1
        - m_ParentId: 79
          m_AxesId: -1
        - m_ParentId: 80
          m_AxesId: -1
        - m_ParentId: 81
          m_AxesId: -1
        - m_ParentId: 82
          m_AxesId: -1
        - m_ParentId: 6
          m_AxesId: -1
        - m_ParentId: 84
          m_AxesId: -1
        - m_ParentId: 85
          m_AxesId: -1
        - m_ParentId: 86
          m_AxesId: -1
        - m_ParentId: 87
          m_AxesId: -1
        - m_ParentId: 6
          m_AxesId: -1
        - m_ParentId: 89
          m_AxesId: -1
        - m_ParentId: 90
          m_AxesId: -1
        - m_ParentId: 91
          m_AxesId: -1
        - m_ParentId: 92
          m_AxesId: -1
        - m_ParentId: 6
          m_AxesId: -1
        - m_ParentId: 94
          m_AxesId: -1
        - m_ParentId: 95
          m_AxesId: -1
        - m_ParentId: 96
          m_AxesId: -1
        - m_ParentId: 97
          m_AxesId: -1
        - m_ParentId: 6
          m_AxesId: -1
        - m_ParentId: 99
          m_AxesId: -1
        - m_ParentId: 100
          m_AxesId: -1
        - m_ParentId: 101
          m_AxesId: -1
        - m_ParentId: 102
          m_AxesId: -1
        - m_ParentId: 6
          m_AxesId: -1
        - m_ParentId: 4
          m_AxesId: -1
        - m_ParentId: 105
          m_AxesId: -1
        m_ID: 0000000067e52a4b5e8653a0f660b0253d6cbca629d2f1fd4a8709845eb60bb092bd52cdd50b14b3f3d8d292e1171920e3cfce8a443e38f9cd51ea8725c0a56c41179e3a377482ffd0598789500d01af7346a38df1600983c017d2db2ed6071fecf31317b740507d06eb8b81f71516ba74eb91954393d38490db8cf6eea4ef746cf61d69c5d0a99c2a8a856f847194fc05d7f8b74f1427b4d81e6290d841215a35a7addd9ba6b5e203502c35d44502096520c8b0ff93334894e42db21c236f9c6e46051269a3343f8d55d47c043ee360e8057f0ad3f23da6e780aff46d1f06be62c1f1220051ff933966f86b93656ce55a2b942c6c76c6834017c86dfa46c1f4e747c09772d8278c822ddbe94a98108d410ffbb12982b1fe365311c0d8728cffff6d92f5ba7a2ab6cb26ce79874911b5f544fa1e073241ed775d3b57d2e2a37e8c35450f0b2d543bd0547924de90c4b88781892223a82a36a23ee9d1a3bfefb8cbb5e0883afd385c3c2d4ef8e2c039baf104c466a821ac3e7ce19ba2ac6b1d101e91ec065bbd581401e64a7f7bcc2345c5d0cd58bdfbf6f8bc256acd628c5e8eb0c4ae8d708c23604a769e41
        m_AxesArray: []
    m_AvatarSkeletonPose:
      data:
        m_X:
        - t: {x: 0, y: 0, z: 0}
          q: {x: 0, y: 0, z: 0, w: 1}
          s: {x: 1, y: 1, z: 1}
        - t: {x: 0, y: 0, z: 0}
          q: {x: -0.7071068, y: 0, z: 0, w: 0.7071068}
          s: {x: 1, y: 1, z: 1}
        - t: {x: 0, y: 0, z: 0.000000001876806}
          q: {x: 0.00000008146034, y: 0, z: 0, w: 1}
          s: {x: 1, y: 1, z: 1}
        - t: {x: -24.65049, y: 0, z: 63.56789}
          q: {x: -0.7071068, y: 0, z: 0, w: 0.7071068}
          s: {x: 1, y: 1, z: 1}
        - t: {x: -0.05925271, y: 1.409218, z: 0.01944494}
          q: {x: -0.1413725, y: 0.6928303, z: 0.6928303, w: 0.1413725}
          s: {x: 1, y: 1, z: 1}
        - t: {x: 0, y: 0, z: 0}
          q: {x: -0.443176, y: 0.5509945, z: 0.4431754, w: 0.5509952}
          s: {x: 1, y: 1, z: 1}
        - t: {x: -0.257894, y: -0.0003912821, z: 0.000001057982}
          q: {x: -0.0008300214, y: -0.00001907767, z: -0.02391159, w: 0.9997138}
          s: {x: 1, y: 0.9999999, z: 0.9999998}
        - t: {x: 0.257618, y: 0.01193485, z: 0.4741733}
          q: {x: 0.09049755, y: 0.9540122, z: 0.2503247, w: -0.1378714}
          s: {x: 1, y: 1, z: 1}
        - t: {x: -0.4112512, y: 0, z: -0.00000002980232}
          q: {x: -0.00000003256936, y: 0.00000003791093, z: 0.2436303, w: 0.9698682}
          s: {x: 0.9999999, y: 1, z: 0.9999999}
        - t: {x: -0.6196746, y: 0.00000005960464, z: 0.00000001490116}
          q: {x: 0.002443353, y: -0.09681918, z: 0.04507069, w: 0.994278}
          s: {x: 0.9999999, y: 0.9999999, z: 0.9999998}
        - t: {x: -0.4024869, y: 0.8165212, z: 0.00000002980232}
          q: {x: 0.05837111, y: 0.05832396, z: -0.7045405, w: 0.7048502}
          s: {x: 1, y: 1, z: 1}
        - t: {x: -0.5365428, y: 0, z: 0.00000001490116}
          q: {x: -4.562165e-25, y: -0.000000007450581, z: 1, w: 6.123234e-17}
          s: {x: -1, y: -1, z: -1}
        - t: {x: -0.4382369, y: 0.2711643, z: 0.008208334}
          q: {x: -0.4569749, y: -0.4140487, z: -0.5633019, w: 0.5499351}
          s: {x: 1, y: 1, z: 1}
        - t: {x: 0.05069572, y: -0.08096236, z: 0.02760875}
          q: {x: 0.002417888, y: 0.02040265, z: -0.1176485, w: 0.9928428}
          s: {x: 1, y: 1, z: 1}
        - t: {x: 0.2575428, y: 0.01350649, z: -0.4741732}
          q: {x: -0.3994769, y: 0.8950189, z: 0.1739546, w: 0.09538989}
          s: {x: 0.9999999, y: 1, z: 1}
        - t: {x: -0.4112512, y: 0.00000005960464, z: 0}
          q: {x: -0.000000004722157, y: -0.00000001868589, z: 0.4254641, w: 0.9049754}
          s: {x: 1, y: 0.9999999, z: 1}
        - t: {x: -0.6196747, y: -0.00000000372529, z: 0.00000005960464}
          q: {x: -0.01376743, y: -0.05215485, z: 0.2729997, w: 0.9605007}
          s: {x: 0.9999999, y: 0.9999999, z: 1}
        - t: {x: -0.4024869, y: 0.8165213, z: -0.00000004470348}
          q: {x: -0.08098088, y: -0.02943743, z: -0.690283, w: 0.7183905}
          s: {x: 1, y: 1, z: 1}
        - t: {x: -0.5365428, y: -0.00000001490116, z: -0.00000002980232}
          q: {x: -0.00000001490116, y: -0.00000001117587, z: -0.00000002980232, w: 1}
          s: {x: 1, y: 1, z: 1}
        - t: {x: -0.4555684, y: 0.2397515, z: -0.01014511}
          q: {x: 0.6499692, y: 0.6537634, z: 0.3118535, w: -0.2299588}
          s: {x: 1, y: 1, z: 1}
        - t: {x: 0.05069566, y: -0.0809623, z: -0.02760899}
          q: {x: 0.0293558, y: -0.01453811, z: -0.07983827, w: 0.9962695}
          s: {x: 1, y: 0.9999998, z: 1}
        - t: {x: -0.473485, y: 0.1512491, z: 0.0000002123415}
          q: {x: 0.000000003918296, y: 9.372058e-11, z: -0.000000001862645, w: 1}
          s: {x: 1, y: 1, z: 1}
        - t: {x: 0.1036532, y: -0.1511527, z: 0.2827792}
          q: {x: 0.7284462, y: 0.0002911157, z: -0.6851029, w: 0.0002718901}
          s: {x: 0.9999999, y: 1, z: 0.9999999}
        - t: {x: -0.61507, y: -0.00000005215406, z: 0}
          q: {x: 0.1211169, y: -0.3405214, z: -0.1225961, w: 0.9243085}
          s: {x: 1, y: 1, z: 1}
        - t: {x: -0.5474856, y: -0.00000005960464, z: 0}
          q: {x: -0.00000002871238, y: 0.00000001690627, z: 0.5438299, w: 0.8391955}
          s: {x: 1, y: 1, z: 1}
        - t: {x: -0.5095465, y: 0, z: 0}
          q: {x: -0.4314975, y: -0.01755391, z: 0.1263502, w: 0.8930495}
          s: {x: 0.9999999, y: 0.9999999, z: 0.9999999}
        - t: {x: -0.1261986, y: 0.08370185, z: -0.1419657}
          q: {x: 0.7943417, y: -0.5204084, z: 0.002948223, w: 0.313349}
          s: {x: 1, y: 1, z: 1}
        - t: {x: -0.0990572, y: -0.0000001192093, z: 0}
          q: {x: -0.00000001765329, y: -0.00000004256364, z: -0.1476369, w: 0.9890416}
          s: {x: 1, y: 0.9999999, z: 1}
        - t: {x: -0.07920849, y: 0.0000001192093, z: 0.00000002980232}
          q: {x: 0.00000000456723, y: 0.0000000069663, z: -0.1164022, w: 0.9932021}
          s: {x: 1, y: 1, z: 1}
        - t: {x: -0.0563221, y: 0, z: 0.00000002980232}
          q: {x: 0, y: 0, z: 0, w: 1}
          s: {x: 0.9999999, y: 0.9999999, z: 0.9999999}
        - t: {x: -0.1624418, y: -0.07710278, z: -0.06095219}
          q: {x: 0.005249687, y: 0.03542475, z: -0.2827104, w: 0.9585366}
          s: {x: 0.9999999, y: 1, z: 0.9999999}
        - t: {x: -0.141588, y: 0.0000001192093, z: 0}
          q: {x: -0.00000001456232, y: 0.00000001889254, z: -0.2370967, w: 0.971486}
          s: {x: 1, y: 1, z: 1}
        - t: {x: -0.12842, y: -0.0000001192093, z: 0}
          q: {x: 0.00000002802214, y: -0.00000001258766, z: -0.1762871, w: 0.9843388}
          s: {x: 0.9999999, y: 0.9999999, z: 1}
        - t: {x: -0.09505022, y: 0, z: 0}
          q: {x: -0.00000001490116, y: 0, z: 0, w: 1}
          s: {x: 1, y: 1, z: 1}
        - t: {x: -0.1742238, y: -0.05937719, z: 0.1259416}
          q: {x: -0.02490872, y: 0.04694953, z: -0.3132248, w: 0.9481906}
          s: {x: 1, y: 1, z: 1}
        - t: {x: -0.1220884, y: 0, z: -0.0000001192093}
          q: {x: -0.00000002753059, y: 0.00000000144643, z: -0.3203984, w: 0.9472829}
          s: {x: 1, y: 1, z: 1}
        - t: {x: -0.1056659, y: 0.00000005960464, z: 0}
          q: {x: 0.00000002203925, y: -0.000000003724492, z: -0.1666309, w: 0.9860194}
          s: {x: 1, y: 1, z: 1}
        - t: {x: -0.07920849, y: -0.0000001192093, z: -0.0000001192093}
          q: {x: -0.00000001117587, y: 0, z: 0, w: 1}
          s: {x: 1, y: 0.9999999, z: 1}
        - t: {x: -0.05772579, y: 0.08574009, z: -0.01501429}
          q: {x: 0.0000002533198, y: -0.00000003166495, z: 0.00000004470349, w: 1}
          s: {x: 1, y: 1, z: 1}
        - t: {x: -0.3774945, y: -0.02978322, z: 0.02821147}
          q: {x: 8.638045e-17, y: 6.100601e-18, z: -0.6555347, w: 0.755165}
          s: {x: 0.06972612, y: 0.06972612, z: 0.06972613}
        - t: {x: -0.4007599, y: -0.04985997, z: 0.1102695}
          q: {x: 0.02645442, y: 0.7066118, z: 0.7066118, w: -0.02645442}
          s: {x: -0.02667775, y: -0.02667776, z: -0.02667775}
        - t: {x: 0.1036532, y: -0.1511511, z: -0.2827796}
          q: {x: 0.7550858, y: -0.08280344, z: 0.6429747, w: -0.09784013}
          s: {x: 1, y: 0.9999999, z: 0.9999999}
        - t: {x: -0.6150701, y: -0.00000005960464, z: 0.0000001192093}
          q: {x: 0.02460368, y: 0.4147039, z: -0.298041, w: 0.8594108}
          s: {x: 1, y: 1, z: 1}
        - t: {x: -0.5474853, y: 0.00000008940697, z: 0.0000002384186}
          q: {x: 0.000000008475365, y: -0.00000007404562, z: 0.0888533, w: 0.9960448}
          s: {x: 0.9999999, y: 0.9999999, z: 1}
        - t: {x: -0.5095466, y: -0.00000006705523, z: -0.0000002384186}
          q: {x: 0.6726869, y: -0.06812083, z: 0.3318366, w: 0.6578271}
          s: {x: 1, y: 1, z: 0.9999999}
        - t: {x: -0.1261985, y: 0.08370209, z: 0.1419658}
          q: {x: 0.7943417, y: -0.5204084, z: -0.002948248, w: -0.313349}
          s: {x: 0.9999999, y: 0.9999998, z: 0.9999999}
        - t: {x: -0.09905744, y: -0.0000001192093, z: 0}
          q: {x: 0, y: 0, z: -0.1476369, w: 0.9890416}
          s: {x: 1, y: 1, z: 1}
        - t: {x: -0.07920837, y: 0.0000002384186, z: 0}
          q: {x: -0.000000009596281, y: 0.00000004613413, z: -0.1164022, w: 0.9932022}
          s: {x: 0.9999999, y: 1, z: 1}
        - t: {x: -0.05632186, y: 0, z: -0.0000002384186}
          q: {x: 0.00000001490116, y: -9.12433e-25, z: 1, w: 6.123234e-17}
          s: {x: -1, y: -1, z: -1}
        - t: {x: -0.162442, y: -0.07710278, z: 0.06095204}
          q: {x: -0.005249685, y: -0.03542475, z: -0.2827103, w: 0.9585366}
          s: {x: 0.9999998, y: 0.9999999, z: 0.9999998}
        - t: {x: -0.141588, y: 0, z: 0.0000000372529}
          q: {x: 0.00000001081418, y: 0.000000005029999, z: -0.2370968, w: 0.971486}
          s: {x: 1, y: 1, z: 1}
        - t: {x: -0.1284202, y: -0.0000002384186, z: -0.0000002160668}
          q: {x: -0.00000002161834, y: -0.00000001505114, z: -0.1762871, w: 0.9843388}
          s: {x: 1, y: 1, z: 1}
        - t: {x: -0.0950501, y: 0, z: -0.00000001490116}
          q: {x: 1.710812e-25, y: 0.000000002793968, z: 1, w: 6.123234e-17}
          s: {x: -1, y: -1, z: -1}
        - t: {x: -0.1742238, y: -0.05937707, z: -0.1259415}
          q: {x: 0.02490871, y: -0.04694957, z: -0.3132249, w: 0.9481906}
          s: {x: 1, y: 1, z: 1}
        - t: {x: -0.1220883, y: -0.0000002384186, z: 0}
          q: {x: 0.000000006175581, y: -0.00000000208876, z: -0.3203984, w: 0.9472829}
          s: {x: 1, y: 1, z: 1}
        - t: {x: -0.105666, y: -0.0000002384186, z: -0.00000005960464}
          q: {x: 0.00000001588305, y: -0.00000001779657, z: -0.1666308, w: 0.9860194}
          s: {x: 1, y: 1, z: 1}
        - t: {x: -0.07920849, y: 0, z: -0.00000001490116}
          q: {x: -1.026487e-24, y: -0.0000000167638, z: 1, w: 6.123234e-17}
          s: {x: -0.9999999, y: -1, z: -1}
        - t: {x: -0.4007596, y: -0.04985811, z: -0.1102693}
          q: {x: 0.7066121, y: -0.0264555, z: 0.02645326, w: 0.7066114}
          s: {x: 0.02667776, y: 0.02667776, z: 0.02667775}
        - t: {x: -0.09475636, y: -0.00000001490116, z: 0}
          q: {x: 0.1901869, y: 0.0188552, z: -0.108952, w: 0.9755014}
          s: {x: 0.9999999, y: 1, z: 1}
        - t: {x: -0.7507656, y: 0, z: 0.00000001490116}
          q: {x: 0.00000001769513, y: 2.636779e-16, z: 0.00000001490116, w: 1}
          s: {x: 1, y: 1, z: 1}
        - t: {x: -1.350301, y: -0.2621771, z: 0.01990008}
          q: {x: -0.5548301, y: 0.434024, z: 0.5687836, w: 0.4245843}
          s: {x: 1, y: 1, z: 1}
        - t: {x: 0.04767406, y: -0.4912963, z: -0.4402111}
          q: {x: -0.6278727, y: -0.3252304, z: -0.324731, w: 0.6281329}
          s: {x: 0.02667776, y: 0.02667775, z: 0.02667775}
        - t: {x: -0.06052547, y: -0.4822698, z: -0.0000002384186}
          q: {x: -0.7071008, y: 0.00183559, z: 0.002398648, w: 0.7071063}
          s: {x: 0.02667775, y: 0.02667775, z: 0.02667775}
        - t: {x: 0.04767394, y: -0.4912975, z: 0.4402099}
          q: {x: 0.3252302, y: -0.6278738, z: 0.6281323, w: 0.3247301}
          s: {x: -0.02667775, y: -0.02667775, z: -0.02667775}
        - t: {x: -0.4442003, y: -0.4339931, z: -0.1751995}
          q: {x: 0.2474331, y: 0.95098, z: 0.03174614, w: -0.1827736}
          s: {x: 0.02667774, y: 0.02667776, z: 0.02667777}
        - t: {x: -46.85373, y: 0, z: -0.000001907349}
          q: {x: 0.002475134, y: -0.02069561, z: 0.2219303, w: 0.9748397}
          s: {x: 1, y: 1, z: 1}
        - t: {x: -39.66959, y: 0.000007629395, z: -0.00002098083}
          q: {x: -0.09399914, y: -0.002604729, z: 0.1944656, w: 0.9763916}
          s: {x: 0.9999999, y: 1, z: 0.9999998}
        - t: {x: -33.79737, y: -0.000005722046, z: -0.00001335144}
          q: {x: 0.05229, y: -0.01235607, z: 0.1807548, w: 0.9820595}
          s: {x: 1, y: 1, z: 1}
        - t: {x: -31.31343, y: 0.000001759636, z: 0.000004601625}
          q: {x: -0.03331592, y: 0.006509183, z: 0.05699994, w: 0.997797}
          s: {x: 1, y: 1, z: 1}
        - t: {x: -0.3890647, y: -0.4413284, z: -0.2344823}
          q: {x: 0.2769288, y: -0.1238489, z: 0.930716, w: 0.2043029}
          s: {x: 0.02667774, y: 0.02667774, z: 0.02667775}
        - t: {x: -54.65702, y: 0, z: 0.000003814697}
          q: {x: -0.001010952, y: -0.04281994, z: -0.18018, w: 0.9827006}
          s: {x: 0.9999999, y: 0.9999997, z: 0.9999999}
        - t: {x: -34.2781, y: 0.000003814697, z: -0.000003814697}
          q: {x: 0.01120693, y: -0.02211141, z: -0.1474297, w: 0.9887618}
          s: {x: 1, y: 1, z: 0.9999999}
        - t: {x: -33.0394, y: -0.00001907349, z: 0}
          q: {x: -0.04934057, y: -0.004735386, z: -0.2038004, w: 0.9777569}
          s: {x: 1, y: 0.9999998, z: 1}
        - t: {x: -28.38665, y: 0.00001129413, z: 0.000000659842}
          q: {x: 0.1205935, y: -0.002298514, z: 0.0695224, w: 0.9902619}
          s: {x: 1, y: 1, z: 1}
        - t: {x: -0.3890647, y: -0.4413284, z: -0.2344823}
          q: {x: 0.2476068, y: -0.5300314, z: 0.7600319, w: 0.2830355}
          s: {x: 0.02667774, y: 0.02667775, z: 0.02667774}
        - t: {x: -55.56799, y: 0.000007629395, z: -0.000008583069}
          q: {x: -0.004151167, y: -0.08200022, z: -0.2196658, w: 0.972114}
          s: {x: 0.9999998, y: 1, z: 0.9999997}
        - t: {x: -34.74318, y: 0.00001525879, z: 0.000008583069}
          q: {x: 0.0131574, y: 0.02083701, z: -0.2196263, w: 0.9752728}
          s: {x: 0.9999999, y: 1, z: 1}
        - t: {x: -30.15459, y: -0.00003051758, z: -0.00001144409}
          q: {x: -0.05621544, y: 0.0195235, z: -0.1538884, w: 0.9862946}
          s: {x: 0.9999998, y: 0.9999996, z: 1}
        - t: {x: -22.6457, y: 0.00001046339, z: 0.000001867768}
          q: {x: 0.07180173, y: 0.0388117, z: -0.02837616, w: 0.9962595}
          s: {x: 1, y: 1, z: 1}
        - t: {x: -0.3370239, y: -0.4229784, z: -0.2625754}
          q: {x: -0.05541435, y: 0.8058962, z: -0.4780728, w: -0.3448288}
          s: {x: 0.02667775, y: 0.02667775, z: 0.02667776}
        - t: {x: -46.31775, y: -0.000001907349, z: 0.000003814697}
          q: {x: -0.1322198, y: -0.06576698, z: -0.1165371, w: 0.9821465}
          s: {x: 0.9999999, y: 0.9999999, z: 1}
        - t: {x: -29.13919, y: 0.000004768372, z: 0.000003814697}
          q: {x: -0.08262765, y: 0.06051611, z: -0.2340076, w: 0.9668252}
          s: {x: 1, y: 0.9999999, z: 0.9999998}
        - t: {x: -30.30359, y: -0.00000667572, z: -0.000003814697}
          q: {x: -0.06992784, y: 0.05457924, z: -0.156126, w: 0.9837458}
          s: {x: 0.9999998, y: 0.9999999, z: 1}
        - t: {x: -27.14526, y: 0.00001572371, z: -0.00001639675}
          q: {x: 0.006077281, y: -0.01100794, z: 0.05975041, w: 0.9981342}
          s: {x: 1, y: 1, z: 1}
        - t: {x: -0.3370239, y: -0.4229791, z: 0.262575}
          q: {x: -0.7845296, y: -0.07158133, z: -0.3552949, w: 0.5031451}
          s: {x: -0.02667775, y: -0.02667773, z: -0.02667776}
        - t: {x: -46.31775, y: -0.000003814697, z: -0.000003814697}
          q: {x: -0.1327743, y: -0.0704993, z: -0.1166919, w: 0.9817249}
          s: {x: 0.9999998, y: 0.9999999, z: 0.9999999}
        - t: {x: -29.13918, y: 0.000001907349, z: 0.000003814697}
          q: {x: -0.08527336, y: 0.05110007, z: -0.2362417, w: 0.9665956}
          s: {x: 1, y: 0.9999998, z: 1}
        - t: {x: -30.3036, y: -0.000001907349, z: 0.000007629395}
          q: {x: -0.07439479, y: 0.03417691, z: -0.1646226, w: 0.9829531}
          s: {x: 1, y: 1, z: 1}
        - t: {x: -27.14526, y: 0.00001572371, z: -0.00001639675}
          q: {x: 0.006077281, y: -0.01100794, z: 0.05975041, w: 0.9981342}
          s: {x: 1, y: 1, z: 1}
        - t: {x: -0.4442004, y: -0.4339936, z: 0.1751982}
          q: {x: 0.9514671, y: -0.2356187, z: 0.1979719, w: -0.001192657}
          s: {x: -0.02667775, y: -0.02667774, z: -0.02667776}
        - t: {x: -46.85373, y: 0.000007629395, z: 0.000003814697}
          q: {x: 0.002414669, y: -0.02020317, z: 0.2204242, w: 0.9751919}
          s: {x: 0.9999999, y: 0.9999999, z: 1}
        - t: {x: -39.66958, y: -0.000007629395, z: -0.00001907349}
          q: {x: -0.09441453, y: 0.0001465418, z: 0.1918533, w: 0.9768716}
          s: {x: 0.9999999, y: 0.9999998, z: 1}
        - t: {x: -33.79738, y: 0.000001907349, z: -0.000003814697}
          q: {x: 0.05166607, y: -0.004966591, z: 0.1789542, w: 0.9824874}
          s: {x: 1, y: 1, z: 1}
        - t: {x: -31.31343, y: 0.000001759636, z: 0.000004601625}
          q: {x: -0.03331592, y: 0.006509183, z: 0.05699994, w: 0.997797}
          s: {x: 1, y: 1, z: 1}
        - t: {x: -0.3890647, y: -0.4413291, z: 0.2344815}
          q: {x: -0.4767417, y: -0.2706186, z: -0.3005514, w: 0.7804818}
          s: {x: -0.02667774, y: -0.02667776, z: -0.02667774}
        - t: {x: -55.568, y: 0.000007629395, z: -0.0000002384186}
          q: {x: -0.004422752, y: -0.08372204, z: -0.2209432, w: 0.9716765}
          s: {x: 1, y: 1, z: 1}
        - t: {x: -34.74317, y: 0.00001144409, z: 0.000002861023}
          q: {x: 0.02411954, y: 0.01946091, z: -0.2900251, w: 0.9565171}
          s: {x: 0.9999998, y: 0.9999996, z: 0.9999996}
        - t: {x: -30.15459, y: -0.00003051758, z: -0.000008106232}
          q: {x: -0.02212522, y: 0.04156339, z: -0.4084843, w: 0.9115501}
          s: {x: 0.9999998, y: 1, z: 1}
        - t: {x: -22.6457, y: 0.00001046339, z: 0.000001867768}
          q: {x: 0.07180173, y: 0.0388117, z: -0.02837616, w: 0.9962595}
          s: {x: 1, y: 1, z: 1}
        - t: {x: -0.3890647, y: -0.4413291, z: 0.2344815}
          q: {x: -0.06537253, y: -0.3027742, z: -0.2054279, w: 0.9283607}
          s: {x: -0.02667775, y: -0.02667776, z: -0.02667774}
        - t: {x: -54.65701, y: 0.000007629395, z: -0.000007629395}
          q: {x: -0.001384687, y: -0.04488522, z: -0.1800555, w: 0.9826309}
          s: {x: 0.9999999, y: 0.9999998, z: 0.9999999}
        - t: {x: -34.27811, y: 0.000003814697, z: 0.000007629395}
          q: {x: 0.01042865, y: -0.0278589, z: -0.1457651, w: 0.9888719}
          s: {x: 0.9999998, y: 0.9999999, z: 0.9999999}
        - t: {x: -33.0394, y: -0.00002479553, z: 0.000003814697}
          q: {x: -0.05143471, y: -0.01911004, z: -0.1977904, w: 0.9787074}
          s: {x: 0.9999999, y: 0.9999998, z: 1}
        - t: {x: -28.38665, y: 0.00001129413, z: 0.000000659842}
          q: {x: 0.1205935, y: -0.002298514, z: 0.0695224, w: 0.9902619}
          s: {x: 1, y: 1, z: 1}
        - t: {x: -0.002679318, y: 0.7408131, z: 0.1624331}
          q: {x: -0.4024743, y: 0.3836718, z: 0.6015968, w: 0.5734908}
          s: {x: 1, y: 1, z: 1}
        - t: {x: 0.7571106, y: 1.645631, z: -0.1029674}
          q: {x: 0.7046469, y: -0.05893007, z: -0.05893007, w: 0.7046469}
          s: {x: 1, y: 1, z: 1}
        - t: {x: 0.000001966953, y: 0.0000003576279, z: 5.752304}
          q: {x: 0.000000004445793, y: 0.0000002384186, z: -0.00000007241033, w: 1}
          s: {x: 1, y: 1, z: 1}
    m_DefaultPose:
      data:
        m_X:
        - t: {x: 0, y: 0, z: 0}
          q: {x: 0, y: 0, z: 0, w: 1}
          s: {x: 1, y: 1, z: 1}
        - t: {x: 0, y: 0, z: 0}
          q: {x: -0.7071068, y: 0, z: 0, w: 0.7071068}
          s: {x: 1, y: 1, z: 1}
        - t: {x: 0, y: 0, z: 0.000000001876806}
          q: {x: 0.00000008146034, y: 0, z: 0, w: 1}
          s: {x: 1, y: 1, z: 1}
        - t: {x: -24.65049, y: 0, z: 63.56789}
          q: {x: -0.7071068, y: 0, z: 0, w: 0.7071068}
          s: {x: 1, y: 1, z: 1}
        - t: {x: -0.05925271, y: 1.409218, z: 0.01944494}
          q: {x: -0.1413725, y: 0.6928303, z: 0.6928303, w: 0.1413725}
          s: {x: 1, y: 1, z: 1}
        - t: {x: 0, y: 0, z: 0}
          q: {x: -0.443176, y: 0.5509945, z: 0.4431754, w: 0.5509952}
          s: {x: 1, y: 1, z: 1}
        - t: {x: -0.257894, y: -0.0003912821, z: 0.000001057982}
          q: {x: -0.0008300214, y: -0.00001907767, z: -0.02391159, w: 0.9997138}
          s: {x: 1, y: 0.9999999, z: 0.9999998}
        - t: {x: 0.257618, y: 0.01193485, z: 0.4741733}
          q: {x: 0.09049755, y: 0.9540122, z: 0.2503247, w: -0.1378714}
          s: {x: 1, y: 1, z: 1}
        - t: {x: -0.4112512, y: 0, z: -0.00000002980232}
          q: {x: -0.00000003256936, y: 0.00000003791093, z: 0.2436303, w: 0.9698682}
          s: {x: 0.9999999, y: 1, z: 0.9999999}
        - t: {x: -0.6196746, y: 0.00000005960464, z: 0.00000001490116}
          q: {x: 0.002443353, y: -0.09681918, z: 0.04507069, w: 0.994278}
          s: {x: 0.9999999, y: 0.9999999, z: 0.9999998}
        - t: {x: -0.4024869, y: 0.8165212, z: 0.00000002980232}
          q: {x: 0.05837111, y: 0.05832396, z: -0.7045405, w: 0.7048502}
          s: {x: 1, y: 1, z: 1}
        - t: {x: -0.5365428, y: 0, z: 0.00000001490116}
          q: {x: -4.562165e-25, y: -0.000000007450581, z: 1, w: 6.123234e-17}
          s: {x: -1, y: -1, z: -1}
        - t: {x: -0.4382369, y: 0.2711643, z: 0.008208334}
          q: {x: -0.4569749, y: -0.4140487, z: -0.5633019, w: 0.5499351}
          s: {x: 1, y: 1, z: 1}
        - t: {x: 0.05069572, y: -0.08096236, z: 0.02760875}
          q: {x: 0.002417888, y: 0.02040265, z: -0.1176485, w: 0.9928428}
          s: {x: 1, y: 1, z: 1}
        - t: {x: 0.2575428, y: 0.01350649, z: -0.4741732}
          q: {x: -0.3994769, y: 0.8950189, z: 0.1739546, w: 0.09538989}
          s: {x: 0.9999999, y: 1, z: 1}
        - t: {x: -0.4112512, y: 0.00000005960464, z: 0}
          q: {x: -0.000000004722157, y: -0.00000001868589, z: 0.4254641, w: 0.9049754}
          s: {x: 1, y: 0.9999999, z: 1}
        - t: {x: -0.6196747, y: -0.00000000372529, z: 0.00000005960464}
          q: {x: -0.01376743, y: -0.05215485, z: 0.2729997, w: 0.9605007}
          s: {x: 0.9999999, y: 0.9999999, z: 1}
        - t: {x: -0.4024869, y: 0.8165213, z: -0.00000004470348}
          q: {x: -0.08098088, y: -0.02943743, z: -0.690283, w: 0.7183905}
          s: {x: 1, y: 1, z: 1}
        - t: {x: -0.5365428, y: -0.00000001490116, z: -0.00000002980232}
          q: {x: -0.00000001490116, y: -0.00000001117587, z: -0.00000002980232, w: 1}
          s: {x: 1, y: 1, z: 1}
        - t: {x: -0.4555684, y: 0.2397515, z: -0.01014511}
          q: {x: 0.6499692, y: 0.6537634, z: 0.3118535, w: -0.2299588}
          s: {x: 1, y: 1, z: 1}
        - t: {x: 0.05069566, y: -0.0809623, z: -0.02760899}
          q: {x: 0.0293558, y: -0.01453811, z: -0.07983827, w: 0.9962695}
          s: {x: 1, y: 0.9999998, z: 1}
        - t: {x: -0.473485, y: 0.1512491, z: 0.0000002123415}
          q: {x: 0.000000003918296, y: 9.372058e-11, z: -0.000000001862645, w: 1}
          s: {x: 1, y: 1, z: 1}
        - t: {x: 0.1036532, y: -0.1511527, z: 0.2827792}
          q: {x: 0.7284462, y: 0.0002911157, z: -0.6851029, w: 0.0002718901}
          s: {x: 0.9999999, y: 1, z: 0.9999999}
        - t: {x: -0.61507, y: -0.00000005215406, z: 0}
          q: {x: 0.1211169, y: -0.3405214, z: -0.1225961, w: 0.9243085}
          s: {x: 1, y: 1, z: 1}
        - t: {x: -0.5474856, y: -0.00000005960464, z: 0}
          q: {x: -0.00000002871238, y: 0.00000001690627, z: 0.5438299, w: 0.8391955}
          s: {x: 1, y: 1, z: 1}
        - t: {x: -0.5095465, y: 0, z: 0}
          q: {x: -0.4314975, y: -0.01755391, z: 0.1263502, w: 0.8930495}
          s: {x: 0.9999999, y: 0.9999999, z: 0.9999999}
        - t: {x: -0.1261986, y: 0.08370185, z: -0.1419657}
          q: {x: 0.7943417, y: -0.5204084, z: 0.002948223, w: 0.313349}
          s: {x: 1, y: 1, z: 1}
        - t: {x: -0.0990572, y: -0.0000001192093, z: 0}
          q: {x: -0.00000001765329, y: -0.00000004256364, z: -0.1476369, w: 0.9890416}
          s: {x: 1, y: 0.9999999, z: 1}
        - t: {x: -0.07920849, y: 0.0000001192093, z: 0.00000002980232}
          q: {x: 0.00000000456723, y: 0.0000000069663, z: -0.1164022, w: 0.9932021}
          s: {x: 1, y: 1, z: 1}
        - t: {x: -0.0563221, y: 0, z: 0.00000002980232}
          q: {x: 0, y: 0, z: 0, w: 1}
          s: {x: 0.9999999, y: 0.9999999, z: 0.9999999}
        - t: {x: -0.1624418, y: -0.07710278, z: -0.06095219}
          q: {x: 0.005249687, y: 0.03542475, z: -0.2827104, w: 0.9585366}
          s: {x: 0.9999999, y: 1, z: 0.9999999}
        - t: {x: -0.141588, y: 0.0000001192093, z: 0}
          q: {x: -0.00000001456232, y: 0.00000001889254, z: -0.2370967, w: 0.971486}
          s: {x: 1, y: 1, z: 1}
        - t: {x: -0.12842, y: -0.0000001192093, z: 0}
          q: {x: 0.00000002802214, y: -0.00000001258766, z: -0.1762871, w: 0.9843388}
          s: {x: 0.9999999, y: 0.9999999, z: 1}
        - t: {x: -0.09505022, y: 0, z: 0}
          q: {x: -0.00000001490116, y: 0, z: 0, w: 1}
          s: {x: 1, y: 1, z: 1}
        - t: {x: -0.1742238, y: -0.05937719, z: 0.1259416}
          q: {x: -0.02490872, y: 0.04694953, z: -0.3132248, w: 0.9481906}
          s: {x: 1, y: 1, z: 1}
        - t: {x: -0.1220884, y: 0, z: -0.0000001192093}
          q: {x: -0.00000002753059, y: 0.00000000144643, z: -0.3203984, w: 0.9472829}
          s: {x: 1, y: 1, z: 1}
        - t: {x: -0.1056659, y: 0.00000005960464, z: 0}
          q: {x: 0.00000002203925, y: -0.000000003724492, z: -0.1666309, w: 0.9860194}
          s: {x: 1, y: 1, z: 1}
        - t: {x: -0.07920849, y: -0.0000001192093, z: -0.0000001192093}
          q: {x: -0.00000001117587, y: 0, z: 0, w: 1}
          s: {x: 1, y: 0.9999999, z: 1}
        - t: {x: -0.05772579, y: 0.08574009, z: -0.01501429}
          q: {x: 0.0000002533198, y: -0.00000003166495, z: 0.00000004470349, w: 1}
          s: {x: 1, y: 1, z: 1}
        - t: {x: -0.3774945, y: -0.02978322, z: 0.02821147}
          q: {x: 8.638045e-17, y: 6.100601e-18, z: -0.6555347, w: 0.755165}
          s: {x: 0.06972612, y: 0.06972612, z: 0.06972613}
        - t: {x: -0.4007599, y: -0.04985997, z: 0.1102695}
          q: {x: 0.02645442, y: 0.7066118, z: 0.7066118, w: -0.02645442}
          s: {x: -0.02667775, y: -0.02667776, z: -0.02667775}
        - t: {x: 0.1036532, y: -0.1511511, z: -0.2827796}
          q: {x: 0.7550858, y: -0.08280344, z: 0.6429747, w: -0.09784013}
          s: {x: 1, y: 0.9999999, z: 0.9999999}
        - t: {x: -0.6150701, y: -0.00000005960464, z: 0.0000001192093}
          q: {x: 0.02460368, y: 0.4147039, z: -0.298041, w: 0.8594108}
          s: {x: 1, y: 1, z: 1}
        - t: {x: -0.5474853, y: 0.00000008940697, z: 0.0000002384186}
          q: {x: 0.000000008475365, y: -0.00000007404562, z: 0.0888533, w: 0.9960448}
          s: {x: 0.9999999, y: 0.9999999, z: 1}
        - t: {x: -0.5095466, y: -0.00000006705523, z: -0.0000002384186}
          q: {x: 0.6726869, y: -0.06812083, z: 0.3318366, w: 0.6578271}
          s: {x: 1, y: 1, z: 0.9999999}
        - t: {x: -0.1261985, y: 0.08370209, z: 0.1419658}
          q: {x: 0.7943417, y: -0.5204084, z: -0.002948248, w: -0.313349}
          s: {x: 0.9999999, y: 0.9999998, z: 0.9999999}
        - t: {x: -0.09905744, y: -0.0000001192093, z: 0}
          q: {x: 0, y: 0, z: -0.1476369, w: 0.9890416}
          s: {x: 1, y: 1, z: 1}
        - t: {x: -0.07920837, y: 0.0000002384186, z: 0}
          q: {x: -0.000000009596281, y: 0.00000004613413, z: -0.1164022, w: 0.9932022}
          s: {x: 0.9999999, y: 1, z: 1}
        - t: {x: -0.05632186, y: 0, z: -0.0000002384186}
          q: {x: 0.00000001490116, y: -9.12433e-25, z: 1, w: 6.123234e-17}
          s: {x: -1, y: -1, z: -1}
        - t: {x: -0.162442, y: -0.07710278, z: 0.06095204}
          q: {x: -0.005249685, y: -0.03542475, z: -0.2827103, w: 0.9585366}
          s: {x: 0.9999998, y: 0.9999999, z: 0.9999998}
        - t: {x: -0.141588, y: 0, z: 0.0000000372529}
          q: {x: 0.00000001081418, y: 0.000000005029999, z: -0.2370968, w: 0.971486}
          s: {x: 1, y: 1, z: 1}
        - t: {x: -0.1284202, y: -0.0000002384186, z: -0.0000002160668}
          q: {x: -0.00000002161834, y: -0.00000001505114, z: -0.1762871, w: 0.9843388}
          s: {x: 1, y: 1, z: 1}
        - t: {x: -0.0950501, y: 0, z: -0.00000001490116}
          q: {x: 1.710812e-25, y: 0.000000002793968, z: 1, w: 6.123234e-17}
          s: {x: -1, y: -1, z: -1}
        - t: {x: -0.1742238, y: -0.05937707, z: -0.1259415}
          q: {x: 0.02490871, y: -0.04694957, z: -0.3132249, w: 0.9481906}
          s: {x: 1, y: 1, z: 1}
        - t: {x: -0.1220883, y: -0.0000002384186, z: 0}
          q: {x: 0.000000006175581, y: -0.00000000208876, z: -0.3203984, w: 0.9472829}
          s: {x: 1, y: 1, z: 1}
        - t: {x: -0.105666, y: -0.0000002384186, z: -0.00000005960464}
          q: {x: 0.00000001588305, y: -0.00000001779657, z: -0.1666308, w: 0.9860194}
          s: {x: 1, y: 1, z: 1}
        - t: {x: -0.07920849, y: 0, z: -0.00000001490116}
          q: {x: -1.026487e-24, y: -0.0000000167638, z: 1, w: 6.123234e-17}
          s: {x: -0.9999999, y: -1, z: -1}
        - t: {x: -0.4007596, y: -0.04985811, z: -0.1102693}
          q: {x: 0.7066121, y: -0.0264555, z: 0.02645326, w: 0.7066114}
          s: {x: 0.02667776, y: 0.02667776, z: 0.02667775}
        - t: {x: -0.09475636, y: -0.00000001490116, z: 0}
          q: {x: 0.1901869, y: 0.0188552, z: -0.108952, w: 0.9755014}
          s: {x: 0.9999999, y: 1, z: 1}
        - t: {x: -0.7507656, y: 0, z: 0.00000001490116}
          q: {x: 0.00000001769513, y: 2.636779e-16, z: 0.00000001490116, w: 1}
          s: {x: 1, y: 1, z: 1}
        - t: {x: -1.350301, y: -0.2621771, z: 0.01990008}
          q: {x: -0.5548301, y: 0.434024, z: 0.5687836, w: 0.4245843}
          s: {x: 1, y: 1, z: 1}
        - t: {x: 0.04767406, y: -0.4912963, z: -0.4402111}
          q: {x: -0.6278727, y: -0.3252304, z: -0.324731, w: 0.6281329}
          s: {x: 0.02667776, y: 0.02667775, z: 0.02667775}
        - t: {x: -0.06052547, y: -0.4822698, z: -0.0000002384186}
          q: {x: -0.7071008, y: 0.00183559, z: 0.002398648, w: 0.7071063}
          s: {x: 0.02667775, y: 0.02667775, z: 0.02667775}
        - t: {x: 0.04767394, y: -0.4912975, z: 0.4402099}
          q: {x: 0.3252302, y: -0.6278738, z: 0.6281323, w: 0.3247301}
          s: {x: -0.02667775, y: -0.02667775, z: -0.02667775}
        - t: {x: -0.4442003, y: -0.4339931, z: -0.1751995}
          q: {x: 0.2474331, y: 0.95098, z: 0.03174614, w: -0.1827736}
          s: {x: 0.02667774, y: 0.02667776, z: 0.02667777}
        - t: {x: -46.85373, y: 0, z: -0.000001907349}
          q: {x: 0.002475134, y: -0.02069561, z: 0.2219303, w: 0.9748397}
          s: {x: 1, y: 1, z: 1}
        - t: {x: -39.66959, y: 0.000007629395, z: -0.00002098083}
          q: {x: -0.09399914, y: -0.002604729, z: 0.1944656, w: 0.9763916}
          s: {x: 0.9999999, y: 1, z: 0.9999998}
        - t: {x: -33.79737, y: -0.000005722046, z: -0.00001335144}
          q: {x: 0.05229, y: -0.01235607, z: 0.1807548, w: 0.9820595}
          s: {x: 1, y: 1, z: 1}
        - t: {x: -31.31343, y: 0.000001759636, z: 0.000004601625}
          q: {x: -0.03331592, y: 0.006509183, z: 0.05699994, w: 0.997797}
          s: {x: 1, y: 1, z: 1}
        - t: {x: -0.3890647, y: -0.4413284, z: -0.2344823}
          q: {x: 0.2769288, y: -0.1238489, z: 0.930716, w: 0.2043029}
          s: {x: 0.02667774, y: 0.02667774, z: 0.02667775}
        - t: {x: -54.65702, y: 0, z: 0.000003814697}
          q: {x: -0.001010952, y: -0.04281994, z: -0.18018, w: 0.9827006}
          s: {x: 0.9999999, y: 0.9999997, z: 0.9999999}
        - t: {x: -34.2781, y: 0.000003814697, z: -0.000003814697}
          q: {x: 0.01120693, y: -0.02211141, z: -0.1474297, w: 0.9887618}
          s: {x: 1, y: 1, z: 0.9999999}
        - t: {x: -33.0394, y: -0.00001907349, z: 0}
          q: {x: -0.04934057, y: -0.004735386, z: -0.2038004, w: 0.9777569}
          s: {x: 1, y: 0.9999998, z: 1}
        - t: {x: -28.38665, y: 0.00001129413, z: 0.000000659842}
          q: {x: 0.1205935, y: -0.002298514, z: 0.0695224, w: 0.9902619}
          s: {x: 1, y: 1, z: 1}
        - t: {x: -0.3890647, y: -0.4413284, z: -0.2344823}
          q: {x: 0.2476068, y: -0.5300314, z: 0.7600319, w: 0.2830355}
          s: {x: 0.02667774, y: 0.02667775, z: 0.02667774}
        - t: {x: -55.56799, y: 0.000007629395, z: -0.000008583069}
          q: {x: -0.004151167, y: -0.08200022, z: -0.2196658, w: 0.972114}
          s: {x: 0.9999998, y: 1, z: 0.9999997}
        - t: {x: -34.74318, y: 0.00001525879, z: 0.000008583069}
          q: {x: 0.0131574, y: 0.02083701, z: -0.2196263, w: 0.9752728}
          s: {x: 0.9999999, y: 1, z: 1}
        - t: {x: -30.15459, y: -0.00003051758, z: -0.00001144409}
          q: {x: -0.05621544, y: 0.0195235, z: -0.1538884, w: 0.9862946}
          s: {x: 0.9999998, y: 0.9999996, z: 1}
        - t: {x: -22.6457, y: 0.00001046339, z: 0.000001867768}
          q: {x: 0.07180173, y: 0.0388117, z: -0.02837616, w: 0.9962595}
          s: {x: 1, y: 1, z: 1}
        - t: {x: -0.3370239, y: -0.4229784, z: -0.2625754}
          q: {x: -0.05541435, y: 0.8058962, z: -0.4780728, w: -0.3448288}
          s: {x: 0.02667775, y: 0.02667775, z: 0.02667776}
        - t: {x: -46.31775, y: -0.000001907349, z: 0.000003814697}
          q: {x: -0.1322198, y: -0.06576698, z: -0.1165371, w: 0.9821465}
          s: {x: 0.9999999, y: 0.9999999, z: 1}
        - t: {x: -29.13919, y: 0.000004768372, z: 0.000003814697}
          q: {x: -0.08262765, y: 0.06051611, z: -0.2340076, w: 0.9668252}
          s: {x: 1, y: 0.9999999, z: 0.9999998}
        - t: {x: -30.30359, y: -0.00000667572, z: -0.000003814697}
          q: {x: -0.06992784, y: 0.05457924, z: -0.156126, w: 0.9837458}
          s: {x: 0.9999998, y: 0.9999999, z: 1}
        - t: {x: -27.14526, y: 0.00001572371, z: -0.00001639675}
          q: {x: 0.006077281, y: -0.01100794, z: 0.05975041, w: 0.9981342}
          s: {x: 1, y: 1, z: 1}
        - t: {x: -0.3370239, y: -0.4229791, z: 0.262575}
          q: {x: -0.7845296, y: -0.07158133, z: -0.3552949, w: 0.5031451}
          s: {x: -0.02667775, y: -0.02667773, z: -0.02667776}
        - t: {x: -46.31775, y: -0.000003814697, z: -0.000003814697}
          q: {x: -0.1327743, y: -0.0704993, z: -0.1166919, w: 0.9817249}
          s: {x: 0.9999998, y: 0.9999999, z: 0.9999999}
        - t: {x: -29.13918, y: 0.000001907349, z: 0.000003814697}
          q: {x: -0.08527336, y: 0.05110007, z: -0.2362417, w: 0.9665956}
          s: {x: 1, y: 0.9999998, z: 1}
        - t: {x: -30.3036, y: -0.000001907349, z: 0.000007629395}
          q: {x: -0.07439479, y: 0.03417691, z: -0.1646226, w: 0.9829531}
          s: {x: 1, y: 1, z: 1}
        - t: {x: -27.14526, y: 0.00001572371, z: -0.00001639675}
          q: {x: 0.006077281, y: -0.01100794, z: 0.05975041, w: 0.9981342}
          s: {x: 1, y: 1, z: 1}
        - t: {x: -0.4442004, y: -0.4339936, z: 0.1751982}
          q: {x: 0.9514671, y: -0.2356187, z: 0.1979719, w: -0.001192657}
          s: {x: -0.02667775, y: -0.02667774, z: -0.02667776}
        - t: {x: -46.85373, y: 0.000007629395, z: 0.000003814697}
          q: {x: 0.002414669, y: -0.02020317, z: 0.2204242, w: 0.9751919}
          s: {x: 0.9999999, y: 0.9999999, z: 1}
        - t: {x: -39.66958, y: -0.000007629395, z: -0.00001907349}
          q: {x: -0.09441453, y: 0.0001465418, z: 0.1918533, w: 0.9768716}
          s: {x: 0.9999999, y: 0.9999998, z: 1}
        - t: {x: -33.79738, y: 0.000001907349, z: -0.000003814697}
          q: {x: 0.05166607, y: -0.004966591, z: 0.1789542, w: 0.9824874}
          s: {x: 1, y: 1, z: 1}
        - t: {x: -31.31343, y: 0.000001759636, z: 0.000004601625}
          q: {x: -0.03331592, y: 0.006509183, z: 0.05699994, w: 0.997797}
          s: {x: 1, y: 1, z: 1}
        - t: {x: -0.3890647, y: -0.4413291, z: 0.2344815}
          q: {x: -0.4767417, y: -0.2706186, z: -0.3005514, w: 0.7804818}
          s: {x: -0.02667774, y: -0.02667776, z: -0.02667774}
        - t: {x: -55.568, y: 0.000007629395, z: -0.0000002384186}
          q: {x: -0.004422752, y: -0.08372204, z: -0.2209432, w: 0.9716765}
          s: {x: 1, y: 1, z: 1}
        - t: {x: -34.74317, y: 0.00001144409, z: 0.000002861023}
          q: {x: 0.02411954, y: 0.01946091, z: -0.2900251, w: 0.9565171}
          s: {x: 0.9999998, y: 0.9999996, z: 0.9999996}
        - t: {x: -30.15459, y: -0.00003051758, z: -0.000008106232}
          q: {x: -0.02212522, y: 0.04156339, z: -0.4084843, w: 0.9115501}
          s: {x: 0.9999998, y: 1, z: 1}
        - t: {x: -22.6457, y: 0.00001046339, z: 0.000001867768}
          q: {x: 0.07180173, y: 0.0388117, z: -0.02837616, w: 0.9962595}
          s: {x: 1, y: 1, z: 1}
        - t: {x: -0.3890647, y: -0.4413291, z: 0.2344815}
          q: {x: -0.06537253, y: -0.3027742, z: -0.2054279, w: 0.9283607}
          s: {x: -0.02667775, y: -0.02667776, z: -0.02667774}
        - t: {x: -54.65701, y: 0.000007629395, z: -0.000007629395}
          q: {x: -0.001384687, y: -0.04488522, z: -0.1800555, w: 0.9826309}
          s: {x: 0.9999999, y: 0.9999998, z: 0.9999999}
        - t: {x: -34.27811, y: 0.000003814697, z: 0.000007629395}
          q: {x: 0.01042865, y: -0.0278589, z: -0.1457651, w: 0.9888719}
          s: {x: 0.9999998, y: 0.9999999, z: 0.9999999}
        - t: {x: -33.0394, y: -0.00002479553, z: 0.000003814697}
          q: {x: -0.05143471, y: -0.01911004, z: -0.1977904, w: 0.9787074}
          s: {x: 0.9999999, y: 0.9999998, z: 1}
        - t: {x: -28.38665, y: 0.00001129413, z: 0.000000659842}
          q: {x: 0.1205935, y: -0.002298514, z: 0.0695224, w: 0.9902619}
          s: {x: 1, y: 1, z: 1}
        - t: {x: -0.002679318, y: 0.7408131, z: 0.1624331}
          q: {x: -0.4024743, y: 0.3836718, z: 0.6015968, w: 0.5734908}
          s: {x: 1, y: 1, z: 1}
        - t: {x: 0.7571106, y: 1.645631, z: -0.1029674}
          q: {x: 0.7046469, y: -0.05893007, z: -0.05893007, w: 0.7046469}
          s: {x: 1, y: 1, z: 1}
        - t: {x: 0.000001966953, y: 0.0000003576279, z: 5.752304}
          q: {x: 0.000000004445793, y: 0.0000002384186, z: -0.00000007241033, w: 1}
          s: {x: 1, y: 1, z: 1}
    m_SkeletonNameIDArray: 0000000067e52a4b5e8653a0f660b0253d6cbca6661287588ccc354d432c30c58c1d124d3fe2c6a8281088d9ddfa4eeb70889858d356e45dd0cbd1f2677ece74d4811a91c37354e03e634c8f2c36149b36df233dff56dcba52322aa7d5350134b349f3d923992b46339d60123cee1e3c86bf17a5cb3ac1dba5ad67657ddf0525c78e0cbcae5d7d631ffc6efcbe8c280e04dd219740f2c871c41506a0f81a5254c3c1b97c09834d9e8e84660d50d0f1bdc8faf77fd0046276675f7905dd0e709c2904e83e46346501266e621c9c3f6b854c635486fc656c98e53d4f375f6c46aea2cce1946779650530763e3d69d2dee8a259c107424b5bcd6e2a5523d47b5cbac97a5dd9a42a482ebdee25291e7b41b76aef394707bf2cb0918f2bc70092945796a29320f1496272e51b5337d79388392bde225e321a4f595f4a5aaefcdf3e30d0be30de884b46c041a38f4e468e37a9a9bc146c3f8c131b85dd1a8213ed1df582f0a26514c0a51277ee3824e1de3f535b8f36cacdbf31bd52dc06ec4b186bebe88d0f757ebd0802c4ec019b55f1be0bb078796b26487e1c9c1977850a2970f2b39c853a57a8561c9b5ad19a
    m_Human:
      data:
        serializedVersion: 2
        m_RootX:
          t: {x: 0, y: 0, z: 0}
          q: {x: 0, y: 0, z: 0, w: 1}
          s: {x: 1, y: 1, z: 1}
        m_Skeleton:
          data:
            m_Node: []
            m_ID: 
            m_AxesArray: []
        m_SkeletonPose:
          data:
            m_X: []
        m_LeftHand:
          data:
            m_HandBoneIndex: ffffffffffffffffffffffffffffffffffffffffffffffffffffffffffffffffffffffffffffffffffffffffffffffffffffffffffffffffffffffff
        m_RightHand:
          data:
            m_HandBoneIndex: ffffffffffffffffffffffffffffffffffffffffffffffffffffffffffffffffffffffffffffffffffffffffffffffffffffffffffffffffffffffff
        m_HumanBoneIndex: ffffffffffffffffffffffffffffffffffffffffffffffffffffffffffffffffffffffffffffffffffffffffffffffffffffffffffffffffffffffffffffffffffffffffffffffffffffffffffffffffffffffffffffffffffffffffffffffffffffffff
        m_HumanBoneMass:
        - 0.1454546
        - 0.1212121
        - 0.1212121
        - 0.04848485
        - 0.04848485
        - 0.009696971
        - 0.009696971
        - 0.03030303
        - 0.1454546
        - 0.1454546
        - 0.01212121
        - 0.04848485
        - 0.006060607
        - 0.006060607
        - 0.02424243
        - 0.02424243
        - 0.01818182
        - 0.01818182
        - 0.006060607
        - 0.006060607
        - 0.002424243
        - 0.002424243
        - 0
        - 0
        - 0
        m_Scale: 1
        m_ArmTwist: 0.5
        m_ForeArmTwist: 0.5
        m_UpperLegTwist: 0.5
        m_LegTwist: 0.5
        m_ArmStretch: 0.05
        m_LegStretch: 0.05
        m_FeetSpacing: 0
        m_HasLeftHand: 0
        m_HasRightHand: 0
        m_HasTDoF: 0
    m_HumanSkeletonIndexArray: 
    m_HumanSkeletonReverseIndexArray: 
    m_RootMotionBoneIndex: -1
    m_RootMotionBoneX:
      t: {x: 0, y: 0, z: 0}
      q: {x: 0, y: 0, z: 0, w: 1}
      s: {x: 1, y: 1, z: 1}
    m_RootMotionSkeleton:
      data:
        m_Node: []
        m_ID: 
        m_AxesArray: []
    m_RootMotionSkeletonPose:
      data:
        m_X: []
    m_RootMotionSkeletonIndexArray: 
  m_TOS:
    2173430534: Bip001/Bip001 Pelvis/Bip001 Spine/Bip001 Neck/Bip001 L Clavicle/Bip001
      L UpperArm/Bip001 L Forearm/Bip001 L Hand/Bip001 L Finger0
    151143892: Bip001/Bip001 Pelvis/Bip001 Spine/Bip001 Neck/Bip001 R Clavicle/Bip001
      R UpperArm/Bip001 R Forearm
    3102719907: Bip001/Bip001 Pelvis/Bip001 Spine/Bone034/Bone035/Bone036/Bone037
    4106307322: Bip001/Bip001 Pelvis/Bip001 Spine/Bone047
    2986020673: Bip001/Bip001 Pelvis/Bip001 Spine/Bone003/Bone011/Bone015/Bone012/Bone004
    3222360886: Bip001/Bip001 Pelvis/Bip001 Spine/Bone016/Bone017
    1961862382: Bip001/Bip001 Pelvis/Bip001 Spine/Bip001 Neck/Bip001 L Clavicle/Bip001
      L UpperArm/Bip001 L Forearm/Bip001 L Hand/Bip001 L Finger1/Bip001 L Finger11
    1463508343: Bip001/Bip001 Pelvis/Bip001 Spine/Bone001/Bone009/Bone014/Bone010/Bone002
    1822801957: Bip001/Bip001 Pelvis/Bip001 Spine/Bip001 R Thigh/Bip001 R Calf
    1512128984: Bip001/Bip001 Pelvis/Bip001 Spine/Bip001 Neck/Bip001 L Clavicle/Bip001
      L UpperArm/Bip001 L Forearm/Bone045
    2965905509: Bip001/Bip001 Pelvis/Bip001 Spine/Bip001 Neck/Bip001 R Clavicle/Bip001
      R UpperArm/Bip001 R Forearm/Bip001 R Hand
    983439169: Bip001/Bip001 Pelvis/Bip001 Spine/Bip001 R Thigh/Bip001 R Calf/Bip001
      R Foot
    256193932: Bip001/Bip001 Pelvis/Bip001 Spine/Bone005/Bone007
    3923455362: Bip001/Bip001 Pelvis/Bip001 Spine/Bone003/Bone011/Bone015
    3004435413: Bip001/Bip001 Pelvis/Bip001 Spine/Bip001 L Thigh/Bip001 L Calf/Bip001
      L Foot
    4176935869: Bip001/Bip001 Pelvis/Bip001 Spine/Bone029/Bone030/Bone031
    2366675018: Bip001/Bip001 Pelvis/Bip001 Spine/Bone003/Bone011/Bone015/Bone012
    3022459983: Bip001/Bip001 Pelvis/Bip001 Spine/Bip001 Neck/Bip001 L Clavicle/Bip001
      L UpperArm/Bip001 L Forearm/Bip001 L Hand/Bip001 L Finger2/Bip001 L Finger21/Bip001
      L Finger22/Bip001 L Finger2Nub
    2689828446: Ground
    1625505284: Bip001/Bip001 Pelvis/Bip001 Spine/Bip001 Neck/Bip001 R Clavicle/Bip001
      R UpperArm/Bip001 R Forearm/Bip001 R Hand/Bip001 R Finger1/Bip001 R Finger11/Bip001
      R Finger12
    176096744: Bip001/Bip001 Pelvis/Bip001 Spine/Bip001 Neck/Bip001 R Clavicle/Bip001
      R UpperArm/Bip001 R Forearm/Bip001 R Hand/Bip001 R Finger1/Bip001 R Finger11/Bip001
      R Finger12/Bip001 R Finger1Nub
    2377041072: Bip001/Bip001 Pelvis/Bip001 Spine/Chest
    4260483625: Bip001/Bip001 Pelvis
    2215216970: Bip001/Bip001 Pelvis/Bip001 Spine
    4105142503: Bip001/Bip001 Pelvis/Bip001 Spine/Bip001 Neck/Bip001 R Clavicle/Bip001
      R UpperArm/Bip001 R Forearm/Bip001 R Hand/Bip001 R Finger2/Bip001 R Finger21
    520607278: Bip001/Bip001 Pelvis/Bip001 Spine/Bip001 Neck/Bip001 L Clavicle/Bip001
      L UpperArm
    1489883333: Bip001/Bip001 Pelvis/Bip001 Spine/Bone029/Bone030
    1211339775: Bip001/Bip001 Pelvis/Bip001 Spine/Bip001 Neck/Bip001 R Clavicle/Bip001
      R UpperArm/Bip001 R Forearm/Bip001 R Hand/Bip001 R Finger0
    2210821740: Bip001/Bip001 Pelvis/Bip001 Spine/Bone046
    892096515: Bip001/Bip001 Pelvis/Bip001 Spine/Bip001 Neck/Bip001 R Clavicle/Bip001
      R UpperArm
    2351421554: Bip001/Bip001 Pelvis/Bip001 Spine/Bone003/Bone011
    3188072301: Bip001/Bip001 Pelvis/Bip001 Spine/Bip001 Neck/Bip001 R Clavicle/Bip001
      R UpperArm/Bip001 R Forearm/Bip001 R Hand/Bip001 R Finger2/Bip001 R Finger21/Bip001
      R Finger22
    3124347106: Bip001/Bip001 Pelvis/Bip001 Spine/Bone039/Bone040/Bone041
    579436935: Bip001/Bip001 Pelvis/Bip001 Spine/Bone034
    2422349528: Bip001/Bip001 Pelvis/Bip001 Spine/Bip001 Neck/Bip001 L Clavicle/Bip001
      L UpperArm/Bip001 L Forearm/Bip001 L Hand/LeftWeapon
    3122009591: Bip001/Bip001 Pelvis/Bip001 Spine/Bip001 Neck/Bip001 L Clavicle/Bip001
      L UpperArm/Bip001 L Forearm/Bip001 L Hand/Bip001 L Finger0/Bip001 L Finger01
    2797366333: Bip001
    4136426384: Bip001/Bip001 Pelvis/Bip001 Spine/Bip001 Neck/Bip001 L Clavicle/Bip001
      L UpperArm/Bip001 L Forearm/Bip001 L Hand/Bip001 L Finger1
    4286739511: Bip001/Bip001 Pelvis/Bip001 Spine/Bip001 R Thigh/Bip001 R Calf/Bip001
      R Foot/Bip001 R Toe0
    0: 
    3037809031: Bip001/Bip001 Pelvis/Bip001 Spine/Bone001/Bone009
    586269026: Bip001/Bip001 Pelvis/Bip001 Spine/Bip001 Neck/Bip001 R Clavicle/Bip001
      R UpperArm/Bip001 R Forearm/Bip001 R Hand/Bip001 R Finger2/Bip001 R Finger21/Bip001
      R Finger22/Bip001 R Finger2Nub
    2296427979: Bip001/Bip001 Pelvis/Bip001 Spine/Bone034/Bone035/Bone036/Bone037/Bone038
    1841829696: Bip001/Bip001 Pelvis/Bip001 Spine/Bone044
    538515425: Bip001/Bip001 Pelvis/Bip001 Spine/Bip001 L Thigh/Bip001 L Calf/Bip001
      L Foot/Bip001 L Toe0/Bip001 L Toe0Nub
    2509368180: Bip001/Bip001 Pelvis/Bip001 Spine/Bip001 Neck/Bip001 L Clavicle/Bip001
      L UpperArm/Bip001 L Forearm/Bip001 L Hand/Bip001 L Finger0/Bip001 L Finger01/Bip001
      L Finger02
    3521724066: Bip001/Bip001 Pelvis/Bip001 Spine/Bone034/Bone035/Bone036
    908765219: Bip001/Bip001 Pelvis/Bip001 Spine/Bone034/Bone035
    3446285756: Bip001/Bip001 Pelvis/Bip001 Spine/Bone029/Bone030/Bone031/Bone032
    387183596: Bip001/Bip001 Pelvis/Bip001 Spine/Bip001 Neck/Bip001 L Clavicle/Bip001
      L UpperArm/Bip001 L Forearm
    2624529180: Bip001/Bip001 Pelvis/Bip001 Spine/Bip001 Neck/Bip001 R Clavicle/Bip001
      R UpperArm/Bip001 R Forearm/Bip001 R Hand/Bip001 R Finger0/Bip001 R Finger01/Bip001
      R Finger02
    2228458307: Bip001/Bip001 Pelvis/Bip001 Spine/Bip001 Neck/Bip001 L Clavicle/Bip001
      L UpperArm/Bip001 L Forearm/Bip001 L Hand/Bip001 L Finger0/Bip001 L Finger01/Bip001
      L Finger02/Bip001 L Finger0Nub
    1612942448: Bip001/Bip001 Prop1
    4273046057: Bip001/Bip001 Pelvis/Bip001 Spine/Bone016
    1763571308: Bip001/Bip001 Pelvis/Bip001 Spine/Bip001 Neck/Bip001 L Clavicle/Bip001
      L UpperArm/Bip001 L Forearm/Bip001 L Hand/Bip001 L Finger1/Bip001 L Finger11/Bip001
      L Finger12
    4181212740: Bip001/Bip001 Pelvis/Bip001 Spine/Bip001 L Thigh/Bip001 L Calf/Bone049
    2376287859: Bip001/Bip001 Pelvis/Bip001 Spine/Bip001 R Thigh/Bip001 R Calf/Bone050
    2728124796: Bip001/Bip001 Pelvis/Bip001 Spine/Bone027
    3687978944: Bip001/Bip001 Pelvis/Bip001 Spine/Bip001 Neck/Bip001 L Clavicle
    1811441209: Bip001/Bip001 Pelvis/Bip001 Spine/Bip001 Neck/Bip001 Head
    2545960935: Bip001/Bip001 Pelvis/Bip001 Spine/Bone003
    2280280525: Bip001/Bip001 Pelvis/Bip001 Spine/Bip001 R Thigh
    2936081744: Bip001/Bip001 Pelvis/Bip001 Spine/Bip001 R Thigh/Bip001 R Calf/Bip001
      R Foot/RightFoot
    2463291635: Bip001/Bip001 Pelvis/Bip001 Spine/Bip001 L Thigh/Bip001 L Calf/Bip001
      L Foot/Bip001 L Toe0
    4120014335: Bip001/Bip001 Pelvis/Bip001 Spine/Bone016/Bone017/Bone018/Bone019
    341359963: Bip001/Bip001 Pelvis/Bip001 Spine/Bone027/Bone023/Bone024/Bone025
    2989352084: Bip001/Bip001 Pelvis/Bip001 Spine/Bip001 Neck/Bip001 R Clavicle/Bip001
      R UpperArm/Bip001 R Forearm/Bip001 R Hand/Bip001 R Finger0/Bip001 R Finger01
    2124669650: Bip001/Bip001 Pelvis/Bip001 Spine/Bone005
    2328809443: Bip001/Bip001 Pelvis/Bip001 Spine/Bip001 L Thigh/Bip001 L Calf/Bip001
      L Foot/LeftFoot
    2482983168: Bip001/Bip001 Pelvis/Bip001 Spine/Bip001 Neck/Bip001 R Clavicle/Bone021
    3849086355: Bip001/Bip001 Pelvis/Bip001 Spine/Bip001 Neck/Bip001 Head/Bip001
      HeadNub
    1060414313: Bip001/Bip001 Pelvis/Bip001 Spine/Bip001 Neck/Bip001 R Clavicle/Bip001
      R UpperArm/Bip001 R Forearm/Bip001 R Hand/Bip001 R Finger1
    3803555483: Bip001/Bip001 Pelvis/Bip001 Spine/Bip001 Neck/Bip001 R Clavicle
    2198429937: Bip001/Bip001 Pelvis/Bip001 Spine/Bip001 Neck
    3444751762: Bip001/Bip001 Pelvis/Bip001 Spine/Bip001 L Thigh/Bip001 L Calf
    3086538501: Bip001/Bip001 Pelvis/Bip001 Spine/Bip001 Neck/Bip001 L Clavicle/Bip001
      L UpperArm/Bip001 L Forearm/Bip001 L Hand/Bip001 L Finger2/Bip001 L Finger21/Bip001
      L Finger22
    747907930: Bip001/Bip001 Pelvis/Bip001 Spine/Bip001 Neck/Bip001 Head/Head
    632316150: UltraBeHit
    2135614977: Bip001/Bip001 Pelvis/Bip001 Spine/Bone027/Bone023/Bone024/Bone025/Bone026
    4287394520: Bip001/Bip001 Pelvis/Bip001 Spine/Bone016/Bone017/Bone018
    302335598: Bip001/Bip001 Pelvis/Bip001 Spine/Bip001 Neck/Bip001 R Clavicle/Bip001
      R UpperArm/Bip001 R Forearm/Bip001 R Hand/Bip001 R Finger0/Bip001 R Finger01/Bip001
      R Finger02/Bip001 R Finger0Nub
    1871022634: Bip001/Bip001 Pelvis/Bip001 Spine/Bip001 Neck/Bip001 L Clavicle/Bip001
      L UpperArm/Bip001 L Forearm/Bip001 L Hand/Bip001 L Finger2
    1261102439: Ms_006yglsw_0
    1547238714: Bip001/Bip001 Pelvis/Bip001 Spine/Bone039
    2307348944: Bip001/Bip001 Pelvis/Bip001 Spine/Bip001 R Thigh/Bip001 R Calf/Bip001
      R Foot/Bip001 R Toe0/Bip001 R Toe0Nub
    1159974011: Bip001/Bip001 Pelvis/Bip001 Spine/Bone029
    2388560994: Bip001/Bip001 Pelvis/Bip001 Spine/Bone029/Bone030/Bone031/Bone032/Bone033
    2789077715: Bip001/Bip001 Pelvis/Bip001 Spine/Bip001 Neck/Bip001 R Clavicle/Bip001
      R UpperArm/Bip001 R Forearm/Bip001 R Hand/Bip001 R Finger2
    270363564: Bip001/Bip001 Pelvis/Bip001 Spine/Bone027/Bone023
    519718133: Bip001/Bip001 Pelvis/Bip001 Spine/Bone001/Bone009/Bone014
    1100904010: Bip001/Bip001 Prop1/RightWeapon
    995372299: Bip001/Bip001 Pelvis/Bip001 Spine/Bone005/Bone007/Bone013
    2953557598: Bip001/Bip001 Pelvis/Bip001 Spine/Bip001 L Thigh
    3719145269: Bip001/Bip001 Pelvis/Bip001 Spine/Bip001 Neck/Bip001 L Clavicle/Bone028
    2094290317: Bip001/Bip001 Pelvis/Bip001 Spine/Bip001 Neck/Bip001 R Clavicle/Bip001
      R UpperArm/Bip001 R Forearm/Bip001 R Hand/Bip001 R Finger1/Bip001 R Finger11
    1051468200: Bip001/Bip001 Pelvis/Bip001 Spine/Bone039/Bone040/Bone041/Bone042/Bone043
    2628374725: Bip001/Bip001 Pelvis/Bip001 Spine/Bip001 Neck/Bip001 L Clavicle/Bip001
      L UpperArm/Bip001 L Forearm/Bip001 L Hand/Bip001 L Finger1/Bip001 L Finger11/Bip001
      L Finger12/Bip001 L Finger1Nub
    2102411447: Bip001/Bip001 Pelvis/Bip001 Spine/Bip001 Neck/Bip001 L Clavicle/Bip001
      L UpperArm/Bip001 L Forearm/Bip001 L Hand
    2043553483: Bip001/Bip001 Pelvis/Bip001 Spine/Bone001
    611931344: Bip001/Bip001 Pelvis/Bip001 Spine/Bone005/Bone007/Bone013/Bone008
    3099889886: Bip001/Bip001 Pelvis/Bip001 Spine/Bone005/Bone007/Bone013/Bone008/Bone006
    4237586820: Bip001/Bip001 Pelvis/Bip001 Spine/Bip001 Neck/Bip001 L Clavicle/Bip001
      L UpperArm/Bip001 L Forearm/Bip001 L Hand/Bip001 L Finger2/Bip001 L Finger21
    1724122353: Bip001/Bip001 Pelvis/Bip001 Spine/Bone039/Bone040/Bone041/Bone042
    116166942: Bip001/Bip001 Pelvis/Bip001 Spine/Bone027/Bone023/Bone024
    3056237242: Bip001/Bip001 Pelvis/Bip001 Spine/Bone016/Bone017/Bone018/Bone019/Bone020
    3980472839: Bip001/Bip001 Pelvis/Bip001 Spine/Bone001/Bone009/Bone014/Bone010
    4165872956: Bip001/Bip001 Pelvis/Bip001 Spine/Bone039/Bone040
  m_HumanDescription:
    serializedVersion: 3
    m_Human: []
    m_Skeleton: []
    m_ArmTwist: 0.5
    m_ForeArmTwist: 0.5
    m_UpperLegTwist: 0.5
    m_LegTwist: 0.5
    m_ArmStretch: 0.05
    m_LegStretch: 0.05
    m_FeetSpacing: 0
    m_GlobalScale: 1
    m_RootMotionBoneName: 
    m_HasTranslationDoF: 0
    m_HasExtraRoot: 0
    m_SkeletonHasParents: 1
