%YAML 1.1
%TAG !u! tag:unity3d.com,2011:
--- !u!1 &1000013952092852
GameObject:
  m_ObjectHideFlags: 0
  m_CorrespondingSourceObject: {fileID: 0}
  m_PrefabInstance: {fileID: 0}
  m_PrefabAsset: {fileID: 0}
  serializedVersion: 6
  m_Component:
  - component: {fileID: 4000011748786586}
  - component: {fileID: 114000012943620380}
  m_Layer: 0
  m_Name: TerraWarAtlas
  m_TagString: Untagged
  m_Icon: {fileID: 0}
  m_NavMeshLayer: 0
  m_StaticEditorFlags: 0
  m_IsActive: 1
--- !u!4 &4000011748786586
Transform:
  m_ObjectHideFlags: 0
  m_CorrespondingSourceObject: {fileID: 0}
  m_PrefabInstance: {fileID: 0}
  m_PrefabAsset: {fileID: 0}
  m_GameObject: {fileID: 1000013952092852}
  m_LocalRotation: {x: 0, y: 0, z: 0, w: 1}
  m_LocalPosition: {x: 0, y: 0, z: 0}
  m_LocalScale: {x: 1, y: 1, z: 1}
  m_Children: []
  m_Father: {fileID: 0}
  m_RootOrder: 0
  m_LocalEulerAnglesHint: {x: 0, y: 0, z: 0}
--- !u!114 &114000012943620380
MonoBehaviour:
  m_ObjectHideFlags: 0
  m_CorrespondingSourceObject: {fileID: 0}
  m_PrefabInstance: {fileID: 0}
  m_PrefabAsset: {fileID: 0}
  m_GameObject: {fileID: 1000013952092852}
  m_Enabled: 1
  m_EditorHideFlags: 0
  m_Script: {fileID: 11500000, guid: 4d0c51bb0b6e93049af5e88f93826e3b, type: 3}
  m_Name: 
  m_EditorClassIdentifier: 
  material: {fileID: 2100000, guid: 8be1a4d1b4a6e9c4f95dafe0361fe457, type: 2}
  mSprites:
  - name: bg_zijipaimingdi
    x: 262
    y: 86
    width: 42
    height: 41
    borderLeft: 8
    borderRight: 8
    borderTop: 8
    borderBottom: 8
    paddingLeft: 0
    paddingRight: 0
    paddingTop: 0
    paddingBottom: 0
  - name: btn_qiehuanditu
    x: 203
    y: 204
    width: 100
    height: 88
    borderLeft: 0
    borderRight: 0
    borderTop: 0
    borderBottom: 0
    paddingLeft: 0
    paddingRight: 0
    paddingTop: 6
    paddingBottom: 6
  - name: pic_bg_difang
    x: 0
    y: 439
    width: 449
    height: 73
    borderLeft: 0
    borderRight: 0
    borderTop: 0
    borderBottom: 0
    paddingLeft: 0
    paddingRight: 0
    paddingTop: 0
    paddingBottom: 0
  - name: pic_bg_fengexian
    x: 490
    y: 255
    width: 187
    height: 37
    borderLeft: 0
    borderRight: 0
    borderTop: 0
    borderBottom: 0
    paddingLeft: 0
    paddingRight: 0
    paddingTop: 0
    paddingBottom: 0
  - name: pic_bg_neirongdi
    x: 199
    y: 5
    width: 58
    height: 58
    borderLeft: 10
    borderRight: 10
    borderTop: 10
    borderBottom: 10
    paddingLeft: 0
    paddingRight: 0
    paddingTop: 0
    paddingBottom: 0
  - name: pic_bg_zhiyuanfang
    x: 450
    y: 439
    width: 449
    height: 73
    borderLeft: 0
    borderRight: 0
    borderTop: 0
    borderBottom: 0
    paddingLeft: 0
    paddingRight: 0
    paddingTop: 0
    paddingBottom: 0
  - name: pic_btn_back_1
    x: 555
    y: 366
    width: 127
    height: 72
    borderLeft: 0
    borderRight: 0
    borderTop: 0
    borderBottom: 0
    paddingLeft: 0
    paddingRight: 0
    paddingTop: 0
    paddingBottom: 0
  - name: pic_btn_cebiaoqian_xuanzhong
    x: 819
    y: 166
    width: 174
    height: 62
    borderLeft: 0
    borderRight: 0
    borderTop: 0
    borderBottom: 0
    paddingLeft: 0
    paddingRight: 0
    paddingTop: 0
    paddingBottom: 0
  - name: pic_diban01
    x: 390
    y: 360
    width: 164
    height: 78
    borderLeft: 80
    borderRight: 30
    borderTop: 5
    borderBottom: 65
    paddingLeft: 0
    paddingRight: 0
    paddingTop: 0
    paddingBottom: 0
  - name: pic_diban02
    x: 177
    y: 293
    width: 513
    height: 38
    borderLeft: 30
    borderRight: 200
    borderTop: 0
    borderBottom: 0
    paddingLeft: 0
    paddingRight: 0
    paddingTop: 0
    paddingBottom: 0
  - name: pic_ditudi
    x: 177
    y: 277
    width: 15
    height: 15
    borderLeft: 5
    borderRight: 5
    borderTop: 5
    borderBottom: 5
    paddingLeft: 4
    paddingRight: 4
    paddingTop: 4
    paddingBottom: 4
  - name: pic_ditudikuang
    x: 838
    y: 379
    width: 61
    height: 59
    borderLeft: 10
    borderRight: 10
    borderTop: 10
    borderBottom: 10
    paddingLeft: 0
    paddingRight: 0
    paddingTop: 0
    paddingBottom: 0
  - name: pic_ditutanchuang
    x: 691
    y: 313
    width: 146
    height: 125
    borderLeft: 30
    borderRight: 30
    borderTop: 30
    borderBottom: 30
    paddingLeft: 0
    paddingRight: 0
    paddingTop: 0
    paddingBottom: 0
  - name: pic_fang
    x: 258
    y: 24
    width: 62
    height: 39
    borderLeft: 0
    borderRight: 0
    borderTop: 0
    borderBottom: 0
    paddingLeft: 0
    paddingRight: 0
    paddingTop: 0
    paddingBottom: 0
  - name: pic_gong
    x: 199
    y: 88
    width: 62
    height: 39
    borderLeft: 0
    borderRight: 0
    borderTop: 0
    borderBottom: 0
    paddingLeft: 0
    paddingRight: 0
    paddingTop: 0
    paddingBottom: 0
  - name: pic_heisemengban
    x: 162
    y: 17
    width: 26
    height: 26
    borderLeft: 0
    borderRight: 0
    borderTop: 0
    borderBottom: 0
    paddingLeft: 0
    paddingRight: 0
    paddingTop: 0
    paddingBottom: 0
  - name: pic_hongse_qizi01
    x: 588
    y: 186
    width: 97
    height: 68
    borderLeft: 0
    borderRight: 0
    borderTop: 0
    borderBottom: 0
    paddingLeft: 0
    paddingRight: 0
    paddingTop: 0
    paddingBottom: 0
  - name: pic_hongse_qizi02
    x: 490
    y: 186
    width: 97
    height: 68
    borderLeft: 0
    borderRight: 0
    borderTop: 0
    borderBottom: 0
    paddingLeft: 0
    paddingRight: 0
    paddingTop: 0
    paddingBottom: 0
  - name: pic_huawen
    x: 555
    y: 336
    width: 50
    height: 29
    borderLeft: 0
    borderRight: 0
    borderTop: 0
    borderBottom: 0
    paddingLeft: 0
    paddingRight: 0
    paddingTop: 0
    paddingBottom: 0
  - name: pic_jiantou
    x: 804
    y: 169
    width: 11
    height: 17
    borderLeft: 0
    borderRight: 0
    borderTop: 0
    borderBottom: 0
    paddingLeft: 1
    paddingRight: 1
    paddingTop: 0
    paddingBottom: 0
  - name: pic_jidutiao_01_back
    x: 784
    y: 167
    width: 19
    height: 19
    borderLeft: 8
    borderRight: 8
    borderTop: 8
    borderBottom: 8
    paddingLeft: 0
    paddingRight: 1
    paddingTop: 0
    paddingBottom: 0
  - name: pic_jidutiao_01_fore
    x: 966
    y: 229
    width: 20
    height: 18
    borderLeft: 8
    borderRight: 8
    borderTop: 8
    borderBottom: 8
    paddingLeft: 0
    paddingRight: 0
    paddingTop: 0
    paddingBottom: 1
  - name: pic_jindutiao_back
    x: 0
    y: 4
    width: 161
    height: 19
    borderLeft: 10
    borderRight: 10
    borderTop: 5
    borderBottom: 5
    paddingLeft: 0
    paddingRight: 0
    paddingTop: 0
    paddingBottom: 0
  - name: pic_jindutiao_fore
    x: 203
    y: 189
    width: 153
    height: 11
    borderLeft: 5
    borderRight: 5
    borderTop: 0
    borderBottom: 0
    paddingLeft: 4
    paddingRight: 4
    paddingTop: 4
    paddingBottom: 4
  - name: pic_lanse_qizi01
    x: 686
    y: 118
    width: 97
    height: 68
    borderLeft: 0
    borderRight: 0
    borderTop: 0
    borderBottom: 0
    paddingLeft: 0
    paddingRight: 0
    paddingTop: 0
    paddingBottom: 0
  - name: pic_lanse_qizi02
    x: 367
    y: 132
    width: 97
    height: 68
    borderLeft: 0
    borderRight: 0
    borderTop: 0
    borderBottom: 0
    paddingLeft: 0
    paddingRight: 0
    paddingTop: 0
    paddingBottom: 0
  - name: pic_line_terra
    x: 189
    y: 14
    width: 2
    height: 29
    borderLeft: 0
    borderRight: 0
    borderTop: 0
    borderBottom: 0
    paddingLeft: 0
    paddingRight: 0
    paddingTop: 0
    paddingBottom: 0
  - name: pic_mingchengdi01
    x: 304
    y: 201
    width: 185
    height: 45
    borderLeft: 0
    borderRight: 0
    borderTop: 0
    borderBottom: 0
    paddingLeft: 0
    paddingRight: 0
    paddingTop: 0
    paddingBottom: 0
  - name: pic_mingchengdi02
    x: 304
    y: 247
    width: 185
    height: 45
    borderLeft: 0
    borderRight: 0
    borderTop: 0
    borderBottom: 0
    paddingLeft: 0
    paddingRight: 0
    paddingTop: 0
    paddingBottom: 0
  - name: pic_rank_di01
    x: 691
    y: 187
    width: 127
    height: 125
    borderLeft: 20
    borderRight: 20
    borderTop: 20
    borderBottom: 20
    paddingLeft: 0
    paddingRight: 0
    paddingTop: 0
    paddingBottom: 0
  - name: pic_rank_di02
    x: 838
    y: 229
    width: 127
    height: 125
    borderLeft: 10
    borderRight: 10
    borderTop: 10
    borderBottom: 10
    paddingLeft: 0
    paddingRight: 0
    paddingTop: 0
    paddingBottom: 0
  - name: pic_rank_terra
    x: 177
    y: 332
    width: 212
    height: 106
    borderLeft: 160
    borderRight: 10
    borderTop: 0
    borderBottom: 0
    paddingLeft: 0
    paddingRight: 0
    paddingTop: 0
    paddingBottom: 0
  - name: pic_shop_terra_1
    x: 784
    y: 64
    width: 59
    height: 101
    borderLeft: 0
    borderRight: 0
    borderTop: 0
    borderBottom: 0
    paddingLeft: 0
    paddingRight: 0
    paddingTop: 0
    paddingBottom: 0
  - name: pic_shop_terra_2
    x: 139
    y: 44
    width: 59
    height: 101
    borderLeft: 0
    borderRight: 0
    borderTop: 0
    borderBottom: 0
    paddingLeft: 0
    paddingRight: 0
    paddingTop: 0
    paddingBottom: 0
  - name: pic_tips_dikuang
    x: 994
    y: 167
    width: 24
    height: 80
    borderLeft: 10
    borderRight: 10
    borderTop: 30
    borderBottom: 30
    paddingLeft: 0
    paddingRight: 0
    paddingTop: 0
    paddingBottom: 0
  - name: pic_tips_dikuang_da
    x: 203
    y: 128
    width: 163
    height: 58
    borderLeft: 0
    borderRight: 0
    borderTop: 0
    borderBottom: 0
    paddingLeft: 0
    paddingRight: 0
    paddingTop: 0
    paddingBottom: 0
  - name: pic_vs
    x: 900
    y: 355
    width: 119
    height: 157
    borderLeft: 0
    borderRight: 0
    borderTop: 0
    borderBottom: 0
    paddingLeft: 0
    paddingRight: 0
    paddingTop: 0
    paddingBottom: 0
  - name: pic_vs_terra
    x: 0
    y: 276
    width: 176
    height: 162
    borderLeft: 0
    borderRight: 0
    borderTop: 0
    borderBottom: 0
    paddingLeft: 0
    paddingRight: 0
    paddingTop: 0
    paddingBottom: 0
  - name: pic_wait_di01
    x: 465
    y: 67
    width: 23
    height: 66
    borderLeft: 10
    borderRight: 10
    borderTop: 10
    borderBottom: 10
    paddingLeft: 0
    paddingRight: 0
    paddingTop: 0
    paddingBottom: 0
  - name: pic_wait_di02
    x: 465
    y: 134
    width: 23
    height: 66
    borderLeft: 10
    borderRight: 10
    borderTop: 10
    borderBottom: 10
    paddingLeft: 0
    paddingRight: 0
    paddingTop: 0
    paddingBottom: 0
  - name: pic_wanjiamingzidi
    x: 844
    y: 54
    width: 163
    height: 32
    borderLeft: 0
    borderRight: 0
    borderTop: 0
    borderBottom: 0
    paddingLeft: 0
    paddingRight: 0
    paddingTop: 0
    paddingBottom: 0
  - name: pic_xingxing1
    x: 305
    y: 84
    width: 36
    height: 43
    borderLeft: 0
    borderRight: 0
    borderTop: 0
    borderBottom: 0
    paddingLeft: 6
    paddingRight: 6
    paddingTop: 13
    paddingBottom: 0
  - name: pic_xingxing2
    x: 966
    y: 248
    width: 42
    height: 49
    borderLeft: 0
    borderRight: 0
    borderTop: 0
    borderBottom: 0
    paddingLeft: 3
    paddingRight: 3
    paddingTop: 7
    paddingBottom: 0
  - name: pic_xingxing3
    x: 966
    y: 298
    width: 48
    height: 56
    borderLeft: 0
    borderRight: 0
    borderTop: 0
    borderBottom: 0
    paddingLeft: 0
    paddingRight: 0
    paddingTop: 0
    paddingBottom: 0
  - name: pic_xinxidikuang
    x: 844
    y: 87
    width: 74
    height: 78
    borderLeft: 8
    borderRight: 8
    borderTop: 50
    borderBottom: 7
    paddingLeft: 0
    paddingRight: 0
    paddingTop: 0
    paddingBottom: 0
  - name: pic_xuxian
    x: 0
    y: 146
    width: 202
    height: 129
    borderLeft: 100
    borderRight: 90
    borderTop: 0
    borderBottom: 0
    paddingLeft: 0
    paddingRight: 0
    paddingTop: 0
    paddingBottom: 0
  - name: pic_zhanbai
    x: 0
    y: 24
    width: 102
    height: 53
    borderLeft: 0
    borderRight: 0
    borderTop: 0
    borderBottom: 0
    paddingLeft: 0
    paddingRight: 0
    paddingTop: 0
    paddingBottom: 0
  - name: pic_zhushouhuoban
    x: 919
    y: 120
    width: 82
    height: 45
    borderLeft: 0
    borderRight: 0
    borderTop: 0
    borderBottom: 0
    paddingLeft: 1
    paddingRight: 8
    paddingTop: 4
    paddingBottom: 1
  - name: pic_zijixinxidikuang
    x: 838
    y: 356
    width: 22
    height: 22
    borderLeft: 8
    borderRight: 8
    borderTop: 8
    borderBottom: 8
    paddingLeft: 0
    paddingRight: 0
    paddingTop: 0
    paddingBottom: 0
  - name: text_judiangongfangzhan
    x: 0
    y: 78
    width: 138
    height: 67
    borderLeft: 0
    borderRight: 0
    borderTop: 0
    borderBottom: 0
    paddingLeft: 0
    paddingRight: 0
    paddingTop: 0
    paddingBottom: 0
  - name: text_zhushouhuoban
    x: 919
    y: 91
    width: 85
    height: 28
    borderLeft: 0
    borderRight: 0
    borderTop: 0
    borderBottom: 0
    paddingLeft: 45
    paddingRight: 46
    paddingTop: 10
    paddingBottom: 10
  mPixelSize: 1
  mReplacement: {fileID: 0}
  mCoordinates: 0
  sprites: []
