%YAML 1.1
%TAG !u! tag:unity3d.com,2011:
--- !u!1 &1000010589915916
GameObject:
  m_ObjectHideFlags: 0
  m_CorrespondingSourceObject: {fileID: 0}
  m_PrefabInstance: {fileID: 0}
  m_PrefabAsset: {fileID: 0}
  serializedVersion: 6
  m_Component:
  - component: {fileID: 4000011581797174}
  - component: {fileID: 114000011225694632}
  m_Layer: 0
  m_Name: CommonAtlas
  m_TagString: Untagged
  m_Icon: {fileID: 0}
  m_NavMeshLayer: 0
  m_StaticEditorFlags: 0
  m_IsActive: 1
--- !u!4 &4000011581797174
Transform:
  m_ObjectHideFlags: 0
  m_CorrespondingSourceObject: {fileID: 0}
  m_PrefabInstance: {fileID: 0}
  m_PrefabAsset: {fileID: 0}
  m_GameObject: {fileID: 1000010589915916}
  m_LocalRotation: {x: 0, y: 0, z: 0, w: 1}
  m_LocalPosition: {x: 0, y: 0, z: 0}
  m_LocalScale: {x: 1, y: 1, z: 1}
  m_Children: []
  m_Father: {fileID: 0}
  m_RootOrder: 0
  m_LocalEulerAnglesHint: {x: 0, y: 0, z: 0}
--- !u!114 &114000011225694632
MonoBehaviour:
  m_ObjectHideFlags: 0
  m_CorrespondingSourceObject: {fileID: 0}
  m_PrefabInstance: {fileID: 0}
  m_PrefabAsset: {fileID: 0}
  m_GameObject: {fileID: 1000010589915916}
  m_Enabled: 1
  m_EditorHideFlags: 0
  m_Script: {fileID: 11500000, guid: 4d0c51bb0b6e93049af5e88f93826e3b, type: 3}
  m_Name: 
  m_EditorClassIdentifier: 
  material: {fileID: 2100000, guid: 5a468bb8c46f07446a8ebeee45bb099f, type: 2}
  mSprites:
  - name: bg_bianjiwenzidi
    x: 431
    y: 473
    width: 123
    height: 94
    borderLeft: 20
    borderRight: 20
    borderTop: 0
    borderBottom: 0
    paddingLeft: 0
    paddingRight: 0
    paddingTop: 0
    paddingBottom: 0
  - name: bg_biaotidi
    x: 0
    y: 965
    width: 533
    height: 59
    borderLeft: 50
    borderRight: 150
    borderTop: 0
    borderBottom: 0
    paddingLeft: 0
    paddingRight: 0
    paddingTop: 0
    paddingBottom: 0
  - name: bg_ciji_di
    x: 720
    y: 544
    width: 105
    height: 100
    borderLeft: 4
    borderRight: 4
    borderTop: 4
    borderBottom: 4
    paddingLeft: 0
    paddingRight: 0
    paddingTop: 0
    paddingBottom: 0
  - name: bg_cijimian_diban_ecsd
    x: 1243
    y: 185
    width: 23
    height: 23
    borderLeft: 4
    borderRight: 4
    borderTop: 4
    borderBottom: 4
    paddingLeft: 0
    paddingRight: 0
    paddingTop: 0
    paddingBottom: 0
  - name: bg_color_card_1
    x: 920
    y: 326
    width: 80
    height: 80
    borderLeft: 0
    borderRight: 0
    borderTop: 0
    borderBottom: 0
    paddingLeft: 0
    paddingRight: 0
    paddingTop: 0
    paddingBottom: 0
  - name: bg_color_card_2
    x: 628
    y: 240
    width: 80
    height: 80
    borderLeft: 0
    borderRight: 0
    borderTop: 0
    borderBottom: 0
    paddingLeft: 0
    paddingRight: 0
    paddingTop: 0
    paddingBottom: 0
  - name: bg_color_card_3
    x: 491
    y: 230
    width: 80
    height: 80
    borderLeft: 0
    borderRight: 0
    borderTop: 0
    borderBottom: 0
    paddingLeft: 0
    paddingRight: 0
    paddingTop: 0
    paddingBottom: 0
  - name: bg_color_card_4
    x: 125
    y: 136
    width: 80
    height: 80
    borderLeft: 0
    borderRight: 0
    borderTop: 0
    borderBottom: 0
    paddingLeft: 0
    paddingRight: 0
    paddingTop: 0
    paddingBottom: 0
  - name: bg_color_card_5
    x: 264
    y: 142
    width: 80
    height: 80
    borderLeft: 0
    borderRight: 0
    borderTop: 0
    borderBottom: 0
    paddingLeft: 0
    paddingRight: 0
    paddingTop: 0
    paddingBottom: 0
  - name: bg_daoju_mingchengdi
    x: 119
    y: 511
    width: 137
    height: 4
    borderLeft: 60
    borderRight: 60
    borderTop: 1
    borderBottom: 1
    paddingLeft: 0
    paddingRight: 0
    paddingTop: 0
    paddingBottom: 0
  - name: bg_dijidi_mengban
    x: 1252
    y: 548
    width: 16
    height: 15
    borderLeft: 5
    borderRight: 5
    borderTop: 5
    borderBottom: 5
    paddingLeft: 0
    paddingRight: 0
    paddingTop: 0
    paddingBottom: 0
  - name: bg_ditu_daoju
    x: 1790
    y: 796
    width: 95
    height: 110
    borderLeft: 0
    borderRight: 0
    borderTop: 0
    borderBottom: 0
    paddingLeft: 9
    paddingRight: 8
    paddingTop: 1
    paddingBottom: 1
  - name: bg_ditu_huobi_shuliang
    x: 693
    y: 1
    width: 116
    height: 25
    borderLeft: 0
    borderRight: 0
    borderTop: 0
    borderBottom: 0
    paddingLeft: 0
    paddingRight: 0
    paddingTop: 0
    paddingBottom: 0
  - name: bg_ditu_tanchuang
    x: 144
    y: 700
    width: 31
    height: 48
    borderLeft: 10
    borderRight: 10
    borderTop: 10
    borderBottom: 10
    paddingLeft: 0
    paddingRight: 0
    paddingTop: 0
    paddingBottom: 0
  - name: bg_ditu_wupin_chushoulan
    x: 1445
    y: 348
    width: 32
    height: 34
    borderLeft: 0
    borderRight: 0
    borderTop: 0
    borderBottom: 0
    paddingLeft: 0
    paddingRight: 0
    paddingTop: 0
    paddingBottom: 0
  - name: bg_ditu_xiaojianpan
    x: 982
    y: 273
    width: 16
    height: 16
    borderLeft: 8
    borderRight: 8
    borderTop: 8
    borderBottom: 8
    paddingLeft: 0
    paddingRight: 0
    paddingTop: 0
    paddingBottom: 0
  - name: bg_ditu_xiaojianpan_jiao
    x: 1406
    y: 331
    width: 30
    height: 12
    borderLeft: 0
    borderRight: 0
    borderTop: 0
    borderBottom: 0
    paddingLeft: 0
    paddingRight: 0
    paddingTop: 0
    paddingBottom: 0
  - name: bg_diwen_anniushuzi
    x: 1099
    y: 65
    width: 107
    height: 27
    borderLeft: 0
    borderRight: 0
    borderTop: 0
    borderBottom: 0
    paddingLeft: 0
    paddingRight: 0
    paddingTop: 0
    paddingBottom: 0
  - name: bg_diwen_shop
    x: 1229
    y: 543
    width: 22
    height: 20
    borderLeft: 10
    borderRight: 10
    borderTop: 10
    borderBottom: 10
    paddingLeft: 0
    paddingRight: 0
    paddingTop: 0
    paddingBottom: 0
  - name: bg_down
    x: 322
    y: 545
    width: 108
    height: 108
    borderLeft: 20
    borderRight: 20
    borderTop: 20
    borderBottom: 20
    paddingLeft: 0
    paddingRight: 0
    paddingTop: 0
    paddingBottom: 0
  - name: bg_erji_di2
    x: 1170
    y: 14
    width: 51
    height: 50
    borderLeft: 5
    borderRight: 5
    borderTop: 5
    borderBottom: 10
    paddingLeft: 0
    paddingRight: 1
    paddingTop: 1
    paddingBottom: 1
  - name: bg_erji_di3
    x: 1017
    y: 790
    width: 124
    height: 102
    borderLeft: 20
    borderRight: 30
    borderTop: 20
    borderBottom: 30
    paddingLeft: 0
    paddingRight: 0
    paddingTop: 0
    paddingBottom: 0
  - name: bg_fenge
    x: 918
    y: 59
    width: 21
    height: 20
    borderLeft: 4
    borderRight: 4
    borderTop: 4
    borderBottom: 4
    paddingLeft: 0
    paddingRight: 0
    paddingTop: 0
    paddingBottom: 0
  - name: bg_haoyoukuang
    x: 1238
    y: 392
    width: 80
    height: 80
    borderLeft: 20
    borderRight: 20
    borderTop: 20
    borderBottom: 20
    paddingLeft: 0
    paddingRight: 0
    paddingTop: 0
    paddingBottom: 0
  - name: bg_haoyoukuang_baise
    x: 349
    y: 745
    width: 70
    height: 70
    borderLeft: 0
    borderRight: 0
    borderTop: 0
    borderBottom: 0
    paddingLeft: 0
    paddingRight: 0
    paddingTop: 0
    paddingBottom: 0
  - name: bg_haoyoukuang_default
    x: 836
    y: 362
    width: 83
    height: 83
    borderLeft: 0
    borderRight: 0
    borderTop: 0
    borderBottom: 0
    paddingLeft: 0
    paddingRight: 0
    paddingTop: 0
    paddingBottom: 0
  - name: bg_haoyoukuang_huise
    x: 786
    y: 281
    width: 80
    height: 80
    borderLeft: 10
    borderRight: 10
    borderTop: 10
    borderBottom: 10
    paddingLeft: 0
    paddingRight: 0
    paddingTop: 0
    paddingBottom: 0
  - name: bg_haoyoukuang_jinse
    x: 1224
    y: 311
    width: 80
    height: 80
    borderLeft: 10
    borderRight: 10
    borderTop: 10
    borderBottom: 10
    paddingLeft: 0
    paddingRight: 0
    paddingTop: 0
    paddingBottom: 0
  - name: bg_haoyoukuang_lanse
    x: 1143
    y: 341
    width: 80
    height: 80
    borderLeft: 10
    borderRight: 10
    borderTop: 10
    borderBottom: 10
    paddingLeft: 0
    paddingRight: 0
    paddingTop: 0
    paddingBottom: 0
  - name: bg_haoyoukuang_red
    x: 1062
    y: 341
    width: 80
    height: 80
    borderLeft: 0
    borderRight: 0
    borderTop: 0
    borderBottom: 0
    paddingLeft: 0
    paddingRight: 0
    paddingTop: 0
    paddingBottom: 0
  - name: bg_haoyoukuang_zise
    x: 1319
    y: 371
    width: 80
    height: 80
    borderLeft: 0
    borderRight: 0
    borderTop: 0
    borderBottom: 0
    paddingLeft: 0
    paddingRight: 0
    paddingTop: 0
    paddingBottom: 0
  - name: bg_heise_shezhao
    x: 941
    y: 686
    width: 32
    height: 16
    borderLeft: 5
    borderRight: 5
    borderTop: 5
    borderBottom: 5
    paddingLeft: 0
    paddingRight: 0
    paddingTop: 0
    paddingBottom: 0
  - name: bg_heise_shezhao1
    x: 1442
    y: 160
    width: 31
    height: 31
    borderLeft: 0
    borderRight: 0
    borderTop: 0
    borderBottom: 0
    paddingLeft: 0
    paddingRight: 0
    paddingTop: 0
    paddingBottom: 0
  - name: bg_huoban_jineng_kuang
    x: 658
    y: 468
    width: 97
    height: 75
    borderLeft: 0
    borderRight: 0
    borderTop: 0
    borderBottom: 0
    paddingLeft: 0
    paddingRight: 0
    paddingTop: 0
    paddingBottom: 0
  - name: bg_huobantouxiangtianjia2
    x: 879
    y: 139
    width: 60
    height: 60
    borderLeft: 0
    borderRight: 0
    borderTop: 0
    borderBottom: 0
    paddingLeft: 7
    paddingRight: 7
    paddingTop: 7
    paddingBottom: 7
  - name: bg_lashendiban02
    x: 940
    y: 61
    width: 17
    height: 18
    borderLeft: 8
    borderRight: 8
    borderTop: 8
    borderBottom: 8
    paddingLeft: 0
    paddingRight: 0
    paddingTop: 0
    paddingBottom: 1
  - name: bg_renwu_dengji_di
    x: 1305
    y: 263
    width: 31
    height: 19
    borderLeft: 10
    borderRight: 10
    borderTop: 0
    borderBottom: 0
    paddingLeft: 0
    paddingRight: 1
    paddingTop: 0
    paddingBottom: 0
  - name: bg_sanjia_diban1
    x: 835
    y: 602
    width: 105
    height: 100
    borderLeft: 20
    borderRight: 20
    borderTop: 15
    borderBottom: 15
    paddingLeft: 0
    paddingRight: 0
    paddingTop: 0
    paddingBottom: 0
  - name: bg_sanjimianban
    x: 0
    y: 105
    width: 124
    height: 79
    borderLeft: 7
    borderRight: 7
    borderTop: 7
    borderBottom: 7
    paddingLeft: 0
    paddingRight: 0
    paddingTop: 0
    paddingBottom: 0
  - name: bg_shuomingtiao_xuanzhong
    x: 614
    y: 96
    width: 49
    height: 83
    borderLeft: 20
    borderRight: 20
    borderTop: 20
    borderBottom: 20
    paddingLeft: 0
    paddingRight: 0
    paddingTop: 0
    paddingBottom: 0
  - name: bg_tips_diban
    x: 836
    y: 446
    width: 84
    height: 84
    borderLeft: 0
    borderRight: 0
    borderTop: 0
    borderBottom: 0
    paddingLeft: 0
    paddingRight: 0
    paddingTop: 0
    paddingBottom: 0
  - name: bg_tongyong_diban
    x: 1453
    y: 416
    width: 18
    height: 476
    borderLeft: 5
    borderRight: 5
    borderTop: 20
    borderBottom: 20
    paddingLeft: 0
    paddingRight: 0
    paddingTop: 0
    paddingBottom: 0
  - name: bg_touming
    x: 1473
    y: 33
    width: 26
    height: 26
    borderLeft: 5
    borderRight: 5
    borderTop: 5
    borderBottom: 5
    paddingLeft: 0
    paddingRight: 0
    paddingTop: 0
    paddingBottom: 0
  - name: bg_up
    x: 611
    y: 557
    width: 108
    height: 108
    borderLeft: 20
    borderRight: 20
    borderTop: 20
    borderBottom: 20
    paddingLeft: 0
    paddingRight: 0
    paddingTop: 0
    paddingBottom: 0
  - name: bg_xuanzhong_kuang
    x: 1142
    y: 527
    width: 86
    height: 85
    borderLeft: 30
    borderRight: 30
    borderTop: 30
    borderBottom: 30
    paddingLeft: 0
    paddingRight: 0
    paddingTop: 0
    paddingBottom: 0
  - name: btn_anniu_jiahao
    x: 810
    y: 4
    width: 22
    height: 22
    borderLeft: 0
    borderRight: 0
    borderTop: 0
    borderBottom: 0
    paddingLeft: 0
    paddingRight: 0
    paddingTop: 0
    paddingBottom: 0
  - name: btn_anniu_jianhao
    x: 664
    y: 97
    width: 22
    height: 22
    borderLeft: 0
    borderRight: 0
    borderTop: 0
    borderBottom: 0
    paddingLeft: 0
    paddingRight: 0
    paddingTop: 0
    paddingBottom: 0
  - name: btn_anniu_jianpan
    x: 1159
    y: 93
    width: 56
    height: 49
    borderLeft: 0
    borderRight: 0
    borderTop: 0
    borderBottom: 0
    paddingLeft: 0
    paddingRight: 0
    paddingTop: 0
    paddingBottom: 0
  - name: btn_anniu_xiangqing_1
    x: 300
    y: 36
    width: 102
    height: 50
    borderLeft: 0
    borderRight: 0
    borderTop: 0
    borderBottom: 0
    paddingLeft: 0
    paddingRight: 0
    paddingTop: 0
    paddingBottom: 0
  - name: btn_bangzhu
    x: 1445
    y: 31
    width: 27
    height: 28
    borderLeft: 0
    borderRight: 0
    borderTop: 0
    borderBottom: 0
    paddingLeft: 0
    paddingRight: 0
    paddingTop: 0
    paddingBottom: 0
  - name: btn_biaoqian_1
    x: 252
    y: 87
    width: 115
    height: 46
    borderLeft: 10
    borderRight: 10
    borderTop: 10
    borderBottom: 10
    paddingLeft: 0
    paddingRight: 0
    paddingTop: 0
    paddingBottom: 0
  - name: btn_biaoqian_2
    x: 184
    y: 28
    width: 115
    height: 46
    borderLeft: 0
    borderRight: 0
    borderTop: 0
    borderBottom: 0
    paddingLeft: 0
    paddingRight: 0
    paddingTop: 0
    paddingBottom: 0
  - name: btn_cebian_weixuanzhong2
    x: 1886
    y: 863
    width: 155
    height: 83
    borderLeft: 0
    borderRight: 0
    borderTop: 0
    borderBottom: 0
    paddingLeft: 0
    paddingRight: 22
    paddingTop: 0
    paddingBottom: 0
  - name: btn_cebian_xuanzhong2
    x: 144
    y: 614
    width: 177
    height: 83
    borderLeft: 70
    borderRight: 67
    borderTop: 0
    borderBottom: 0
    paddingLeft: 0
    paddingRight: 0
    paddingTop: 0
    paddingBottom: 0
  - name: btn_ci_anniu
    x: 0
    y: 48
    width: 156
    height: 56
    borderLeft: 10
    borderRight: 10
    borderTop: 10
    borderBottom: 10
    paddingLeft: 0
    paddingRight: 0
    paddingTop: 0
    paddingBottom: 0
  - name: btn_cianniu_xuanzhong
    x: 391
    y: 355
    width: 135
    height: 53
    borderLeft: 10
    borderRight: 10
    borderTop: 10
    borderBottom: 10
    paddingLeft: 0
    paddingRight: 0
    paddingTop: 0
    paddingBottom: 0
  - name: btn_close_popup
    x: 748
    y: 281
    width: 37
    height: 39
    borderLeft: 0
    borderRight: 0
    borderTop: 0
    borderBottom: 0
    paddingLeft: 0
    paddingRight: 0
    paddingTop: 0
    paddingBottom: 0
  - name: btn_dakai_ditu
    x: 420
    y: 654
    width: 68
    height: 310
    borderLeft: 0
    borderRight: 0
    borderTop: 0
    borderBottom: 0
    paddingLeft: 0
    paddingRight: 0
    paddingTop: 0
    paddingBottom: 0
  - name: btn_dakai_paixu_2
    x: 432
    y: 170
    width: 34
    height: 31
    borderLeft: 0
    borderRight: 0
    borderTop: 0
    borderBottom: 0
    paddingLeft: 0
    paddingRight: 0
    paddingTop: 0
    paddingBottom: 0
  - name: btn_erji_anhua
    x: 1097
    y: 422
    width: 140
    height: 50
    borderLeft: 20
    borderRight: 20
    borderTop: 20
    borderBottom: 20
    paddingLeft: 0
    paddingRight: 0
    paddingTop: 0
    paddingBottom: 0
  - name: btn_erji_anniu
    x: 1886
    y: 735
    width: 161
    height: 63
    borderLeft: 0
    borderRight: 0
    borderTop: 0
    borderBottom: 0
    paddingLeft: 0
    paddingRight: 0
    paddingTop: 0
    paddingBottom: 0
  - name: btn_erji_xuanzhong
    x: 1886
    y: 799
    width: 161
    height: 63
    borderLeft: 0
    borderRight: 0
    borderTop: 0
    borderBottom: 0
    paddingLeft: 0
    paddingRight: 0
    paddingTop: 0
    paddingBottom: 0
  - name: btn_erjianniu_lan
    x: 391
    y: 409
    width: 161
    height: 63
    borderLeft: 0
    borderRight: 0
    borderTop: 0
    borderBottom: 0
    paddingLeft: 0
    paddingRight: 0
    paddingTop: 0
    paddingBottom: 0
  - name: btn_fanhui
    x: 1359
    y: 22
    width: 43
    height: 44
    borderLeft: 0
    borderRight: 0
    borderTop: 0
    borderBottom: 0
    paddingLeft: 0
    paddingRight: 0
    paddingTop: 0
    paddingBottom: 0
  - name: btn_fenxiang
    x: 1267
    y: 158
    width: 49
    height: 50
    borderLeft: 0
    borderRight: 0
    borderTop: 0
    borderBottom: 0
    paddingLeft: 0
    paddingRight: 0
    paddingTop: 0
    paddingBottom: 0
  - name: btn_gantanhao_ecsd
    x: 206
    y: 159
    width: 57
    height: 57
    borderLeft: 0
    borderRight: 0
    borderTop: 0
    borderBottom: 0
    paddingLeft: 0
    paddingRight: 0
    paddingTop: 0
    paddingBottom: 0
  - name: btn_gantaohao_ecsd
    x: 431
    y: 596
    width: 57
    height: 57
    borderLeft: 0
    borderRight: 0
    borderTop: 0
    borderBottom: 0
    paddingLeft: 0
    paddingRight: 0
    paddingTop: 0
    paddingBottom: 0
  - name: btn_guanbi
    x: 157
    y: 75
    width: 94
    height: 60
    borderLeft: 0
    borderRight: 0
    borderTop: 0
    borderBottom: 0
    paddingLeft: 0
    paddingRight: 0
    paddingTop: 0
    paddingBottom: 0
  - name: btn_guanbi_anniu
    x: 1447
    y: 100
    width: 27
    height: 28
    borderLeft: 0
    borderRight: 0
    borderTop: 0
    borderBottom: 0
    paddingLeft: 0
    paddingRight: 1
    paddingTop: 0
    paddingBottom: 0
  - name: btn_huoyuedu_anniu1
    x: 1538
    y: 322
    width: 28
    height: 29
    borderLeft: 10
    borderRight: 10
    borderTop: 10
    borderBottom: 10
    paddingLeft: 0
    paddingRight: 0
    paddingTop: 0
    paddingBottom: 0
  - name: btn_huoyuedu_anniu2
    x: 726
    y: 756
    width: 121
    height: 108
    borderLeft: 30
    borderRight: 30
    borderTop: 30
    borderBottom: 30
    paddingLeft: 0
    paddingRight: 0
    paddingTop: 0
    paddingBottom: 0
  - name: btn_jiahao
    x: 958
    y: 83
    width: 56
    height: 57
    borderLeft: 0
    borderRight: 0
    borderTop: 0
    borderBottom: 0
    paddingLeft: 1
    paddingRight: 1
    paddingTop: 1
    paddingBottom: 0
  - name: btn_jiahao_02
    x: 1317
    y: 162
    width: 47
    height: 47
    borderLeft: 0
    borderRight: 0
    borderTop: 0
    borderBottom: 0
    paddingLeft: 0
    paddingRight: 0
    paddingTop: 0
    paddingBottom: 0
  - name: btn_jiahao_shop
    x: 1222
    y: 31
    width: 49
    height: 50
    borderLeft: 0
    borderRight: 0
    borderTop: 0
    borderBottom: 0
    paddingLeft: 1
    paddingRight: 0
    paddingTop: 0
    paddingBottom: 0
  - name: btn_jianhao_shop
    x: 1216
    y: 133
    width: 50
    height: 50
    borderLeft: 0
    borderRight: 0
    borderTop: 0
    borderBottom: 0
    paddingLeft: 0
    paddingRight: 0
    paddingTop: 0
    paddingBottom: 0
  - name: btn_jianpan_guanbi
    x: 1322
    y: 119
    width: 47
    height: 42
    borderLeft: 0
    borderRight: 0
    borderTop: 0
    borderBottom: 0
    paddingLeft: 2
    paddingRight: 2
    paddingTop: 2
    paddingBottom: 2
  - name: btn_jianpan_houtui
    x: 1406
    y: 91
    width: 40
    height: 29
    borderLeft: 0
    borderRight: 0
    borderTop: 0
    borderBottom: 0
    paddingLeft: 2
    paddingRight: 2
    paddingTop: 2
    paddingBottom: 2
  - name: btn_jianpan_jiahao
    x: 157
    y: 48
    width: 26
    height: 26
    borderLeft: 0
    borderRight: 0
    borderTop: 0
    borderBottom: 0
    paddingLeft: 2
    paddingRight: 2
    paddingTop: 2
    paddingBottom: 2
  - name: btn_jianpan_max
    x: 1406
    y: 77
    width: 37
    height: 13
    borderLeft: 0
    borderRight: 0
    borderTop: 0
    borderBottom: 0
    paddingLeft: 2
    paddingRight: 2
    paddingTop: 2
    paddingBottom: 2
  - name: btn_jianshao
    x: 661
    y: 674
    width: 64
    height: 64
    borderLeft: 0
    borderRight: 0
    borderTop: 0
    borderBottom: 0
    paddingLeft: 0
    paddingRight: 0
    paddingTop: 0
    paddingBottom: 0
  - name: btn_jianshao2
    x: 1408
    y: 122
    width: 34
    height: 34
    borderLeft: 0
    borderRight: 0
    borderTop: 0
    borderBottom: 0
    paddingLeft: 0
    paddingRight: 0
    paddingTop: 0
    paddingBottom: 0
  - name: btn_lingqu
    x: 489
    y: 802
    width: 236
    height: 62
    borderLeft: 0
    borderRight: 0
    borderTop: 0
    borderBottom: 0
    paddingLeft: 0
    paddingRight: 0
    paddingTop: 0
    paddingBottom: 0
  - name: btn_putong_anniu
    x: 921
    y: 407
    width: 140
    height: 50
    borderLeft: 40
    borderRight: 50
    borderTop: 0
    borderBottom: 0
    paddingLeft: 0
    paddingRight: 0
    paddingTop: 0
    paddingBottom: 0
  - name: btn_putong_xuanzhong
    x: 0
    y: 411
    width: 165
    height: 68
    borderLeft: 0
    borderRight: 0
    borderTop: 0
    borderBottom: 0
    paddingLeft: 0
    paddingRight: 0
    paddingTop: 0
    paddingBottom: 0
  - name: btn_qianwanchongzhi
    x: 489
    y: 739
    width: 236
    height: 62
    borderLeft: 0
    borderRight: 0
    borderTop: 0
    borderBottom: 0
    paddingLeft: 0
    paddingRight: 0
    paddingTop: 0
    paddingBottom: 0
  - name: btn_sanji_anniu
    x: 941
    y: 551
    width: 152
    height: 52
    borderLeft: 10
    borderRight: 10
    borderTop: 10
    borderBottom: 10
    paddingLeft: 0
    paddingRight: 0
    paddingTop: 0
    paddingBottom: 0
  - name: btn_sanji_anniu_xiao
    x: 709
    y: 239
    width: 144
    height: 41
    borderLeft: 40
    borderRight: 40
    borderTop: 20
    borderBottom: 20
    paddingLeft: 0
    paddingRight: 0
    paddingTop: 0
    paddingBottom: 0
  - name: btn_sanji_xuanzhong
    x: 854
    y: 228
    width: 144
    height: 41
    borderLeft: 10
    borderRight: 10
    borderTop: 10
    borderBottom: 10
    paddingLeft: 0
    paddingRight: 0
    paddingTop: 0
    paddingBottom: 0
  - name: btn_shangbiaoqian_1
    x: 504
    y: 94
    width: 109
    height: 44
    borderLeft: 0
    borderRight: 0
    borderTop: 0
    borderBottom: 0
    paddingLeft: 0
    paddingRight: 0
    paddingTop: 0
    paddingBottom: 0
  - name: btn_shangbiaoqian_2
    x: 403
    y: 38
    width: 109
    height: 44
    borderLeft: 0
    borderRight: 0
    borderTop: 0
    borderBottom: 0
    paddingLeft: 0
    paddingRight: 0
    paddingTop: 0
    paddingBottom: 0
  - name: btn_shangsuo_zhuangtai
    x: 1511
    y: 352
    width: 30
    height: 30
    borderLeft: 0
    borderRight: 0
    borderTop: 0
    borderBottom: 0
    paddingLeft: 0
    paddingRight: 0
    paddingTop: 0
    paddingBottom: 0
  - name: btn_shangsuo_zhuangtai2
    x: 1507
    y: 319
    width: 30
    height: 30
    borderLeft: 0
    borderRight: 0
    borderTop: 0
    borderBottom: 0
    paddingLeft: 0
    paddingRight: 0
    paddingTop: 0
    paddingBottom: 0
  - name: btn_shengji_jiantou
    x: 981
    y: 31
    width: 62
    height: 51
    borderLeft: 0
    borderRight: 0
    borderTop: 0
    borderBottom: 0
    paddingLeft: 0
    paddingRight: 0
    paddingTop: 0
    paddingBottom: 0
  - name: btn_shijian_paixu_3
    x: 491
    y: 315
    width: 32
    height: 39
    borderLeft: 0
    borderRight: 0
    borderTop: 0
    borderBottom: 0
    paddingLeft: 5
    paddingRight: 5
    paddingTop: 4
    paddingBottom: 3
  - name: btn_teshu2_anniu
    x: 589
    y: 12
    width: 103
    height: 38
    borderLeft: 50
    borderRight: 50
    borderTop: 0
    borderBottom: 0
    paddingLeft: 0
    paddingRight: 0
    paddingTop: 0
    paddingBottom: 0
  - name: btn_teshu2_anxia
    x: 1229
    y: 473
    width: 104
    height: 68
    borderLeft: 0
    borderRight: 0
    borderTop: 0
    borderBottom: 0
    paddingLeft: 0
    paddingRight: 0
    paddingTop: 0
    paddingBottom: 0
  - name: btn_tishih
    x: 1305
    y: 325
    width: 48
    height: 45
    borderLeft: 0
    borderRight: 0
    borderTop: 0
    borderBottom: 0
    paddingLeft: 0
    paddingRight: 0
    paddingTop: 0
    paddingBottom: 0
  - name: btn_touming
    x: 176
    y: 823
    width: 92
    height: 46
    borderLeft: 10
    borderRight: 10
    borderTop: 10
    borderBottom: 10
    paddingLeft: 0
    paddingRight: 0
    paddingTop: 0
    paddingBottom: 0
  - name: btn_weidakai_paixu_1
    x: 589
    y: 51
    width: 98
    height: 42
    borderLeft: 2
    borderRight: 2
    borderTop: 2
    borderBottom: 2
    paddingLeft: 0
    paddingRight: 0
    paddingTop: 0
    paddingBottom: 1
  - name: btn_white_plus
    x: 1001
    y: 344
    width: 60
    height: 62
    borderLeft: 0
    borderRight: 0
    borderTop: 0
    borderBottom: 0
    paddingLeft: 0
    paddingRight: 0
    paddingTop: 0
    paddingBottom: 0
  - name: btn_white_reduce
    x: 818
    y: 114
    width: 60
    height: 62
    borderLeft: 0
    borderRight: 0
    borderTop: 0
    borderBottom: 0
    paddingLeft: 0
    paddingRight: 0
    paddingTop: 0
    paddingBottom: 0
  - name: btn_white_spot
    x: 1294
    y: 210
    width: 48
    height: 49
    borderLeft: 0
    borderRight: 0
    borderTop: 0
    borderBottom: 0
    paddingLeft: 0
    paddingRight: 0
    paddingTop: 0
    paddingBottom: 0
  - name: btn_xiangqing
    x: 1400
    y: 398
    width: 49
    height: 53
    borderLeft: 0
    borderRight: 0
    borderTop: 0
    borderBottom: 0
    paddingLeft: 0
    paddingRight: 0
    paddingTop: 0
    paddingBottom: 0
  - name: btn_xiaotishi_ecsd
    x: 1015
    y: 86
    width: 27
    height: 31
    borderLeft: 0
    borderRight: 0
    borderTop: 0
    borderBottom: 0
    paddingLeft: 0
    paddingRight: 0
    paddingTop: 0
    paddingBottom: 0
  - name: btn_xin_dianzan
    x: 1478
    y: 350
    width: 32
    height: 32
    borderLeft: 0
    borderRight: 0
    borderTop: 0
    borderBottom: 0
    paddingLeft: 0
    paddingRight: 0
    paddingTop: 0
    paddingBottom: 0
  - name: btn_xin_guanbi
    x: 1403
    y: 29
    width: 41
    height: 45
    borderLeft: 0
    borderRight: 0
    borderTop: 0
    borderBottom: 0
    paddingLeft: 4
    paddingRight: 5
    paddingTop: 4
    paddingBottom: 1
  - name: btn_xin_help
    x: 1318
    y: 18
    width: 40
    height: 48
    borderLeft: 0
    borderRight: 0
    borderTop: 0
    borderBottom: 0
    paddingLeft: 4
    paddingRight: 6
    paddingTop: 1
    paddingBottom: 1
  - name: btn_xin_yidianzan
    x: 1474
    y: 315
    width: 32
    height: 32
    borderLeft: 0
    borderRight: 0
    borderTop: 0
    borderBottom: 0
    paddingLeft: 0
    paddingRight: 0
    paddingTop: 0
    paddingBottom: 0
  - name: btn_xuanzhong_yeqian
    x: 489
    y: 666
    width: 171
    height: 72
    borderLeft: 0
    borderRight: 0
    borderTop: 0
    borderBottom: 0
    paddingLeft: 0
    paddingRight: 0
    paddingTop: 0
    paddingBottom: 0
  - name: btn_zengjia
    x: 271
    y: 816
    width: 148
    height: 148
    borderLeft: 0
    borderRight: 0
    borderTop: 0
    borderBottom: 0
    paddingLeft: 0
    paddingRight: 0
    paddingTop: 0
    paddingBottom: 0
  - name: btn_zengjia2
    x: 1062
    y: 423
    width: 34
    height: 34
    borderLeft: 0
    borderRight: 0
    borderTop: 0
    borderBottom: 0
    paddingLeft: 0
    paddingRight: 0
    paddingTop: 0
    paddingBottom: 0
  - name: btn_zhandou_tisheng
    x: 572
    y: 252
    width: 54
    height: 58
    borderLeft: 0
    borderRight: 0
    borderTop: 0
    borderBottom: 0
    paddingLeft: 0
    paddingRight: 0
    paddingTop: 0
    paddingBottom: 0
  - name: btn_zhu_anniu
    x: 471
    y: 170
    width: 98
    height: 59
    borderLeft: 0
    borderRight: 0
    borderTop: 0
    borderBottom: 0
    paddingLeft: 0
    paddingRight: 0
    paddingTop: 0
    paddingBottom: 0
  - name: btn_zhu_anniuxuanzhong
    x: 572
    y: 180
    width: 98
    height: 59
    borderLeft: 0
    borderRight: 0
    borderTop: 0
    borderBottom: 0
    paddingLeft: 0
    paddingRight: 0
    paddingTop: 0
    paddingBottom: 0
  - name: btn_zuida
    x: 1267
    y: 116
    width: 54
    height: 41
    borderLeft: 30
    borderRight: 30
    borderTop: 0
    borderBottom: 0
    paddingLeft: 0
    paddingRight: 0
    paddingTop: 0
    paddingBottom: 0
  - name: btn_zuoceqieye_1
    x: 1206
    y: 478
    width: 20
    height: 48
    borderLeft: 5
    borderRight: 5
    borderTop: 5
    borderBottom: 5
    paddingLeft: 0
    paddingRight: 0
    paddingTop: 0
    paddingBottom: 0
  - name: btn_zuoceqieye_2
    x: 1318
    y: 67
    width: 42
    height: 48
    borderLeft: 6
    borderRight: 30
    borderTop: 0
    borderBottom: 0
    paddingLeft: 0
    paddingRight: 0
    paddingTop: 0
    paddingBottom: 0
  - name: btn_zuoyou_jiantou
    x: 1365
    y: 196
    width: 39
    height: 44
    borderLeft: 0
    borderRight: 0
    borderTop: 0
    borderBottom: 0
    paddingLeft: 0
    paddingRight: 0
    paddingTop: 0
    paddingBottom: 0
  - name: choice_bg
    x: 688
    y: 55
    width: 64
    height: 64
    borderLeft: 0
    borderRight: 0
    borderTop: 0
    borderBottom: 0
    paddingLeft: 0
    paddingRight: 0
    paddingTop: 0
    paddingBottom: 0
  - name: ico_aspo
    x: 431
    y: 568
    width: 26
    height: 27
    borderLeft: 0
    borderRight: 0
    borderTop: 0
    borderBottom: 0
    paddingLeft: 1
    paddingRight: 0
    paddingTop: 1
    paddingBottom: 0
  - name: pic_anniu_dakai_jiao
    x: 979
    y: 790
    width: 16
    height: 9
    borderLeft: 0
    borderRight: 0
    borderTop: 0
    borderBottom: 0
    paddingLeft: 0
    paddingRight: 0
    paddingTop: 0
    paddingBottom: 0
  - name: pic_anniu_xuanzhe
    x: 349
    y: 674
    width: 70
    height: 70
    borderLeft: 0
    borderRight: 0
    borderTop: 0
    borderBottom: 0
    paddingLeft: 0
    paddingRight: 0
    paddingTop: 0
    paddingBottom: 0
  - name: pic_anniuyanshenjiantou
    x: 760
    y: 177
    width: 16
    height: 8
    borderLeft: 0
    borderRight: 0
    borderTop: 0
    borderBottom: 0
    paddingLeft: 0
    paddingRight: 0
    paddingTop: 0
    paddingBottom: 0
  - name: pic_baikong_bg
    x: 1435
    y: 257
    width: 36
    height: 32
    borderLeft: 10
    borderRight: 10
    borderTop: 10
    borderBottom: 10
    paddingLeft: 0
    paddingRight: 0
    paddingTop: 0
    paddingBottom: 0
  - name: pic_baixian
    x: 264
    y: 223
    width: 14
    height: 3
    borderLeft: 1
    borderRight: 1
    borderTop: 1
    borderBottom: 1
    paddingLeft: 0
    paddingRight: 0
    paddingTop: 0
    paddingBottom: 0
  - name: pic_baoshi_weixuanzhong
    x: 1403
    y: 290
    width: 38
    height: 38
    borderLeft: 0
    borderRight: 0
    borderTop: 0
    borderBottom: 0
    paddingLeft: 0
    paddingRight: 0
    paddingTop: 0
    paddingBottom: 0
  - name: pic_baoshi_xuanzhong
    x: 1254
    y: 260
    width: 50
    height: 50
    borderLeft: 0
    borderRight: 0
    borderTop: 0
    borderBottom: 0
    paddingLeft: 0
    paddingRight: 0
    paddingTop: 0
    paddingBottom: 0
  - name: pic_baoxiang_1
    x: 1132
    y: 143
    width: 59
    height: 49
    borderLeft: 0
    borderRight: 0
    borderTop: 0
    borderBottom: 0
    paddingLeft: 0
    paddingRight: 0
    paddingTop: 0
    paddingBottom: 0
  - name: pic_baoxiang_1_h
    x: 1140
    y: 193
    width: 51
    height: 41
    borderLeft: 0
    borderRight: 0
    borderTop: 0
    borderBottom: 0
    paddingLeft: 4
    paddingRight: 4
    paddingTop: 4
    paddingBottom: 4
  - name: pic_baoxiang_2
    x: 1044
    y: 13
    width: 59
    height: 49
    borderLeft: 0
    borderRight: 0
    borderTop: 0
    borderBottom: 0
    paddingLeft: 0
    paddingRight: 0
    paddingTop: 0
    paddingBottom: 0
  - name: pic_baoxiang_2_h
    x: 1305
    y: 283
    width: 51
    height: 41
    borderLeft: 0
    borderRight: 0
    borderTop: 0
    borderBottom: 0
    paddingLeft: 4
    paddingRight: 4
    paddingTop: 4
    paddingBottom: 4
  - name: pic_baoxiang_3
    x: 1072
    y: 143
    width: 59
    height: 49
    borderLeft: 0
    borderRight: 0
    borderTop: 0
    borderBottom: 0
    paddingLeft: 0
    paddingRight: 0
    paddingTop: 0
    paddingBottom: 0
  - name: pic_baoxiang_3_h
    x: 1354
    y: 329
    width: 51
    height: 41
    borderLeft: 0
    borderRight: 0
    borderTop: 0
    borderBottom: 0
    paddingLeft: 4
    paddingRight: 4
    paddingTop: 4
    paddingBottom: 4
  - name: pic_baoxiang_4
    x: 1099
    y: 93
    width: 59
    height: 49
    borderLeft: 0
    borderRight: 0
    borderTop: 0
    borderBottom: 0
    paddingLeft: 0
    paddingRight: 0
    paddingTop: 0
    paddingBottom: 0
  - name: pic_baoxiang_4_h
    x: 1343
    y: 241
    width: 51
    height: 41
    borderLeft: 0
    borderRight: 0
    borderTop: 0
    borderBottom: 0
    paddingLeft: 4
    paddingRight: 4
    paddingTop: 4
    paddingBottom: 4
  - name: pic_baoxiang_5
    x: 1242
    y: 799
    width: 108
    height: 93
    borderLeft: 0
    borderRight: 0
    borderTop: 0
    borderBottom: 0
    paddingLeft: 0
    paddingRight: 0
    paddingTop: 0
    paddingBottom: 0
  - name: pic_baoxiang_5_h
    x: 738
    y: 364
    width: 94
    height: 73
    borderLeft: 0
    borderRight: 0
    borderTop: 0
    borderBottom: 0
    paddingLeft: 11
    paddingRight: 3
    paddingTop: 20
    paddingBottom: 0
  - name: pic_beibao_guanbi
    x: 1015
    y: 118
    width: 56
    height: 56
    borderLeft: 0
    borderRight: 0
    borderTop: 0
    borderBottom: 0
    paddingLeft: 0
    paddingRight: 0
    paddingTop: 0
    paddingBottom: 0
  - name: pic_bg_di
    x: 753
    y: 113
    width: 64
    height: 63
    borderLeft: 0
    borderRight: 0
    borderTop: 0
    borderBottom: 0
    paddingLeft: 0
    paddingRight: 0
    paddingTop: 0
    paddingBottom: 1
  - name: pic_biaoshi_hongdian
    x: 1442
    y: 307
    width: 31
    height: 36
    borderLeft: 0
    borderRight: 0
    borderTop: 0
    borderBottom: 0
    paddingLeft: 0
    paddingRight: 0
    paddingTop: 0
    paddingBottom: 0
  - name: pic_biaotidiban
    x: 1414
    y: 454
    width: 38
    height: 42
    borderLeft: 10
    borderRight: 25
    borderTop: 18
    borderBottom: 12
    paddingLeft: 0
    paddingRight: 0
    paddingTop: 0
    paddingBottom: 0
  - name: pic_biaotiditu
    x: 796
    y: 931
    width: 265
    height: 93
    borderLeft: 0
    borderRight: 0
    borderTop: 0
    borderBottom: 0
    paddingLeft: 0
    paddingRight: 0
    paddingTop: 0
    paddingBottom: 0
  - name: pic_black
    x: 1176
    y: 715
    width: 64
    height: 64
    borderLeft: 10
    borderRight: 10
    borderTop: 10
    borderBottom: 10
    paddingLeft: 0
    paddingRight: 0
    paddingTop: 0
    paddingBottom: 0
  - name: pic_btn_back
    x: 489
    y: 568
    width: 121
    height: 97
    borderLeft: 0
    borderRight: 0
    borderTop: 0
    borderBottom: 0
    paddingLeft: 0
    paddingRight: 0
    paddingTop: 0
    paddingBottom: 0
  - name: pic_btn_back_2
    x: 979
    y: 686
    width: 103
    height: 103
    borderLeft: 0
    borderRight: 0
    borderTop: 0
    borderBottom: 0
    paddingLeft: 0
    paddingRight: 0
    paddingTop: 0
    paddingBottom: 0
  - name: pic_cailiao_weixuanzhong
    x: 709
    y: 282
    width: 38
    height: 38
    borderLeft: 0
    borderRight: 0
    borderTop: 0
    borderBottom: 0
    paddingLeft: 0
    paddingRight: 0
    paddingTop: 0
    paddingBottom: 0
  - name: pic_cailiao_xuanzhong
    x: 1216
    y: 82
    width: 50
    height: 50
    borderLeft: 0
    borderRight: 0
    borderTop: 0
    borderBottom: 0
    paddingLeft: 0
    paddingRight: 0
    paddingTop: 0
    paddingBottom: 0
  - name: pic_cebian_anniu_weixuanzhong
    x: 826
    y: 531
    width: 110
    height: 70
    borderLeft: 0
    borderRight: 0
    borderTop: 0
    borderBottom: 0
    paddingLeft: 0
    paddingRight: 0
    paddingTop: 0
    paddingBottom: 0
  - name: pic_cebian_anniu_xuanzhong
    x: 848
    y: 703
    width: 130
    height: 96
    borderLeft: 29
    borderRight: 40
    borderTop: 0
    borderBottom: 0
    paddingLeft: 0
    paddingRight: 0
    paddingTop: 0
    paddingBottom: 0
  - name: pic_choice
    x: 1116
    y: 263
    width: 77
    height: 77
    borderLeft: 20
    borderRight: 20
    borderTop: 20
    borderBottom: 20
    paddingLeft: 1
    paddingRight: 0
    paddingTop: 1
    paddingBottom: 0
  - name: pic_chouka_dianliang
    x: 392
    y: 475
    width: 38
    height: 35
    borderLeft: 0
    borderRight: 0
    borderTop: 0
    borderBottom: 0
    paddingLeft: 0
    paddingRight: 0
    paddingTop: 0
    paddingBottom: 0
  - name: pic_chouka_weidianliang
    x: 1370
    y: 121
    width: 37
    height: 35
    borderLeft: 0
    borderRight: 0
    borderTop: 0
    borderBottom: 0
    paddingLeft: 1
    paddingRight: 0
    paddingTop: 0
    paddingBottom: 0
  - name: pic_chuandai_diwen
    x: 1058
    y: 193
    width: 81
    height: 38
    borderLeft: 0
    borderRight: 0
    borderTop: 0
    borderBottom: 0
    paddingLeft: 0
    paddingRight: 0
    paddingTop: 0
    paddingBottom: 0
  - name: pic_da_xingji
    x: 853
    y: 177
    width: 24
    height: 22
    borderLeft: 0
    borderRight: 0
    borderTop: 0
    borderBottom: 0
    paddingLeft: 0
    paddingRight: 0
    paddingTop: 1
    paddingBottom: 1
  - name: pic_danmu_ditu
    x: 867
    y: 327
    width: 51
    height: 34
    borderLeft: 10
    borderRight: 10
    borderTop: 10
    borderBottom: 10
    paddingLeft: 0
    paddingRight: 0
    paddingTop: 0
    paddingBottom: 0
  - name: pic_daoju_micheng_di
    x: 206
    y: 137
    width: 137
    height: 4
    borderLeft: 0
    borderRight: 0
    borderTop: 0
    borderBottom: 0
    paddingLeft: 0
    paddingRight: 0
    paddingTop: 0
    paddingBottom: 0
  - name: pic_daoju_mingchengdi
    x: 1343
    y: 211
    width: 18
    height: 29
    borderLeft: 8
    borderRight: 8
    borderTop: 0
    borderBottom: 0
    paddingLeft: 0
    paddingRight: 0
    paddingTop: 0
    paddingBottom: 0
  - name: pic_daoju_shixiao
    x: 1428
    y: 680
    width: 21
    height: 33
    borderLeft: 0
    borderRight: 0
    borderTop: 0
    borderBottom: 0
    paddingLeft: 0
    paddingRight: 0
    paddingTop: 0
    paddingBottom: 0
  - name: pic_daoju_xianshi
    x: 1192
    y: 150
    width: 21
    height: 33
    borderLeft: 0
    borderRight: 0
    borderTop: 0
    borderBottom: 0
    paddingLeft: 0
    paddingRight: 0
    paddingTop: 0
    paddingBottom: 0
  - name: pic_daoju_xuanzhong
    x: 901
    y: 800
    width: 115
    height: 130
    borderLeft: 0
    borderRight: 0
    borderTop: 0
    borderBottom: 0
    paddingLeft: 8
    paddingRight: 7
    paddingTop: 0
    paddingBottom: 0
  - name: pic_ditu_daoju_dikaung_bai
    x: 291
    y: 367
    width: 99
    height: 112
    borderLeft: 0
    borderRight: 0
    borderTop: 0
    borderBottom: 0
    paddingLeft: 7
    paddingRight: 6
    paddingTop: 0
    paddingBottom: 0
  - name: pic_ditu_daoju_dikaung_jin
    x: 0
    y: 298
    width: 99
    height: 112
    borderLeft: 0
    borderRight: 0
    borderTop: 0
    borderBottom: 0
    paddingLeft: 7
    paddingRight: 6
    paddingTop: 0
    paddingBottom: 0
  - name: pic_ditu_daoju_dikaung_lan
    x: 100
    y: 276
    width: 99
    height: 112
    borderLeft: 0
    borderRight: 0
    borderTop: 0
    borderBottom: 0
    paddingLeft: 7
    paddingRight: 6
    paddingTop: 0
    paddingBottom: 0
  - name: pic_ditu_daoju_dikaung_lv
    x: 0
    y: 185
    width: 99
    height: 112
    borderLeft: 0
    borderRight: 0
    borderTop: 0
    borderBottom: 0
    paddingLeft: 7
    paddingRight: 6
    paddingTop: 0
    paddingBottom: 0
  - name: pic_ditu_daoju_dikaung_zi
    x: 1142
    y: 780
    width: 99
    height: 112
    borderLeft: 0
    borderRight: 0
    borderTop: 0
    borderBottom: 0
    paddingLeft: 7
    paddingRight: 6
    paddingTop: 0
    paddingBottom: 0
  - name: pic_diwen_10_ecsd
    x: 1395
    y: 241
    width: 39
    height: 41
    borderLeft: 0
    borderRight: 0
    borderTop: 0
    borderBottom: 0
    paddingLeft: 0
    paddingRight: 0
    paddingTop: 0
    paddingBottom: 0
  - name: pic_diwen_11_ecsd
    x: 0
    y: 14
    width: 183
    height: 33
    borderLeft: 0
    borderRight: 0
    borderTop: 4
    borderBottom: 4
    paddingLeft: 0
    paddingRight: 0
    paddingTop: 0
    paddingBottom: 0
  - name: pic_diwen_2_ecsd
    x: 1334
    y: 452
    width: 79
    height: 89
    borderLeft: 12
    borderRight: 12
    borderTop: 12
    borderBottom: 12
    paddingLeft: 0
    paddingRight: 0
    paddingTop: 0
    paddingBottom: 0
  - name: pic_diwen_3_ecsd
    x: 2000
    y: 988
    width: 36
    height: 36
    borderLeft: 12
    borderRight: 12
    borderTop: 12
    borderBottom: 12
    paddingLeft: 0
    paddingRight: 0
    paddingTop: 0
    paddingBottom: 0
  - name: pic_diwen_4_ecsd
    x: 1105
    y: 235
    width: 97
    height: 27
    borderLeft: 13
    borderRight: 13
    borderTop: 13
    borderBottom: 13
    paddingLeft: 0
    paddingRight: 0
    paddingTop: 0
    paddingBottom: 0
  - name: pic_diwen_5_ecsd
    x: 688
    y: 51
    width: 3
    height: 3
    borderLeft: 2
    borderRight: 2
    borderTop: 2
    borderBottom: 2
    paddingLeft: 0
    paddingRight: 0
    paddingTop: 0
    paddingBottom: 0
  - name: pic_diwen_6_ecsd
    x: 0
    y: 870
    width: 270
    height: 94
    borderLeft: 13
    borderRight: 13
    borderTop: 13
    borderBottom: 13
    paddingLeft: 0
    paddingRight: 0
    paddingTop: 0
    paddingBottom: 0
  - name: pic_fanhui_ecsd
    x: 458
    y: 568
    width: 27
    height: 27
    borderLeft: 0
    borderRight: 0
    borderTop: 0
    borderBottom: 0
    paddingLeft: 0
    paddingRight: 0
    paddingTop: 3
    paddingBottom: 2
  - name: pic_fenge_an
    x: 184
    y: 14
    width: 112
    height: 13
    borderLeft: 0
    borderRight: 0
    borderTop: 0
    borderBottom: 0
    paddingLeft: 0
    paddingRight: 0
    paddingTop: 0
    paddingBottom: 0
  - name: pic_fengexian
    x: 0
    y: 2
    width: 448
    height: 5
    borderLeft: 0
    borderRight: 0
    borderTop: 0
    borderBottom: 0
    paddingLeft: 0
    paddingRight: 0
    paddingTop: 0
    paddingBottom: 0
  - name: pic_fengexian_ecsd
    x: 1507
    y: 316
    width: 406
    height: 2
    borderLeft: 0
    borderRight: 0
    borderTop: 0
    borderBottom: 0
    paddingLeft: 0
    paddingRight: 0
    paddingTop: 0
    paddingBottom: 0
  - name: pic_gonghui_miaoshu_diban
    x: 1474
    y: 864
    width: 315
    height: 42
    borderLeft: 0
    borderRight: 0
    borderTop: 0
    borderBottom: 0
    paddingLeft: 0
    paddingRight: 0
    paddingTop: 0
    paddingBottom: 0
  - name: pic_goumaishuliangdiwen
    x: 1361
    y: 75
    width: 44
    height: 43
    borderLeft: 20
    borderRight: 20
    borderTop: 0
    borderBottom: 0
    paddingLeft: 0
    paddingRight: 0
    paddingTop: 0
    paddingBottom: 0
  - name: pic_gouxuan
    x: 1203
    y: 236
    width: 27
    height: 23
    borderLeft: 0
    borderRight: 0
    borderTop: 0
    borderBottom: 0
    paddingLeft: 0
    paddingRight: 0
    paddingTop: 0
    paddingBottom: 0
  - name: pic_gouxuankuang
    x: 1405
    y: 205
    width: 35
    height: 35
    borderLeft: 0
    borderRight: 0
    borderTop: 0
    borderBottom: 0
    paddingLeft: 0
    paddingRight: 5
    paddingTop: 4
    paddingBottom: 1
  - name: pic_gouxuanzhong_ecsd
    x: 1097
    y: 527
    width: 27
    height: 23
    borderLeft: 0
    borderRight: 0
    borderTop: 0
    borderBottom: 0
    paddingLeft: 0
    paddingRight: 0
    paddingTop: 0
    paddingBottom: 0
  - name: pic_guansuo
    x: 1243
    y: 209
    width: 50
    height: 50
    borderLeft: 0
    borderRight: 0
    borderTop: 0
    borderBottom: 0
    paddingLeft: 0
    paddingRight: 0
    paddingTop: 0
    paddingBottom: 0
  - name: pic_guansuo2
    x: 1409
    y: 169
    width: 32
    height: 35
    borderLeft: 0
    borderRight: 0
    borderTop: 0
    borderBottom: 0
    paddingLeft: 2
    paddingRight: 2
    paddingTop: 0
    paddingBottom: 1
  - name: pic_hblist_kuang1_0
    x: 176
    y: 698
    width: 172
    height: 117
    borderLeft: 0
    borderRight: 0
    borderTop: 0
    borderBottom: 0
    paddingLeft: 2
    paddingRight: 1
    paddingTop: 2
    paddingBottom: 5
  - name: pic_hblist_kuang2_0
    x: 0
    y: 749
    width: 175
    height: 120
    borderLeft: 0
    borderRight: 0
    borderTop: 0
    borderBottom: 0
    paddingLeft: 0
    paddingRight: 0
    paddingTop: 0
    paddingBottom: 4
  - name: pic_huoban_jinengdengji
    x: 981
    y: 8
    width: 58
    height: 22
    borderLeft: 0
    borderRight: 0
    borderTop: 0
    borderBottom: 0
    paddingLeft: 0
    paddingRight: 0
    paddingTop: 0
    paddingBottom: 0
  - name: pic_huoban_jinengkuang
    x: 534
    y: 905
    width: 261
    height: 119
    borderLeft: 0
    borderRight: 0
    borderTop: 0
    borderBottom: 0
    paddingLeft: 0
    paddingRight: 0
    paddingTop: 0
    paddingBottom: 0
  - name: pic_huoban_jinengkuang2
    x: 200
    y: 288
    width: 88
    height: 100
    borderLeft: 0
    borderRight: 0
    borderTop: 0
    borderBottom: 0
    paddingLeft: 0
    paddingRight: 0
    paddingTop: 0
    paddingBottom: 0
  - name: pic_huobi_shuzi_diwen
    x: 432
    y: 139
    width: 162
    height: 30
    borderLeft: 20
    borderRight: 20
    borderTop: 0
    borderBottom: 0
    paddingLeft: 0
    paddingRight: 0
    paddingTop: 0
    paddingBottom: 0
  - name: pic_huodewupin
    x: 848
    y: 805
    width: 51
    height: 59
    borderLeft: 20
    borderRight: 20
    borderTop: 20
    borderBottom: 20
    paddingLeft: 0
    paddingRight: 0
    paddingTop: 0
    paddingBottom: 0
  - name: pic_image_skill_cm
    x: 1351
    y: 807
    width: 101
    height: 85
    borderLeft: 10
    borderRight: 10
    borderTop: 10
    borderBottom: 10
    paddingLeft: 0
    paddingRight: 0
    paddingTop: 0
    paddingBottom: 0
  - name: pic_item_dikuang
    x: 119
    y: 516
    width: 117
    height: 97
    borderLeft: 0
    borderRight: 0
    borderTop: 0
    borderBottom: 0
    paddingLeft: 0
    paddingRight: 0
    paddingTop: 0
    paddingBottom: 0
  - name: pic_jingyantiao_dicao_2
    x: 1443
    y: 122
    width: 2
    height: 6
    borderLeft: 1
    borderRight: 1
    borderTop: 2
    borderBottom: 2
    paddingLeft: 0
    paddingRight: 0
    paddingTop: 0
    paddingBottom: 0
  - name: pic_kaisuo
    x: 1441
    y: 221
    width: 32
    height: 35
    borderLeft: 0
    borderRight: 0
    borderTop: 0
    borderBottom: 0
    paddingLeft: 2
    paddingRight: 2
    paddingTop: 0
    paddingBottom: 1
  - name: pic_ketisheng
    x: 1094
    y: 551
    width: 43
    height: 52
    borderLeft: 0
    borderRight: 0
    borderTop: 0
    borderBottom: 0
    paddingLeft: 0
    paddingRight: 0
    paddingTop: 0
    paddingBottom: 0
  - name: pic_kuang_ecsd
    x: 1443
    y: 129
    width: 30
    height: 30
    borderLeft: 10
    borderRight: 10
    borderTop: 10
    borderBottom: 10
    paddingLeft: 0
    paddingRight: 0
    paddingTop: 0
    paddingBottom: 0
  - name: pic_kuang_shop
    x: 853
    y: 200
    width: 137
    height: 27
    borderLeft: 5
    borderRight: 5
    borderTop: 5
    borderBottom: 5
    paddingLeft: 0
    paddingRight: 0
    paddingTop: 0
    paddingBottom: 0
  - name: pic_liaotian_jiao
    x: 996
    y: 792
    width: 13
    height: 7
    borderLeft: 0
    borderRight: 0
    borderTop: 0
    borderBottom: 0
    paddingLeft: 0
    paddingRight: 0
    paddingTop: 0
    paddingBottom: 0
  - name: pic_liaotian_kuang
    x: 958
    y: 58
    width: 21
    height: 24
    borderLeft: 9
    borderRight: 9
    borderTop: 9
    borderBottom: 9
    paddingLeft: 0
    paddingRight: 0
    paddingTop: 0
    paddingBottom: 0
  - name: pic_liebiao_diwen
    x: 664
    y: 94
    width: 21
    height: 2
    borderLeft: 0
    borderRight: 0
    borderTop: 0
    borderBottom: 0
    paddingLeft: 0
    paddingRight: 0
    paddingTop: 0
    paddingBottom: 0
  - name: pic_mingzi_di_bai
    x: 300
    y: 8
    width: 143
    height: 27
    borderLeft: 0
    borderRight: 0
    borderTop: 0
    borderBottom: 0
    paddingLeft: 0
    paddingRight: 0
    paddingTop: 0
    paddingBottom: 0
  - name: pic_mingzi_di_cheng
    x: 753
    y: 85
    width: 143
    height: 27
    borderLeft: 0
    borderRight: 0
    borderTop: 0
    borderBottom: 0
    paddingLeft: 0
    paddingRight: 0
    paddingTop: 0
    paddingBottom: 0
  - name: pic_mingzi_di_lan
    x: 693
    y: 27
    width: 143
    height: 27
    borderLeft: 0
    borderRight: 0
    borderTop: 0
    borderBottom: 0
    paddingLeft: 0
    paddingRight: 0
    paddingTop: 0
    paddingBottom: 0
  - name: pic_mingzi_di_lv
    x: 444
    y: 8
    width: 143
    height: 27
    borderLeft: 0
    borderRight: 0
    borderTop: 0
    borderBottom: 0
    paddingLeft: 0
    paddingRight: 0
    paddingTop: 0
    paddingBottom: 0
  - name: pic_mingzi_di_red
    x: 753
    y: 57
    width: 143
    height: 27
    borderLeft: 0
    borderRight: 0
    borderTop: 0
    borderBottom: 0
    paddingLeft: 0
    paddingRight: 0
    paddingTop: 0
    paddingBottom: 0
  - name: pic_mingzi_di_zi
    x: 837
    y: 1
    width: 143
    height: 27
    borderLeft: 0
    borderRight: 0
    borderTop: 0
    borderBottom: 0
    paddingLeft: 0
    paddingRight: 0
    paddingTop: 0
    paddingBottom: 0
  - name: pic_mingzi_dikaung
    x: 837
    y: 29
    width: 143
    height: 27
    borderLeft: 0
    borderRight: 0
    borderTop: 0
    borderBottom: 0
    paddingLeft: 0
    paddingRight: 0
    paddingTop: 0
    paddingBottom: 0
  - name: pic_missing
    x: 0
    y: 510
    width: 118
    height: 118
    borderLeft: 0
    borderRight: 0
    borderTop: 0
    borderBottom: 0
    paddingLeft: 6
    paddingRight: 8
    paddingTop: 6
    paddingBottom: 8
  - name: pic_none
    x: 397
    y: 88
    width: 4
    height: 4
    borderLeft: 0
    borderRight: 0
    borderTop: 0
    borderBottom: 0
    paddingLeft: 0
    paddingRight: 0
    paddingTop: 0
    paddingBottom: 0
  - name: pic_putong_weixuanzhong
    x: 1370
    y: 157
    width: 38
    height: 38
    borderLeft: 0
    borderRight: 0
    borderTop: 0
    borderBottom: 0
    paddingLeft: 0
    paddingRight: 0
    paddingTop: 0
    paddingBottom: 0
  - name: pic_putong_xuanzhong
    x: 1192
    y: 184
    width: 50
    height: 50
    borderLeft: 0
    borderRight: 0
    borderTop: 0
    borderBottom: 0
    paddingLeft: 0
    paddingRight: 0
    paddingTop: 0
    paddingBottom: 0
  - name: pic_quan
    x: 1376
    y: 545
    width: 72
    height: 75
    borderLeft: 0
    borderRight: 0
    borderTop: 0
    borderBottom: 0
    paddingLeft: 0
    paddingRight: 0
    paddingTop: 0
    paddingBottom: 0
  - name: pic_quan_di
    x: 555
    y: 455
    width: 102
    height: 101
    borderLeft: 0
    borderRight: 0
    borderTop: 0
    borderBottom: 0
    paddingLeft: 0
    paddingRight: 0
    paddingTop: 0
    paddingBottom: 0
  - name: pic_rank_01
    x: 1042
    y: 604
    width: 99
    height: 81
    borderLeft: 0
    borderRight: 0
    borderTop: 0
    borderBottom: 0
    paddingLeft: 1
    paddingRight: 0
    paddingTop: 0
    paddingBottom: 0
  - name: pic_rank_02
    x: 941
    y: 604
    width: 100
    height: 81
    borderLeft: 0
    borderRight: 0
    borderTop: 0
    borderBottom: 0
    paddingLeft: 0
    paddingRight: 0
    paddingTop: 0
    paddingBottom: 0
  - name: pic_rank_03
    x: 345
    y: 134
    width: 86
    height: 67
    borderLeft: 0
    borderRight: 0
    borderTop: 0
    borderBottom: 0
    paddingLeft: 7
    paddingRight: 7
    paddingTop: 7
    paddingBottom: 7
  - name: pic_rank_1
    x: 1272
    y: 70
    width: 45
    height: 45
    borderLeft: 0
    borderRight: 0
    borderTop: 0
    borderBottom: 0
    paddingLeft: 0
    paddingRight: 0
    paddingTop: 0
    paddingBottom: 0
  - name: pic_rank_2
    x: 1357
    y: 283
    width: 45
    height: 45
    borderLeft: 0
    borderRight: 0
    borderTop: 0
    borderBottom: 0
    paddingLeft: 0
    paddingRight: 0
    paddingTop: 0
    paddingBottom: 0
  - name: pic_rank_3
    x: 1272
    y: 24
    width: 45
    height: 45
    borderLeft: 0
    borderRight: 0
    borderTop: 0
    borderBottom: 0
    paddingLeft: 0
    paddingRight: 0
    paddingTop: 0
    paddingBottom: 0
  - name: pic_renwu_bantouming_diban
    x: 345
    y: 202
    width: 20
    height: 20
    borderLeft: 8
    borderRight: 8
    borderTop: 8
    borderBottom: 8
    paddingLeft: 0
    paddingRight: 0
    paddingTop: 0
    paddingBottom: 0
  - name: pic_roumor
    x: 1442
    y: 192
    width: 35
    height: 28
    borderLeft: 0
    borderRight: 0
    borderTop: 0
    borderBottom: 0
    paddingLeft: 1
    paddingRight: 0
    paddingTop: 1
    paddingBottom: 0
  - name: pic_sanji_diban_2_ecsd
    x: 1269
    y: 626
    width: 59
    height: 79
    borderLeft: 10
    borderRight: 10
    borderTop: 10
    borderBottom: 10
    paddingLeft: 0
    paddingRight: 0
    paddingTop: 0
    paddingBottom: 0
  - name: pic_sanji_diban_ecsd
    x: 1142
    y: 614
    width: 33
    height: 33
    borderLeft: 10
    borderRight: 10
    borderTop: 10
    borderBottom: 10
    paddingLeft: 0
    paddingRight: 0
    paddingTop: 0
    paddingBottom: 0
  - name: pic_shangsuo_zhuangtai_ecsd
    x: 1445
    y: 60
    width: 30
    height: 30
    borderLeft: 0
    borderRight: 0
    borderTop: 0
    borderBottom: 0
    paddingLeft: 0
    paddingRight: 0
    paddingTop: 0
    paddingBottom: 0
  - name: pic_shousuo_zhankaiye_1
    x: 739
    y: 177
    width: 20
    height: 8
    borderLeft: 0
    borderRight: 0
    borderTop: 0
    borderBottom: 0
    paddingLeft: 0
    paddingRight: 0
    paddingTop: 0
    paddingBottom: 0
  - name: pic_shousuo_zhankaiye_3
    x: 322
    y: 663
    width: 24
    height: 34
    borderLeft: 0
    borderRight: 0
    borderTop: 0
    borderBottom: 0
    paddingLeft: 0
    paddingRight: 0
    paddingTop: 0
    paddingBottom: 0
  - name: pic_shuijingshuliangdiwen
    x: 897
    y: 58
    width: 20
    height: 21
    borderLeft: 10
    borderRight: 10
    borderTop: 0
    borderBottom: 0
    paddingLeft: 0
    paddingRight: 0
    paddingTop: 0
    paddingBottom: 0
  - name: pic_shuru_dikuang
    x: 264
    y: 227
    width: 23
    height: 60
    borderLeft: 5
    borderRight: 5
    borderTop: 10
    borderBottom: 10
    paddingLeft: 0
    paddingRight: 0
    paddingTop: 0
    paddingBottom: 0
  - name: pic_shuxing_diban_01
    x: 317
    y: 578
    width: 4
    height: 35
    borderLeft: 0
    borderRight: 0
    borderTop: 0
    borderBottom: 0
    paddingLeft: 0
    paddingRight: 0
    paddingTop: 0
    paddingBottom: 0
  - name: pic_shuxing_diban_02
    x: 982
    y: 290
    width: 18
    height: 35
    borderLeft: 0
    borderRight: 0
    borderTop: 0
    borderBottom: 0
    paddingLeft: 0
    paddingRight: 0
    paddingTop: 0
    paddingBottom: 0
  - name: pic_shuxing_diban_03
    x: 1474
    y: 948
    width: 6
    height: 3
    borderLeft: 0
    borderRight: 0
    borderTop: 0
    borderBottom: 0
    paddingLeft: 0
    paddingRight: 0
    paddingTop: 0
    paddingBottom: 0
  - name: pic_shuxing_diban_04
    x: 1400
    y: 383
    width: 141
    height: 14
    borderLeft: 0
    borderRight: 0
    borderTop: 0
    borderBottom: 0
    paddingLeft: 0
    paddingRight: 0
    paddingTop: 0
    paddingBottom: 0
  - name: pic_shuxing_miaoshu_diban_01
    x: 1062
    y: 973
    width: 418
    height: 51
    borderLeft: 0
    borderRight: 0
    borderTop: 0
    borderBottom: 0
    paddingLeft: 0
    paddingRight: 0
    paddingTop: 0
    paddingBottom: 0
  - name: pic_skill_hint
    x: 1229
    y: 564
    width: 36
    height: 48
    borderLeft: 0
    borderRight: 0
    borderTop: 0
    borderBottom: 0
    paddingLeft: 0
    paddingRight: 0
    paddingTop: 0
    paddingBottom: 0
  - name: pic_sousuo
    x: 125
    y: 105
    width: 31
    height: 30
    borderLeft: 0
    borderRight: 0
    borderTop: 0
    borderBottom: 0
    paddingLeft: 0
    paddingRight: 1
    paddingTop: 1
    paddingBottom: 1
  - name: pic_SSR
    x: 403
    y: 83
    width: 100
    height: 50
    borderLeft: 0
    borderRight: 0
    borderTop: 0
    borderBottom: 0
    paddingLeft: 0
    paddingRight: 0
    paddingTop: 0
    paddingBottom: 0
  - name: pic_sysset_1
    x: 1337
    y: 260
    width: 4
    height: 22
    borderLeft: 0
    borderRight: 0
    borderTop: 0
    borderBottom: 0
    paddingLeft: 0
    paddingRight: 0
    paddingTop: 0
    paddingBottom: 0
  - name: pic_sysset_2
    x: 974
    y: 686
    width: 4
    height: 16
    borderLeft: 0
    borderRight: 0
    borderTop: 0
    borderBottom: 0
    paddingLeft: 0
    paddingRight: 0
    paddingTop: 3
    paddingBottom: 3
  - name: pic_sysset_3
    x: 1472
    y: 272
    width: 31
    height: 34
    borderLeft: 0
    borderRight: 0
    borderTop: 0
    borderBottom: 0
    paddingLeft: 0
    paddingRight: 0
    paddingTop: 0
    paddingBottom: 0
  - name: pic_texiao_xingxing
    x: 1893
    y: 947
    width: 145
    height: 39
    borderLeft: 0
    borderRight: 0
    borderTop: 0
    borderBottom: 0
    paddingLeft: 1
    paddingRight: 2
    paddingTop: 1
    paddingBottom: 3
  - name: pic_tick
    x: 777
    y: 177
    width: 75
    height: 61
    borderLeft: 0
    borderRight: 0
    borderTop: 0
    borderBottom: 0
    paddingLeft: 0
    paddingRight: 0
    paddingTop: 0
    paddingBottom: 0
  - name: pic_tip_dikuangda
    x: 100
    y: 217
    width: 163
    height: 58
    borderLeft: 60
    borderRight: 60
    borderTop: 35
    borderBottom: 20
    paddingLeft: 0
    paddingRight: 0
    paddingTop: 0
    paddingBottom: 0
  - name: pic_tip_fenge
    x: 1538
    y: 319
    width: 362
    height: 2
    borderLeft: 1
    borderRight: 1
    borderTop: 0
    borderBottom: 0
    paddingLeft: 0
    paddingRight: 0
    paddingTop: 0
    paddingBottom: 0
  - name: pic_tip_huadongtiao
    x: 1474
    y: 952
    width: 6
    height: 20
    borderLeft: 0
    borderRight: 0
    borderTop: 0
    borderBottom: 0
    paddingLeft: 0
    paddingRight: 0
    paddingTop: 0
    paddingBottom: 0
  - name: pic_tip_huadongtiao_di
    x: 504
    y: 83
    width: 6
    height: 10
    borderLeft: 0
    borderRight: 0
    borderTop: 0
    borderBottom: 0
    paddingLeft: 0
    paddingRight: 0
    paddingTop: 0
    paddingBottom: 0
  - name: pic_tips_biaoti_diwen_1
    x: 1142
    y: 648
    width: 30
    height: 38
    borderLeft: 0
    borderRight: 0
    borderTop: 0
    borderBottom: 0
    paddingLeft: 0
    paddingRight: 0
    paddingTop: 0
    paddingBottom: 0
  - name: pic_tips_biaoti_diwen_2
    x: 449
    y: 3
    width: 207
    height: 4
    borderLeft: 8
    borderRight: 8
    borderTop: 1
    borderBottom: 1
    paddingLeft: 0
    paddingRight: 0
    paddingTop: 0
    paddingBottom: 0
  - name: pic_tips_diwen
    x: 1207
    y: 67
    width: 14
    height: 14
    borderLeft: 0
    borderRight: 0
    borderTop: 0
    borderBottom: 0
    paddingLeft: 0
    paddingRight: 0
    paddingTop: 0
    paddingBottom: 0
  - name: pic_tips_kuang_bai_1
    x: 1062
    y: 893
    width: 411
    height: 39
    borderLeft: 0
    borderRight: 0
    borderTop: 0
    borderBottom: 0
    paddingLeft: 0
    paddingRight: 0
    paddingTop: 0
    paddingBottom: 0
  - name: pic_tips_kuang_bai_2
    x: 289
    y: 223
    width: 100
    height: 71
    borderLeft: 0
    borderRight: 0
    borderTop: 0
    borderBottom: 0
    paddingLeft: 0
    paddingRight: 0
    paddingTop: 0
    paddingBottom: 0
  - name: pic_tips_kuang_cheng_1
    x: 1474
    y: 907
    width: 411
    height: 39
    borderLeft: 0
    borderRight: 0
    borderTop: 0
    borderBottom: 0
    paddingLeft: 0
    paddingRight: 0
    paddingTop: 0
    paddingBottom: 0
  - name: pic_tips_kuang_cheng_2
    x: 289
    y: 295
    width: 100
    height: 71
    borderLeft: 0
    borderRight: 0
    borderTop: 0
    borderBottom: 0
    paddingLeft: 0
    paddingRight: 0
    paddingTop: 0
    paddingBottom: 0
  - name: pic_tips_kuang_lan_1
    x: 489
    y: 865
    width: 411
    height: 39
    borderLeft: 0
    borderRight: 0
    borderTop: 0
    borderBottom: 0
    paddingLeft: 0
    paddingRight: 0
    paddingTop: 0
    paddingBottom: 0
  - name: pic_tips_kuang_lan_2
    x: 527
    y: 311
    width: 100
    height: 71
    borderLeft: 0
    borderRight: 0
    borderTop: 0
    borderBottom: 0
    paddingLeft: 0
    paddingRight: 0
    paddingTop: 0
    paddingBottom: 0
  - name: pic_tips_kuang_lv_1
    x: 1481
    y: 947
    width: 411
    height: 39
    borderLeft: 0
    borderRight: 0
    borderTop: 0
    borderBottom: 0
    paddingLeft: 0
    paddingRight: 0
    paddingTop: 0
    paddingBottom: 0
  - name: pic_tips_kuang_lv_2
    x: 390
    y: 283
    width: 100
    height: 71
    borderLeft: 0
    borderRight: 0
    borderTop: 0
    borderBottom: 0
    paddingLeft: 0
    paddingRight: 0
    paddingTop: 0
    paddingBottom: 0
  - name: pic_tips_kuang_zi_1
    x: 1062
    y: 933
    width: 411
    height: 39
    borderLeft: 0
    borderRight: 0
    borderTop: 0
    borderBottom: 0
    paddingLeft: 0
    paddingRight: 0
    paddingTop: 0
    paddingBottom: 0
  - name: pic_tips_kuang_zi_2
    x: 553
    y: 383
    width: 100
    height: 71
    borderLeft: 0
    borderRight: 0
    borderTop: 0
    borderBottom: 0
    paddingLeft: 0
    paddingRight: 0
    paddingTop: 0
    paddingBottom: 0
  - name: pic_tisheng
    x: 1428
    y: 650
    width: 23
    height: 29
    borderLeft: 0
    borderRight: 0
    borderTop: 0
    borderBottom: 0
    paddingLeft: 0
    paddingRight: 0
    paddingTop: 1
    paddingBottom: 1
  - name: pic_title_skill_cm
    x: 0
    y: 480
    width: 391
    height: 29
    borderLeft: 0
    borderRight: 0
    borderTop: 0
    borderBottom: 0
    paddingLeft: 0
    paddingRight: 0
    paddingTop: 0
    paddingBottom: 0
  - name: pic_title_tip_daily
    x: 1481
    y: 987
    width: 518
    height: 37
    borderLeft: 0
    borderRight: 0
    borderTop: 0
    borderBottom: 0
    paddingLeft: 0
    paddingRight: 0
    paddingTop: 0
    paddingBottom: 0
  - name: pic_tongyong_diban_aoxian_1
    x: 1474
    y: 241
    width: 30
    height: 30
    borderLeft: 10
    borderRight: 10
    borderTop: 10
    borderBottom: 10
    paddingLeft: 0
    paddingRight: 0
    paddingTop: 0
    paddingBottom: 0
  - name: pic_tongyong_diban_aoxian_2
    x: 1504
    y: 284
    width: 30
    height: 30
    borderLeft: 10
    borderRight: 10
    borderTop: 10
    borderBottom: 10
    paddingLeft: 0
    paddingRight: 0
    paddingTop: 0
    paddingBottom: 0
  - name: pic_tongyong_diwen_zuixin
    x: 390
    y: 202
    width: 80
    height: 80
    borderLeft: 20
    borderRight: 20
    borderTop: 20
    borderBottom: 20
    paddingLeft: 0
    paddingRight: 0
    paddingTop: 0
    paddingBottom: 0
  - name: pic_tongyong_erji_jiemian_ecsd
    x: 1097
    y: 474
    width: 108
    height: 52
    borderLeft: 15
    borderRight: 85
    borderTop: 20
    borderBottom: 20
    paddingLeft: 0
    paddingRight: 0
    paddingTop: 0
    paddingBottom: 0
  - name: pic_tongyong_nuqi
    x: 1428
    y: 621
    width: 23
    height: 28
    borderLeft: 0
    borderRight: 0
    borderTop: 0
    borderBottom: 0
    paddingLeft: 0
    paddingRight: 0
    paddingTop: 0
    paddingBottom: 0
  - name: pic_tongyong_wupindi
    x: 999
    y: 232
    width: 105
    height: 52
    borderLeft: 0
    borderRight: 0
    borderTop: 0
    borderBottom: 0
    paddingLeft: 0
    paddingRight: 0
    paddingTop: 0
    paddingBottom: 0
  - name: pic_toumingdi
    x: 1001
    y: 175
    width: 56
    height: 56
    borderLeft: 20
    borderRight: 20
    borderTop: 20
    borderBottom: 20
    paddingLeft: 0
    paddingRight: 0
    paddingTop: 0
    paddingBottom: 0
  - name: pic_travel_gou
    x: 513
    y: 36
    width: 75
    height: 57
    borderLeft: 0
    borderRight: 0
    borderTop: 0
    borderBottom: 0
    paddingLeft: 0
    paddingRight: 0
    paddingTop: 0
    paddingBottom: 0
  - name: pic_travel_guanbi
    x: 671
    y: 120
    width: 67
    height: 65
    borderLeft: 0
    borderRight: 0
    borderTop: 0
    borderBottom: 0
    paddingLeft: 0
    paddingRight: 0
    paddingTop: 0
    paddingBottom: 0
  - name: pic_tubiao_liwu
    x: 1269
    y: 542
    width: 106
    height: 78
    borderLeft: 0
    borderRight: 0
    borderTop: 0
    borderBottom: 0
    paddingLeft: 0
    paddingRight: 13
    paddingTop: 19
    paddingBottom: 0
  - name: pic_tupian_biaotidi
    x: 1414
    y: 497
    width: 36
    height: 47
    borderLeft: 10
    borderRight: 10
    borderTop: 10
    borderBottom: 10
    paddingLeft: 0
    paddingRight: 0
    paddingTop: 0
    paddingBottom: 0
  - name: pic_txk_bai
    x: 726
    y: 645
    width: 108
    height: 110
    borderLeft: 0
    borderRight: 0
    borderTop: 0
    borderBottom: 0
    paddingLeft: 1
    paddingRight: 1
    paddingTop: 0
    paddingBottom: 0
  - name: pic_wei_gouxuanzhong_ecsd
    x: 1194
    y: 311
    width: 29
    height: 29
    borderLeft: 0
    borderRight: 0
    borderTop: 0
    borderBottom: 0
    paddingLeft: 0
    paddingRight: 0
    paddingTop: 0
    paddingBottom: 0
  - name: pic_weituo_duihuakuang
    x: 0
    y: 629
    width: 143
    height: 119
    borderLeft: 40
    borderRight: 70
    borderTop: 0
    borderBottom: 0
    paddingLeft: 0
    paddingRight: 0
    paddingTop: 0
    paddingBottom: 0
  - name: pic_wenhuan_tanchuang
    x: 940
    y: 57
    width: 16
    height: 3
    borderLeft: 0
    borderRight: 0
    borderTop: 0
    borderBottom: 0
    paddingLeft: 0
    paddingRight: 0
    paddingTop: 0
    paddingBottom: 0
  - name: pic_wenzi_xianshikuangti_1
    x: 368
    y: 93
    width: 30
    height: 40
    borderLeft: 0
    borderRight: 0
    borderTop: 0
    borderBottom: 0
    paddingLeft: 0
    paddingRight: 0
    paddingTop: 0
    paddingBottom: 0
  - name: pic_wenzimiaoshu_diwen1
    x: 1104
    y: 9
    width: 531
    height: 4
    borderLeft: 0
    borderRight: 0
    borderTop: 0
    borderBottom: 0
    paddingLeft: 0
    paddingRight: 0
    paddingTop: 0
    paddingBottom: 0
  - name: pic_wenzimiaoshu_diwen2
    x: 1359
    y: 17
    width: 366
    height: 4
    borderLeft: 10
    borderRight: 10
    borderTop: 1
    borderBottom: 1
    paddingLeft: 0
    paddingRight: 0
    paddingTop: 0
    paddingBottom: 0
  - name: pic_wupin_di
    x: 671
    y: 186
    width: 105
    height: 52
    borderLeft: 0
    borderRight: 0
    borderTop: 0
    borderBottom: 0
    paddingLeft: 0
    paddingRight: 0
    paddingTop: 0
    paddingBottom: 0
  - name: pic_wupin_diban
    x: 100
    y: 390
    width: 20
    height: 20
    borderLeft: 0
    borderRight: 0
    borderTop: 0
    borderBottom: 0
    paddingLeft: 0
    paddingRight: 0
    paddingTop: 0
    paddingBottom: 0
  - name: pic_xiajiang
    x: 100
    y: 187
    width: 23
    height: 29
    borderLeft: 0
    borderRight: 0
    borderTop: 0
    borderBottom: 0
    paddingLeft: 0
    paddingRight: 0
    paddingTop: 1
    paddingBottom: 1
  - name: pic_xiangqing_shangsheng
    x: 1058
    y: 179
    width: 13
    height: 13
    borderLeft: 0
    borderRight: 0
    borderTop: 0
    borderBottom: 0
    paddingLeft: 0
    paddingRight: 1
    paddingTop: 1
    paddingBottom: 0
  - name: pic_xiaobiaoti_diban_1
    x: 1017
    y: 897
    width: 43
    height: 33
    borderLeft: 10
    borderRight: 30
    borderTop: 0
    borderBottom: 0
    paddingLeft: 0
    paddingRight: 0
    paddingTop: 0
    paddingBottom: 0
  - name: pic_xiaobiaoti_diban_2
    x: 368
    y: 88
    width: 28
    height: 4
    borderLeft: 0
    borderRight: 0
    borderTop: 0
    borderBottom: 0
    paddingLeft: 0
    paddingRight: 0
    paddingTop: 0
    paddingBottom: 0
  - name: pic_xiaojiantou
    x: 119
    y: 619
    width: 18
    height: 9
    borderLeft: 0
    borderRight: 0
    borderTop: 0
    borderBottom: 0
    paddingLeft: 2
    paddingRight: 2
    paddingTop: 2
    paddingBottom: 3
  - name: pic_xuanxiangtiaomu_diban
    x: 366
    y: 202
    width: 20
    height: 20
    borderLeft: 5
    borderRight: 7
    borderTop: 5
    borderBottom: 7
    paddingLeft: 0
    paddingRight: 0
    paddingTop: 0
    paddingBottom: 0
  - name: pic_xuanzhong_1
    x: 1001
    y: 285
    width: 114
    height: 55
    borderLeft: 0
    borderRight: 0
    borderTop: 0
    borderBottom: 0
    paddingLeft: 0
    paddingRight: 0
    paddingTop: 0
    paddingBottom: 0
  - name: pic_xuanzhong_2
    x: 867
    y: 270
    width: 114
    height: 55
    borderLeft: 0
    borderRight: 0
    borderTop: 0
    borderBottom: 0
    paddingLeft: 0
    paddingRight: 0
    paddingTop: 0
    paddingBottom: 0
  - name: pic_xuanzhong_dikuang
    x: 527
    y: 384
    width: 24
    height: 24
    borderLeft: 0
    borderRight: 0
    borderTop: 0
    borderBottom: 0
    paddingLeft: 0
    paddingRight: 0
    paddingTop: 0
    paddingBottom: 0
  - name: pic_xuanzhong_kuang
    x: 166
    y: 389
    width: 124
    height: 90
    borderLeft: 10
    borderRight: 20
    borderTop: 20
    borderBottom: 20
    paddingLeft: 0
    paddingRight: 0
    paddingTop: 0
    paddingBottom: 0
  - name: pic_xuanzhongkuang
    x: 1044
    y: 63
    width: 54
    height: 54
    borderLeft: 10
    borderRight: 10
    borderTop: 10
    borderBottom: 10
    paddingLeft: 0
    paddingRight: 0
    paddingTop: 0
    paddingBottom: 0
  - name: pic_yibangding
    x: 1104
    y: 22
    width: 65
    height: 42
    borderLeft: 0
    borderRight: 0
    borderTop: 0
    borderBottom: 0
    paddingLeft: 0
    paddingRight: 2
    paddingTop: 0
    paddingBottom: 3
  - name: pic_yuling_1
    x: 1017
    y: 458
    width: 79
    height: 92
    borderLeft: 0
    borderRight: 0
    borderTop: 0
    borderBottom: 0
    paddingLeft: 6
    paddingRight: 4
    paddingTop: 4
    paddingBottom: 3
  - name: pic_yuling_2
    x: 237
    y: 521
    width: 79
    height: 92
    borderLeft: 0
    borderRight: 0
    borderTop: 0
    borderBottom: 0
    paddingLeft: 6
    paddingRight: 4
    paddingTop: 4
    paddingBottom: 3
  - name: pic_yuling_3
    x: 658
    y: 375
    width: 79
    height: 92
    borderLeft: 0
    borderRight: 0
    borderTop: 0
    borderBottom: 0
    paddingLeft: 6
    paddingRight: 4
    paddingTop: 4
    paddingBottom: 3
  - name: pic_yuling_4
    x: 756
    y: 438
    width: 79
    height: 92
    borderLeft: 0
    borderRight: 0
    borderTop: 0
    borderBottom: 0
    paddingLeft: 6
    paddingRight: 4
    paddingTop: 4
    paddingBottom: 3
  - name: pic_yuling_5
    x: 937
    y: 458
    width: 79
    height: 92
    borderLeft: 0
    borderRight: 0
    borderTop: 0
    borderBottom: 0
    paddingLeft: 6
    paddingRight: 4
    paddingTop: 4
    paddingBottom: 3
  - name: pic_yulingg_1
    x: 1176
    y: 613
    width: 92
    height: 92
    borderLeft: 0
    borderRight: 0
    borderTop: 0
    borderBottom: 0
    paddingLeft: 0
    paddingRight: 0
    paddingTop: 0
    paddingBottom: 0
  - name: pic_yulingg_2
    x: 1351
    y: 714
    width: 92
    height: 92
    borderLeft: 0
    borderRight: 0
    borderTop: 0
    borderBottom: 0
    paddingLeft: 0
    paddingRight: 0
    paddingTop: 0
    paddingBottom: 0
  - name: pic_yulingg_3
    x: 1242
    y: 706
    width: 92
    height: 92
    borderLeft: 0
    borderRight: 0
    borderTop: 0
    borderBottom: 0
    paddingLeft: 0
    paddingRight: 0
    paddingTop: 0
    paddingBottom: 0
  - name: pic_yulingg_4
    x: 1083
    y: 687
    width: 92
    height: 92
    borderLeft: 0
    borderRight: 0
    borderTop: 0
    borderBottom: 0
    paddingLeft: 0
    paddingRight: 0
    paddingTop: 0
    paddingBottom: 0
  - name: pic_yulingg_5
    x: 1335
    y: 621
    width: 92
    height: 92
    borderLeft: 0
    borderRight: 0
    borderTop: 0
    borderBottom: 0
    paddingLeft: 0
    paddingRight: 0
    paddingTop: 0
    paddingBottom: 0
  - name: pic_zb_suo
    x: 489
    y: 914
    width: 44
    height: 50
    borderLeft: 0
    borderRight: 0
    borderTop: 0
    borderBottom: 0
    paddingLeft: 0
    paddingRight: 0
    paddingTop: 0
    paddingBottom: 0
  - name: pic_zhanli_diban
    x: 317
    y: 511
    width: 109
    height: 33
    borderLeft: 0
    borderRight: 0
    borderTop: 0
    borderBottom: 0
    paddingLeft: 0
    paddingRight: 1
    paddingTop: 0
    paddingBottom: 0
  - name: pic_zhuangbei_weixuanzhong
    x: 1406
    y: 344
    width: 38
    height: 38
    borderLeft: 0
    borderRight: 0
    borderTop: 0
    borderBottom: 0
    paddingLeft: 0
    paddingRight: 0
    paddingTop: 0
    paddingBottom: 0
  - name: pic_zhuangbei_xuanzhong
    x: 1203
    y: 260
    width: 50
    height: 50
    borderLeft: 0
    borderRight: 0
    borderTop: 0
    borderBottom: 0
    paddingLeft: 0
    paddingRight: 0
    paddingTop: 0
    paddingBottom: 0
  - name: pic_zuoxiajiao_liaotian_diban
    x: 1072
    y: 118
    width: 24
    height: 24
    borderLeft: 1
    borderRight: 21
    borderTop: 10
    borderBottom: 10
    paddingLeft: 0
    paddingRight: 0
    paddingTop: 0
    paddingBottom: 0
  - name: text_biaoqian_bangding_1
    x: 940
    y: 141
    width: 60
    height: 58
    borderLeft: 0
    borderRight: 0
    borderTop: 0
    borderBottom: 0
    paddingLeft: 0
    paddingRight: 0
    paddingTop: 0
    paddingBottom: 0
  - name: text_biaoqian_yichuan_3
    x: 897
    y: 80
    width: 60
    height: 58
    borderLeft: 0
    borderRight: 0
    borderTop: 0
    borderBottom: 0
    paddingLeft: 0
    paddingRight: 0
    paddingTop: 0
    paddingBottom: 0
  - name: text_huode_jiangli
    x: 628
    y: 321
    width: 157
    height: 42
    borderLeft: 0
    borderRight: 0
    borderTop: 0
    borderBottom: 0
    paddingLeft: 0
    paddingRight: 0
    paddingTop: 3
    paddingBottom: 3
  mPixelSize: 1
  mReplacement: {fileID: 0}
  mCoordinates: 0
  sprites: []
