%YAML 1.1
%TAG !u! tag:unity3d.com,2011:
--- !u!21 &2100000
Material:
  serializedVersion: 6
  m_ObjectHideFlags: 0
  m_PrefabParentObject: {fileID: 0}
  m_PrefabInternal: {fileID: 0}
  m_Name: model503_02
  m_Shader: {fileID: 4800000, guid: 24abda90ff6451c47afa6e974319639d, type: 3}
  m_ShaderKeywords: 
  m_LightmapFlags: 5
  m_CustomRenderQueue: 3001
  stringTagMap: {}
  m_SavedProperties:
    serializedVersion: 2
    m_TexEnvs:
    - first:
        name: _DISS_TEX
      second:
        m_Texture: {fileID: 2800000, guid: f32d8cbdfa3df5e48a885c48e037a62b, type: 3}
        m_Scale: {x: 1, y: 1}
        m_Offset: {x: 0, y: 0}
    - first:
        name: _Liuguang
      second:
        m_Texture: {fileID: 2800000, guid: 7acc33f24a06fcd46baa112415b42195, type: 3}
        m_Scale: {x: 1, y: 1}
        m_Offset: {x: 0, y: 0}
    - first:
        name: _MainTex
      second:
        m_Texture: {fileID: 2800000, guid: 6fa7c67ac8e15184cbeb84496e7af28a, type: 3}
        m_Scale: {x: 1, y: 1}
        m_Offset: {x: 0, y: 0}
    - first:
        name: _liuguang
      second:
        m_Texture: {fileID: 2800000, guid: 7acc33f24a06fcd46baa112415b42195, type: 3}
        m_Scale: {x: 1, y: 1}
        m_Offset: {x: 0, y: 0}
    - first:
        name: _node_9054
      second:
        m_Texture: {fileID: 0}
        m_Scale: {x: 1, y: 1}
        m_Offset: {x: 0, y: 0}
    m_Floats:
    - first:
        name: _Alpha
      second: 1.25
    - first:
        name: _Cutoff
      second: 0.5
    - first:
        name: _DISS
      second: 0.76
    - first:
        name: _Fresnel_Exp
      second: 1
    - first:
        name: _Fresnel_Power
      second: 5
    - first:
        name: _Fresnel_ZT
      second: 1
    - first:
        name: _Liuguang_power
      second: 2
    - first:
        name: _U_Speed
      second: 0.1
    - first:
        name: _UorV
      second: 0
    - first:
        name: _V_Speed
      second: 0
    - first:
        name: _ZT
      second: 1
    - first:
        name: _liuguang_sudu
      second: 2
    - first:
        name: _liuguang_sudu_copy
      second: 1
    - first:
        name: _node_1095
      second: 0
    - first:
        name: _xrayAlpha
      second: 0.4
    m_Colors:
    - first:
        name: _Color
      second: {r: 0.86764705, g: 0, b: 0.5923937, a: 1}
    - first:
        name: _ColorAlpha
      second: {r: 1, g: 1, b: 1, a: 0.409}
    - first:
        name: _Fresnel_Color
      second: {r: 1, g: 0, b: 0, a: 1}
    - first:
        name: _TintColor
      second: {r: 0.29411763, g: 0.29411763, b: 0.29411763, a: 1}
