%YAML 1.1
%TAG !u! tag:unity3d.com,2011:
--- !u!21 &2100000
Material:
  serializedVersion: 6
  m_ObjectHideFlags: 0
  m_PrefabParentObject: {fileID: 0}
  m_PrefabInternal: {fileID: 0}
  m_Name: daoguang_126_disble
  m_Shader: {fileID: 4800000, guid: 31838ff35b30a2844ac7a9fb65d7ada4, type: 3}
  m_ShaderKeywords: 
  m_LightmapFlags: 5
  m_CustomRenderQueue: 3002
  stringTagMap: {}
  m_SavedProperties:
    serializedVersion: 2
    m_TexEnvs:
    - first:
        name: _Liuguang01
      second:
        m_Texture: {fileID: 2800000, guid: dc366a37011f3e44e8441208e90529a1, type: 3}
        m_Scale: {x: 0.5, y: 0.5}
        m_Offset: {x: 0, y: 0}
    - first:
        name: _Liuguang02
      second:
        m_Texture: {fileID: 2800000, guid: 7acc33f24a06fcd46baa112415b42195, type: 3}
        m_Scale: {x: 0.5, y: 0.5}
        m_Offset: {x: 0, y: 0}
    - first:
        name: _MainTex
      second:
        m_Texture: {fileID: 2800000, guid: 29043f6833395d54a9cbbe0f1142f61b, type: 3}
        m_Scale: {x: 1, y: 1}
        m_Offset: {x: 0, y: 0}
    - first:
        name: _Noise01
      second:
        m_Texture: {fileID: 2800000, guid: 6475569e57de23843b4c52854998a6af, type: 3}
        m_Scale: {x: 1, y: 1}
        m_Offset: {x: 0, y: 0}
    - first:
        name: _Noise02
      second:
        m_Texture: {fileID: 2800000, guid: 6475569e57de23843b4c52854998a6af, type: 3}
        m_Scale: {x: 1, y: 1}
        m_Offset: {x: 0, y: 0}
    m_Floats:
    - first:
        name: _Alpha
      second: 1
    - first:
        name: _Cutoff
      second: 0.5
    - first:
        name: _Disturbance
      second: 0.5
    - first:
        name: _InvFade
      second: 1
    - first:
        name: _Liuguang_ZT
      second: 4
    - first:
        name: _Liuguang_power
      second: 1.3
    - first:
        name: _Posterize
      second: 4
    - first:
        name: _Posterize_Switch
      second: 0
    - first:
        name: _U_Speed
      second: -2
    - first:
        name: _U_Speed01
      second: 10
    - first:
        name: _U_Speed02
      second: 2
    - first:
        name: _U_Speed_copy
      second: 0
    - first:
        name: _V_Speed
      second: 0
    - first:
        name: _V_Speed01
      second: 1
    - first:
        name: _V_Speed02
      second: 5
    - first:
        name: _V_Speed_copy
      second: 0
    - first:
        name: _ZT
      second: 1
    m_Colors:
    - first:
        name: _TintColor
      second: {r: 1, g: 1, b: 1, a: 1}
