%YAML 1.1
%TAG !u! tag:unity3d.com,2011:
--- !u!21 &2100000
Material:
  serializedVersion: 6
  m_ObjectHideFlags: 0
  m_CorrespondingSourceObject: {fileID: 0}
  m_PrefabInstance: {fileID: 0}
  m_PrefabAsset: {fileID: 0}
  m_Name: FX_Ms_019gww_attack005
  m_Shader: {fileID: 200, guid: 0000000000000000f000000000000000, type: 0}
  m_ShaderKeywords: 
  m_LightmapFlags: 4
  m_EnableInstancingVariants: 1
  m_DoubleSidedGI: 0
  m_CustomRenderQueue: -1
  stringTagMap: {}
  disabledShaderPasses: []
  m_SavedProperties:
    serializedVersion: 3
    m_TexEnvs:
    - _DiffuseTexture:
        m_Texture: {fileID: 2800000, guid: a2b2afe941bc4b54bb490508c2213daf, type: 3}
        m_Scale: {x: 1, y: 1}
        m_Offset: {x: 0, y: 0}
    - _MainTex:
        m_Texture: {fileID: 2800000, guid: 075cf688bd2bf7146a39c823e4ca495a, type: 3}
        m_Scale: {x: 1, y: 1}
        m_Offset: {x: 0, y: 0}
    - _T_mask:
        m_Texture: {fileID: 2800000, guid: 236fccf4b4776784691f3bc73807c0c6, type: 3}
        m_Scale: {x: 0.6, y: 3}
        m_Offset: {x: 0, y: 0}
    m_Floats:
    - _BumpScale: 1
    - _ColorMask: 15
    - _Cutoff: 0.5
    - _DetailNormalMapScale: 1
    - _DstBlend: 0
    - _GlossMapScale: 1
    - _Glossiness: 0.5
    - _GlossyReflections: 1
    - _InvFade: 1
    - _MainTexBrightness: 2
    - _MainTexContrast: 2
    - _MainTexPannerX: 0
    - _MainTexPannerY: 0
    - _MaskTexDynmatic: 0
    - _MaskTexPannerX: 0
    - _MaskTexPannerY: 0
    - _Metallic: 0
    - _Mode: 0
    - _N_BY_KD: 0.02
    - _N_BY_QD: 1
    - _N_mask: 1.1
    - _NormalTexPannerX: 0
    - _NormalTexPannerY: 0
    - _OcclusionStrength: 1
    - _Parallax: 0.02
    - _SmoothnessTextureChannel: 0
    - _SpecularHighlights: 1
    - _SrcBlend: 1
    - _Stencil: 0
    - _StencilComp: 8
    - _StencilOp: 0
    - _StencilReadMask: 255
    - _StencilWriteMask: 255
    - _UVEffectPower: 0
    - _UVSec: 0
    - _ZWrite: 1
    m_Colors:
    - _C_BYcolor: {r: 0.7843137, g: 0.6431373, b: 1.498039, a: 1}
    - _Color: {r: 1, g: 1, b: 1, a: 1}
    - _ColorAlpha: {r: 2.118547, g: 2.118547, b: 2.118547, a: 1}
    - _EmissionColor: {r: 0, g: 0, b: 0, a: 1}
    - _MainColor: {r: 1, g: 1, b: 1, a: 1}
    - _TintColor: {r: 0.5, g: 0.5, b: 0.5, a: 0.5}
  m_BuildTextureStacks: []
