%YAML 1.1
%TAG !u! tag:unity3d.com,2011:
--- !u!1001 &100100000
Prefab:
  m_ObjectHideFlags: 1
  serializedVersion: 2
  m_Modification:
    m_TransformParent: {fileID: 0}
    m_Modifications: []
    m_RemovedComponents: []
  m_ParentPrefab: {fileID: 0}
  m_RootGameObject: {fileID: 1000013982051946}
  m_IsPrefabParent: 1
--- !u!1 &1000013982051946
GameObject:
  m_ObjectHideFlags: 0
  m_PrefabParentObject: {fileID: 0}
  m_PrefabInternal: {fileID: 100100000}
  serializedVersion: 4
  m_Component:
  - 4: {fileID: 4000010619866904}
  - 114: {fileID: 114000010509069976}
  m_Layer: 13
  m_Name: lightmap_6200_1
  m_TagString: Untagged
  m_Icon: {fileID: 0}
  m_NavMeshLayer: 0
  m_StaticEditorFlags: 0
  m_IsActive: 1
--- !u!4 &4000010619866904
Transform:
  m_ObjectHideFlags: 1
  m_PrefabParentObject: {fileID: 0}
  m_PrefabInternal: {fileID: 100100000}
  m_GameObject: {fileID: 1000013982051946}
  m_LocalRotation: {x: 0, y: 0, z: 0, w: 1}
  m_LocalPosition: {x: 0, y: 0, z: 0}
  m_LocalScale: {x: 1, y: 1, z: 1}
  m_LocalEulerAnglesHint: {x: 0, y: 0, z: 0}
  m_Children: []
  m_Father: {fileID: 0}
  m_RootOrder: 0
--- !u!114 &114000010509069976
MonoBehaviour:
  m_ObjectHideFlags: 1
  m_PrefabParentObject: {fileID: 0}
  m_PrefabInternal: {fileID: 100100000}
  m_GameObject: {fileID: 1000013982051946}
  m_Enabled: 1
  m_EditorHideFlags: 0
  m_Script: {fileID: 11500000, guid: 9b9d0662ce7f2614bb636d809f78c5dd, type: 3}
  m_Name: 
  m_EditorClassIdentifier: 
  renderData:
    lightmapMode: 0
    ambientMode: 0
    ambientLight: {r: 0.212, g: 0.227, b: 0.259, a: 1}
    ambientIntensity: 1
    ambientEquatorColor: {r: 0.114, g: 0.125, b: 0.133, a: 1}
    ambientGroundColor: {r: 0.047, g: 0.043, b: 0.035, a: 1}
    ambientSkyColor: {r: 0.212, g: 0.227, b: 0.259, a: 1}
    defaultReflectionResolution: 128
    fog: 0
    fogColor: {r: 0.5, g: 0.5, b: 0.5, a: 1}
    fogDensity: 0.01
    fogEndDistance: 300
    fogMode: 3
    fogStartDistance: 0
    haloStrength: 0.5
  nearTextureList: []
  farTextureList: []
  modelLightList:
  - index: -1
    scaleOffset: {x: 1, y: 1, z: 0, w: 0}
  - index: -1
    scaleOffset: {x: 1, y: 1, z: 0, w: 0}
  - index: -1
    scaleOffset: {x: 1, y: 1, z: 0, w: 0}
  - index: -1
    scaleOffset: {x: 1, y: 1, z: 0, w: 0}
  - index: -1
    scaleOffset: {x: 1, y: 1, z: 0, w: 0}
  - index: -1
    scaleOffset: {x: 1, y: 1, z: 0, w: 0}
  - index: -1
    scaleOffset: {x: 1, y: 1, z: 0, w: 0}
  - index: -1
    scaleOffset: {x: 1, y: 1, z: 0, w: 0}
  - index: -1
    scaleOffset: {x: 1, y: 1, z: 0, w: 0}
  - index: -1
    scaleOffset: {x: 1, y: 1, z: 0, w: 0}
  - index: -1
    scaleOffset: {x: 1, y: 1, z: 0, w: 0}
