%YAML 1.1
%TAG !u! tag:unity3d.com,2011:
--- !u!21 &2100000
Material:
  serializedVersion: 6
  m_ObjectHideFlags: 0
  m_PrefabParentObject: {fileID: 0}
  m_PrefabInternal: {fileID: 0}
  m_Name: ui_eff_story_06
  m_Shader: {fileID: 4800000, guid: 31838ff35b30a2844ac7a9fb65d7ada4, type: 3}
  m_ShaderKeywords: 
  m_LightmapFlags: 5
  m_CustomRenderQueue: -1
  stringTagMap: {}
  m_SavedProperties:
    serializedVersion: 2
    m_TexEnvs:
    - first:
        name: _MainTex
      second:
        m_Texture: {fileID: 2800000, guid: ed9721d818a7af44d827a0d07a79cddf, type: 3}
        m_Scale: {x: 1, y: 1}
        m_Offset: {x: 0, y: 0}
    - first:
        name: _Noise01
      second:
        m_Texture: {fileID: 2800000, guid: 91d436b0b02556e409adff0387c82528, type: 3}
        m_Scale: {x: 1, y: 1}
        m_Offset: {x: 0, y: 0}
    - first:
        name: _Noise02
      second:
        m_Texture: {fileID: 2800000, guid: 3b9e8ab00432c12499cf6c4f678f3fce, type: 3}
        m_Scale: {x: 1, y: 1}
        m_Offset: {x: 0, y: 0}
    m_Floats:
    - first:
        name: _Alpha
      second: 1.14
    - first:
        name: _Cutoff
      second: 0.5
    - first:
        name: _Disturbance
      second: 0.022
    - first:
        name: _InvFade
      second: 1
    - first:
        name: _U_Speed
      second: -0.37
    - first:
        name: _U_Speed_copy
      second: 3
    - first:
        name: _V_Speed
      second: 0.35
    - first:
        name: _V_Speed_copy
      second: 2
    - first:
        name: _ZT
      second: 4.32
    m_Colors:
    - first:
        name: _TintColor
      second: {r: 1, g: 0.32312372, b: 0.30882353, a: 1}
