%YAML 1.1
%TAG !u! tag:unity3d.com,2011:
--- !u!90 &9000000
Avatar:
  m_ObjectHideFlags: 0
  m_CorrespondingSourceObject: {fileID: 0}
  m_PrefabInstance: {fileID: 0}
  m_PrefabAsset: {fileID: 0}
  m_Name: ms_034glj_0_0
  m_AvatarSize: 4532
  m_Avatar:
    serializedVersion: 3
    m_AvatarSkeleton:
      data:
        m_Node:
        - m_ParentId: -1
          m_AxesId: -1
        - m_ParentId: 0
          m_AxesId: -1
        - m_ParentId: 0
          m_AxesId: -1
        - m_ParentId: 2
          m_AxesId: -1
        - m_ParentId: 3
          m_AxesId: -1
        - m_ParentId: 4
          m_AxesId: -1
        - m_ParentId: 5
          m_AxesId: -1
        - m_ParentId: 6
          m_AxesId: -1
        - m_ParentId: 7
          m_AxesId: -1
        - m_ParentId: 7
          m_AxesId: -1
        - m_ParentId: 6
          m_AxesId: -1
        - m_ParentId: 4
          m_AxesId: -1
        - m_ParentId: 11
          m_AxesId: -1
        - m_ParentId: 12
          m_AxesId: -1
        - m_ParentId: 13
          m_AxesId: -1
        - m_ParentId: 13
          m_AxesId: -1
        - m_ParentId: 12
          m_AxesId: -1
        - m_ParentId: 4
          m_AxesId: -1
        - m_ParentId: 17
          m_AxesId: -1
        - m_ParentId: 18
          m_AxesId: -1
        - m_ParentId: 19
          m_AxesId: -1
        - m_ParentId: 20
          m_AxesId: -1
        - m_ParentId: 20
          m_AxesId: -1
        - m_ParentId: 19
          m_AxesId: -1
        - m_ParentId: 17
          m_AxesId: -1
        - m_ParentId: 24
          m_AxesId: -1
        - m_ParentId: 25
          m_AxesId: -1
        - m_ParentId: 26
          m_AxesId: -1
        - m_ParentId: 26
          m_AxesId: -1
        - m_ParentId: 25
          m_AxesId: -1
        - m_ParentId: 17
          m_AxesId: -1
        - m_ParentId: 30
          m_AxesId: -1
        - m_ParentId: 4
          m_AxesId: -1
        - m_ParentId: 4
          m_AxesId: -1
        - m_ParentId: 4
          m_AxesId: -1
        - m_ParentId: 0
          m_AxesId: -1
        - m_ParentId: 0
          m_AxesId: -1
        m_ID: 0000000016203b413d6cbca629d2f1fd4a8709845eb60bb092bd52cdd50b14b3e3cfce8af1fd4a62d6cb53eacd51ea8725c0a56c41179e3a500d01af77298e7a6e47a2eef1600983c017d2db2ed6071fecf31317ffa0158d84713b202f1c0d5a9ba6b5e203502c35d445020968a0207527dae2cc1c17acdb3966f86b5a2b942ce747c097d2e2a37ecb26ce795e8653a0b39c853a
        m_AxesArray: []
    m_AvatarSkeletonPose:
      data:
        m_X:
        - t: {x: 0, y: 0, z: 0}
          q: {x: 0, y: 0, z: 0, w: 1}
          s: {x: 1, y: 1, z: 1}
        - t: {x: 0, y: 0, z: 0}
          q: {x: -0.7071068, y: 0, z: 0, w: 0.7071068}
          s: {x: 1, y: 1, z: 1}
        - t: {x: 0, y: 1.161319, z: 7.441116e-10}
          q: {x: -0.5000004, y: 0.4999997, z: 0.4999997, w: 0.5000004}
          s: {x: 0.9999999, y: 0.9999999, z: 1}
        - t: {x: 0, y: 0, z: 0}
          q: {x: -0.5, y: 0.5, z: 0.4999993, w: 0.5000007}
          s: {x: 1, y: 0.9999999, z: 0.9999999}
        - t: {x: -0.2306222, y: -0.0003770552, z: 0.0000003203496}
          q: {x: -0.000002080476, y: 0.000000693676, z: -0.000398159, w: 0.9999999}
          s: {x: 1, y: 0.9999999, z: 0.9999999}
        - t: {x: 0.2306218, y: 0.0005596897, z: 0.3839023}
          q: {x: -0.023483, y: 0.9730104, z: 0.05736437, w: 0.2222804}
          s: {x: 1, y: 1, z: 1}
        - t: {x: -0.1631705, y: 0, z: -0.00000005960464}
          q: {x: 0.000000002789263, y: 1.620673e-10, z: 0.05800613, w: 0.9983162}
          s: {x: 0.9999999, y: 0.9999999, z: 1}
        - t: {x: -0.7805267, y: 0.000000007450581, z: 0}
          q: {x: -0.06034248, y: 0.2211066, z: -0.003917097, w: 0.9733732}
          s: {x: 0.9999999, y: 0.9999999, z: 0.9999999}
        - t: {x: 0, y: 0.00000001490116, z: 0}
          q: {x: 0.00000007450573, y: 1.421085e-14, z: -1.05879e-21, w: 1}
          s: {x: 1, y: 1, z: 1}
        - t: {x: -0.1202856, y: 0.08040558, z: -0.0366981}
          q: {x: -0.002414323, y: -0.002402628, z: -0.7053526, w: 0.7088485}
          s: {x: 1, y: 1, z: 1}
        - t: {x: 0.006617159, y: -0.00219477, z: -0.01352632}
          q: {x: -0.6617072, y: 0.03577196, z: -0.03178437, w: 0.7482337}
          s: {x: 0.9999999, y: 0.9999999, z: 0.9999998}
        - t: {x: 0.2306218, y: 0.0005618192, z: -0.3839023}
          q: {x: -0.02349629, y: 0.9730103, z: -0.05735879, w: -0.2222812}
          s: {x: 1, y: 0.9999999, z: 1}
        - t: {x: -0.1631703, y: 0, z: -0.00000005960464}
          q: {x: -9.948696e-10, y: -0.00000001498413, z: 0.05802481, w: 0.9983152}
          s: {x: 1, y: 1, z: 1}
        - t: {x: -0.7805266, y: 0.000000007450581, z: 0}
          q: {x: 0.06034165, y: -0.2211067, z: -0.003922638, w: 0.9733732}
          s: {x: 0.9999999, y: 0.9999999, z: 0.9999999}
        - t: {x: -0.00000005960464, y: 0.00000002980232, z: 0.0000002384186}
          q: {x: 0.000000283122, y: 0.00000004371137, z: -0.00000007549792, w: 1}
          s: {x: 1, y: 1, z: 1}
        - t: {x: -0.1202866, y: 0.0804355, z: 0.03682023}
          q: {x: 0.7088485, y: -0.7053525, z: -0.002403493, w: -0.002415495}
          s: {x: 1, y: 0.9999999, z: 1}
        - t: {x: 0.006579161, y: -0.002182457, z: 0.01360714}
          q: {x: -0.7482329, y: 0.0317839, z: -0.03577139, w: 0.6617082}
          s: {x: 1, y: 0.9999999, z: 0.9999998}
        - t: {x: -0.4736006, y: -0.00007543189, z: -2.092184e-10}
          q: {x: -3.011767e-14, y: 0, z: 0, w: 1}
          s: {x: 1, y: 1, z: 1}
        - t: {x: 0.0852319, y: 0.0001416691, z: 0.5734859}
          q: {x: -0.3998509, y: -0.0001605007, z: 0.9165801, w: -0.000364411}
          s: {x: 1, y: 1, z: 1}
        - t: {x: -0.2800692, y: 8.881784e-14, z: 0.0000002384186}
          q: {x: 0.004931828, y: -0.008393726, z: 0.001871067, w: 0.9999509}
          s: {x: 1, y: 1, z: 1}
        - t: {x: -0.8118966, y: 9.313226e-10, z: 0}
          q: {x: 0, y: 0, z: 0.01336607, w: 0.9999107}
          s: {x: 1, y: 1, z: 0.9999999}
        - t: {x: -1.038094, y: 0.000000005587935, z: -0.0000003576279}
          q: {x: -0.7068253, y: -0.00000005303367, z: -0.00000005233318, w: 0.7073882}
          s: {x: 0.9999999, y: 0.9999998, z: 0.9999999}
        - t: {x: 0.04776496, y: 0.001555758, z: 0.003773689}
          q: {x: 0.703459, y: -0.01409318, z: -0.007361552, w: 0.710558}
          s: {x: 1, y: 0.9999998, z: 1}
        - t: {x: 0.07016551, y: -0.0001098632, z: 0.01495218}
          q: {x: 0.7035745, y: -0.00600024, z: 0.003460324, w: 0.7105877}
          s: {x: 1, y: 0.9999996, z: 1}
        - t: {x: 0.0852319, y: 0.0001448503, z: -0.5734859}
          q: {x: 0.3998509, y: 0.0001579348, z: 0.9165801, w: -0.0003654657}
          s: {x: 1, y: 1, z: 1}
        - t: {x: -0.2800692, y: -1.421085e-14, z: -0.0000002384186}
          q: {x: -0.004931828, y: 0.008393726, z: 0.001871067, w: 0.9999509}
          s: {x: 1, y: 1, z: 1}
        - t: {x: -0.8118967, y: 9.313226e-10, z: -0.0000002384186}
          q: {x: -0.000000001795199, y: 0.00000002978099, z: 0.01336607, w: 0.9999107}
          s: {x: 1, y: 1, z: 1}
        - t: {x: -1.038095, y: 0.00000001303852, z: 0.0000003576279}
          q: {x: 0.7068252, y: -0.00000009322247, z: 0.00000009643966, w: 0.7073883}
          s: {x: 0.9999999, y: 1, z: 1}
        - t: {x: 0.0474081, y: 0.001573779, z: -0.004116058}
          q: {x: 0.7105587, y: -0.007362557, z: -0.01409376, w: 0.7034583}
          s: {x: 1, y: 1, z: 1}
        - t: {x: 0.06980842, y: -0.0001031358, z: -0.01529491}
          q: {x: 0.7105884, y: 0.003459586, z: -0.006001131, w: 0.7035739}
          s: {x: 1, y: 1, z: 1}
        - t: {x: -0.03085828, y: 0.00005086022, z: 1.410663e-10}
          q: {x: -7.265599e-14, y: -0.000000001104273, z: 0.0003988306, w: 0.9999999}
          s: {x: 1, y: 1, z: 1}
        - t: {x: -2.445872, y: 0.000003201385, z: 0.0000004768371}
          q: {x: -0.5000001, y: 0.4999999, z: 0.4999994, w: 0.5000006}
          s: {x: 1, y: 1, z: 1}
        - t: {x: -0.1676215, y: -0.4992991, z: 0.160504}
          q: {x: -0.602523, y: 0.1903601, z: 0.370483, w: 0.6807874}
          s: {x: 1, y: 0.9999999, z: 1}
        - t: {x: -0.1676211, y: -0.4992986, z: -0.161001}
          q: {x: -0.6807863, y: -0.370483, z: -0.1903608, w: 0.602524}
          s: {x: 1, y: 1, z: 1}
        - t: {x: 0.2026469, y: 0.5409747, z: -0.003466606}
          q: {x: -0.691616, y: 0.1471963, z: 0.1477471, w: 0.6914994}
          s: {x: 0.9999998, y: 1, z: 1}
        - t: {x: 0, y: 0, z: 0.000000004415143}
          q: {x: 0.00000008146034, y: 0, z: 0, w: 1}
          s: {x: 1, y: 1, z: 1}
        - t: {x: 0, y: 1.382515, z: 0.789095}
          q: {x: 0.00000008146034, y: 0, z: 0, w: 1}
          s: {x: 1, y: 1, z: 1}
    m_DefaultPose:
      data:
        m_X:
        - t: {x: 0, y: 0, z: 0}
          q: {x: 0, y: 0, z: 0, w: 1}
          s: {x: 1, y: 1, z: 1}
        - t: {x: 0, y: 0, z: 0}
          q: {x: -0.7071068, y: 0, z: 0, w: 0.7071068}
          s: {x: 1, y: 1, z: 1}
        - t: {x: 0, y: 1.161319, z: 7.441116e-10}
          q: {x: -0.5000004, y: 0.4999997, z: 0.4999997, w: 0.5000004}
          s: {x: 0.9999999, y: 0.9999999, z: 1}
        - t: {x: 0, y: 0, z: 0}
          q: {x: -0.5, y: 0.5, z: 0.4999993, w: 0.5000007}
          s: {x: 1, y: 0.9999999, z: 0.9999999}
        - t: {x: -0.2306222, y: -0.0003770552, z: 0.0000003203496}
          q: {x: -0.000002080476, y: 0.000000693676, z: -0.000398159, w: 0.9999999}
          s: {x: 1, y: 0.9999999, z: 0.9999999}
        - t: {x: 0.2306218, y: 0.0005596897, z: 0.3839023}
          q: {x: -0.023483, y: 0.9730104, z: 0.05736437, w: 0.2222804}
          s: {x: 1, y: 1, z: 1}
        - t: {x: -0.1631705, y: 0, z: -0.00000005960464}
          q: {x: 0.000000002789263, y: 1.620673e-10, z: 0.05800613, w: 0.9983162}
          s: {x: 0.9999999, y: 0.9999999, z: 1}
        - t: {x: -0.7805267, y: 0.000000007450581, z: 0}
          q: {x: -0.06034248, y: 0.2211066, z: -0.003917097, w: 0.9733732}
          s: {x: 0.9999999, y: 0.9999999, z: 0.9999999}
        - t: {x: 0, y: 0.00000001490116, z: 0}
          q: {x: 0.00000007450573, y: 1.421085e-14, z: -1.05879e-21, w: 1}
          s: {x: 1, y: 1, z: 1}
        - t: {x: -0.1202856, y: 0.08040558, z: -0.0366981}
          q: {x: -0.002414323, y: -0.002402628, z: -0.7053526, w: 0.7088485}
          s: {x: 1, y: 1, z: 1}
        - t: {x: 0.006617159, y: -0.00219477, z: -0.01352632}
          q: {x: -0.6617072, y: 0.03577196, z: -0.03178437, w: 0.7482337}
          s: {x: 0.9999999, y: 0.9999999, z: 0.9999998}
        - t: {x: 0.2306218, y: 0.0005618192, z: -0.3839023}
          q: {x: -0.02349629, y: 0.9730103, z: -0.05735879, w: -0.2222812}
          s: {x: 1, y: 0.9999999, z: 1}
        - t: {x: -0.1631703, y: 0, z: -0.00000005960464}
          q: {x: -9.948696e-10, y: -0.00000001498413, z: 0.05802481, w: 0.9983152}
          s: {x: 1, y: 1, z: 1}
        - t: {x: -0.7805266, y: 0.000000007450581, z: 0}
          q: {x: 0.06034165, y: -0.2211067, z: -0.003922638, w: 0.9733732}
          s: {x: 0.9999999, y: 0.9999999, z: 0.9999999}
        - t: {x: -0.00000005960464, y: 0.00000002980232, z: 0.0000002384186}
          q: {x: 0.000000283122, y: 0.00000004371137, z: -0.00000007549792, w: 1}
          s: {x: 1, y: 1, z: 1}
        - t: {x: -0.1202866, y: 0.0804355, z: 0.03682023}
          q: {x: 0.7088485, y: -0.7053525, z: -0.002403493, w: -0.002415495}
          s: {x: 1, y: 0.9999999, z: 1}
        - t: {x: 0.006579161, y: -0.002182457, z: 0.01360714}
          q: {x: -0.7482329, y: 0.0317839, z: -0.03577139, w: 0.6617082}
          s: {x: 1, y: 0.9999999, z: 0.9999998}
        - t: {x: -0.4736006, y: -0.00007543189, z: -2.092184e-10}
          q: {x: -3.011767e-14, y: 0, z: 0, w: 1}
          s: {x: 1, y: 1, z: 1}
        - t: {x: 0.0852319, y: 0.0001416691, z: 0.5734859}
          q: {x: -0.3998509, y: -0.0001605007, z: 0.9165801, w: -0.000364411}
          s: {x: 1, y: 1, z: 1}
        - t: {x: -0.2800692, y: 8.881784e-14, z: 0.0000002384186}
          q: {x: 0.004931828, y: -0.008393726, z: 0.001871067, w: 0.9999509}
          s: {x: 1, y: 1, z: 1}
        - t: {x: -0.8118966, y: 9.313226e-10, z: 0}
          q: {x: 0, y: 0, z: 0.01336607, w: 0.9999107}
          s: {x: 1, y: 1, z: 0.9999999}
        - t: {x: -1.038094, y: 0.000000005587935, z: -0.0000003576279}
          q: {x: -0.7068253, y: -0.00000005303367, z: -0.00000005233318, w: 0.7073882}
          s: {x: 0.9999999, y: 0.9999998, z: 0.9999999}
        - t: {x: 0.04776496, y: 0.001555758, z: 0.003773689}
          q: {x: 0.703459, y: -0.01409318, z: -0.007361552, w: 0.710558}
          s: {x: 1, y: 0.9999998, z: 1}
        - t: {x: 0.07016551, y: -0.0001098632, z: 0.01495218}
          q: {x: 0.7035745, y: -0.00600024, z: 0.003460324, w: 0.7105877}
          s: {x: 1, y: 0.9999996, z: 1}
        - t: {x: 0.0852319, y: 0.0001448503, z: -0.5734859}
          q: {x: 0.3998509, y: 0.0001579348, z: 0.9165801, w: -0.0003654657}
          s: {x: 1, y: 1, z: 1}
        - t: {x: -0.2800692, y: -1.421085e-14, z: -0.0000002384186}
          q: {x: -0.004931828, y: 0.008393726, z: 0.001871067, w: 0.9999509}
          s: {x: 1, y: 1, z: 1}
        - t: {x: -0.8118967, y: 9.313226e-10, z: -0.0000002384186}
          q: {x: -0.000000001795199, y: 0.00000002978099, z: 0.01336607, w: 0.9999107}
          s: {x: 1, y: 1, z: 1}
        - t: {x: -1.038095, y: 0.00000001303852, z: 0.0000003576279}
          q: {x: 0.7068252, y: -0.00000009322247, z: 0.00000009643966, w: 0.7073883}
          s: {x: 0.9999999, y: 1, z: 1}
        - t: {x: 0.0474081, y: 0.001573779, z: -0.004116058}
          q: {x: 0.7105587, y: -0.007362557, z: -0.01409376, w: 0.7034583}
          s: {x: 1, y: 1, z: 1}
        - t: {x: 0.06980842, y: -0.0001031358, z: -0.01529491}
          q: {x: 0.7105884, y: 0.003459586, z: -0.006001131, w: 0.7035739}
          s: {x: 1, y: 1, z: 1}
        - t: {x: -0.03085828, y: 0.00005086022, z: 1.410663e-10}
          q: {x: -7.265599e-14, y: -0.000000001104273, z: 0.0003988306, w: 0.9999999}
          s: {x: 1, y: 1, z: 1}
        - t: {x: -2.445872, y: 0.000003201385, z: 0.0000004768371}
          q: {x: -0.5000001, y: 0.4999999, z: 0.4999994, w: 0.5000006}
          s: {x: 1, y: 1, z: 1}
        - t: {x: -0.1676215, y: -0.4992991, z: 0.160504}
          q: {x: -0.602523, y: 0.1903601, z: 0.370483, w: 0.6807874}
          s: {x: 1, y: 0.9999999, z: 1}
        - t: {x: -0.1676211, y: -0.4992986, z: -0.161001}
          q: {x: -0.6807863, y: -0.370483, z: -0.1903608, w: 0.602524}
          s: {x: 1, y: 1, z: 1}
        - t: {x: 0.2026469, y: 0.5409747, z: -0.003466606}
          q: {x: -0.691616, y: 0.1471963, z: 0.1477471, w: 0.6914994}
          s: {x: 0.9999998, y: 1, z: 1}
        - t: {x: 0, y: 0, z: 0.000000004415143}
          q: {x: 0.00000008146034, y: 0, z: 0, w: 1}
          s: {x: 1, y: 1, z: 1}
        - t: {x: 0, y: 1.382515, z: 0.789095}
          q: {x: 0.00000008146034, y: 0, z: 0, w: 1}
          s: {x: 1, y: 1, z: 1}
    m_SkeletonNameIDArray: 0000000016203b413d6cbca6661287588ccc354d432c30c58c1d124d3fe2c6a870889858d793883941a38f4ed0cbd1f2677ece74d4811a912c36149bbdee25292bde225eff56dcba52322aa7d5350134b349f3d96cf375b6a42a482e321a4f5909834d9e8e84660d50d0f1bd5e946ff0884b46c01e7b41b730763e3da259c107c97a5dd9fcdf3e30e51b53375e8653a0b39c853a
    m_Human:
      data:
        serializedVersion: 2
        m_RootX:
          t: {x: 0, y: 0, z: 0}
          q: {x: 0, y: 0, z: 0, w: 1}
          s: {x: 1, y: 1, z: 1}
        m_Skeleton:
          data:
            m_Node: []
            m_ID: 
            m_AxesArray: []
        m_SkeletonPose:
          data:
            m_X: []
        m_LeftHand:
          data:
            m_HandBoneIndex: ffffffffffffffffffffffffffffffffffffffffffffffffffffffffffffffffffffffffffffffffffffffffffffffffffffffffffffffffffffffff
        m_RightHand:
          data:
            m_HandBoneIndex: ffffffffffffffffffffffffffffffffffffffffffffffffffffffffffffffffffffffffffffffffffffffffffffffffffffffffffffffffffffffff
        m_HumanBoneIndex: ffffffffffffffffffffffffffffffffffffffffffffffffffffffffffffffffffffffffffffffffffffffffffffffffffffffffffffffffffffffffffffffffffffffffffffffffffffffffffffffffffffffffffffffffffffffffffffffffffffffff
        m_HumanBoneMass:
        - 0.1454546
        - 0.1212121
        - 0.1212121
        - 0.04848485
        - 0.04848485
        - 0.009696971
        - 0.009696971
        - 0.03030303
        - 0.1454546
        - 0.1454546
        - 0.01212121
        - 0.04848485
        - 0.006060607
        - 0.006060607
        - 0.02424243
        - 0.02424243
        - 0.01818182
        - 0.01818182
        - 0.006060607
        - 0.006060607
        - 0.002424243
        - 0.002424243
        - 0
        - 0
        - 0
        m_Scale: 1
        m_ArmTwist: 0.5
        m_ForeArmTwist: 0.5
        m_UpperLegTwist: 0.5
        m_LegTwist: 0.5
        m_ArmStretch: 0.05
        m_LegStretch: 0.05
        m_FeetSpacing: 0
        m_HasLeftHand: 0
        m_HasRightHand: 0
        m_HasTDoF: 0
    m_HumanSkeletonIndexArray: 
    m_HumanSkeletonReverseIndexArray: 
    m_RootMotionBoneIndex: -1
    m_RootMotionBoneX:
      t: {x: 0, y: 0, z: 0}
      q: {x: 0, y: 0, z: 0, w: 1}
      s: {x: 1, y: 1, z: 1}
    m_RootMotionSkeleton:
      data:
        m_Node: []
        m_ID: 
        m_AxesArray: []
    m_RootMotionSkeletonPose:
      data:
        m_X: []
    m_RootMotionSkeletonIndexArray: 
  m_TOS:
    151143892: Bip001/Bip001 Pelvis/Bip001 Spine/Bip001 Neck/Bip001 R Clavicle/Bip001
      R UpperArm/Bip001 R Forearm
    1094393878: Ms_034glj_0
    3685488412: Bip001/Bip001 Pelvis/Bip001 Spine/Bip001 Neck/Bip001 R Clavicle/Bip001
      R UpperArm/Bone012
    3687978944: Bip001/Bip001 Pelvis/Bip001 Spine/Bip001 Neck/Bip001 L Clavicle
    1965072488: Bip001/Bip001 Pelvis/Bip001 Spine/Bip001 Neck/Bip001 R Clavicle/Bip001
      R UpperArm/Bip001 R Forearm/RightHand001
    520607278: Bip001/Bip001 Pelvis/Bip001 Spine/Bip001 Neck/Bip001 L Clavicle/Bip001
      L UpperArm
    2367004927: Bip001/Bip001 Pelvis/Bip001 Spine/Bip001 Neck/Bip001 L Clavicle/Bip001
      L UpperArm/Bip001 L Forearm/LeftHand
    3437419047: Bip001/Bip001 Pelvis/Bip001 Spine/Bip001 Neck/Bip001 R Clavicle/Bip001
      R UpperArm/Bip001 R Forearm/Bone013
    1649081841: Bip001/Bip001 Pelvis/Bip001 Spine/Bip001 L Thigh/Bip001 L Calf/Bip001
      L Foot/Bone009
    1811441209: Bip001/Bip001 Pelvis/Bip001 Spine/Bip001 Neck/Bip001 Head
    892096515: Bip001/Bip001 Pelvis/Bip001 Spine/Bip001 Neck/Bip001 R Clavicle/Bip001
      R UpperArm
    1822801957: Bip001/Bip001 Pelvis/Bip001 Spine/Bip001 R Thigh/Bip001 R Calf
    2545960935: Bip001/Bip001 Pelvis/Bip001 Spine/Bone003
    4003612526: Bip001/Bip001 Pelvis/Bip001 Spine/Bip001 R Thigh/Bip001 R Calf/Bone014
    2953557598: Bip001/Bip001 Pelvis/Bip001 Spine/Bip001 L Thigh
    2280280525: Bip001/Bip001 Pelvis/Bip001 Spine/Bip001 R Thigh
    2797366333: Bip001
    983439169: Bip001/Bip001 Pelvis/Bip001 Spine/Bip001 R Thigh/Bip001 R Calf/Bip001
      R Foot
    2936081744: Bip001/Bip001 Pelvis/Bip001 Spine/Bip001 R Thigh/Bip001 R Calf/Bip001
      R Foot/RightFoot
    3931360214: Bip001/Bip001 Pelvis/Bip001 Spine/Bip001 L Thigh/Bip001 L Calf/Bone008
    0: 
    2043553483: Bip001/Bip001 Pelvis/Bip001 Spine/Bone001
    981834931: Chest
    1510808623: Bip001/Bip001 Pelvis/Bip001 Spine/Bip001 Neck/Bip001 L Clavicle/Bip001
      L UpperArm/Bone010
    2124669650: Bip001/Bip001 Pelvis/Bip001 Spine/Bone005
    2328809443: Bip001/Bip001 Pelvis/Bip001 Spine/Bip001 L Thigh/Bip001 L Calf/Bip001
      L Foot/LeftFoot
    3004435413: Bip001/Bip001 Pelvis/Bip001 Spine/Bip001 L Thigh/Bip001 L Calf/Bip001
      L Foot
    2056137079: Bip001/Bip001 Pelvis/Bip001 Spine/Bip001 R Thigh/Bip001 R Calf/Bip001
      R Foot/Bone015
    3803555483: Bip001/Bip001 Pelvis/Bip001 Spine/Bip001 Neck/Bip001 R Clavicle
    387183596: Bip001/Bip001 Pelvis/Bip001 Spine/Bip001 Neck/Bip001 L Clavicle/Bip001
      L UpperArm/Bip001 L Forearm
    540766596: Bip001/Bip001 Pelvis/Bip001 Spine/Bip001 Neck/Bip001 L Clavicle/Bip001
      L UpperArm/Bip001 L Forearm/Bone011
    2198429937: Bip001/Bip001 Pelvis/Bip001 Spine/Bip001 Neck
    2689828446: Ground
    3444751762: Bip001/Bip001 Pelvis/Bip001 Spine/Bip001 L Thigh/Bip001 L Calf
    747907930: Bip001/Bip001 Pelvis/Bip001 Spine/Bip001 Neck/Bip001 Head/Head
    4260483625: Bip001/Bip001 Pelvis
    2215216970: Bip001/Bip001 Pelvis/Bip001 Spine
  m_HumanDescription:
    serializedVersion: 3
    m_Human: []
    m_Skeleton: []
    m_ArmTwist: 0.5
    m_ForeArmTwist: 0.5
    m_UpperLegTwist: 0.5
    m_LegTwist: 0.5
    m_ArmStretch: 0.05
    m_LegStretch: 0.05
    m_FeetSpacing: 0
    m_GlobalScale: 1
    m_RootMotionBoneName: 
    m_HasTranslationDoF: 0
    m_HasExtraRoot: 0
    m_SkeletonHasParents: 1
