%YAML 1.1
%TAG !u! tag:unity3d.com,2011:
--- !u!21 &2100000
Material:
  serializedVersion: 6
  m_ObjectHideFlags: 0
  m_PrefabParentObject: {fileID: 0}
  m_PrefabInternal: {fileID: 0}
  m_Name: ui_eff_6200_fazhen_03
  m_Shader: {fileID: 4800000, guid: 1f7e247671bff644992230748634170a, type: 3}
  m_ShaderKeywords: 
  m_LightmapFlags: 5
  m_CustomRenderQueue: -1
  stringTagMap: {}
  m_SavedProperties:
    serializedVersion: 2
    m_TexEnvs:
    - first:
        name: _Dssoled
      second:
        m_Texture: {fileID: 2800000, guid: 7acc33f24a06fcd46baa112415b42195, type: 3}
        m_Scale: {x: 2, y: 2}
        m_Offset: {x: 0, y: 0}
    - first:
        name: _Liuguang01
      second:
        m_Texture: {fileID: 2800000, guid: b9a7f5fb90567434992ff4737f365378, type: 3}
        m_Scale: {x: 1, y: 1}
        m_Offset: {x: 0, y: 0}
    - first:
        name: _Liuguang02
      second:
        m_Texture: {fileID: 2800000, guid: 7acc33f24a06fcd46baa112415b42195, type: 3}
        m_Scale: {x: 1, y: 1}
        m_Offset: {x: 0, y: 0}
    - first:
        name: _MainTex
      second:
        m_Texture: {fileID: 2800000, guid: ef9fa18cbc0047e40a589fc628eafbc5, type: 3}
        m_Scale: {x: 1, y: 1}
        m_Offset: {x: 0, y: 0}
    - first:
        name: _TEX
      second:
        m_Texture: {fileID: 2800000, guid: 82c86ed6b09313143b4c03bfd90419bc, type: 3}
        m_Scale: {x: 1, y: 1}
        m_Offset: {x: 0, y: 0}
    m_Floats:
    - first:
        name: _ALPHA
      second: 2
    - first:
        name: _Alpha
      second: 2
    - first:
        name: _Cutoff
      second: 0.5
    - first:
        name: _InvFade
      second: 1
    - first:
        name: _Light
      second: 1
    - first:
        name: _Liuguang_ZT
      second: 10
    - first:
        name: _Liuguang_power
      second: 1.3
    - first:
        name: _Posterize
      second: 4
    - first:
        name: _Posterize_Switch
      second: 0
    - first:
        name: _Power
      second: 3
    - first:
        name: _U_Speed01
      second: 8
    - first:
        name: _U_Speed02
      second: -2
    - first:
        name: _V_Speed01
      second: 1
    - first:
        name: _V_Speed02
      second: -4
    - first:
        name: _VertexColor_power
      second: 4
    m_Colors:
    - first:
        name: _Color
      second: {r: 0, g: 0.75172424, b: 1, a: 1}
    - first:
        name: _TintColor
      second: {r: 0.8180527, g: 0.71323526, b: 1, a: 0.5}
