%YAML 1.1
%TAG !u! tag:unity3d.com,2011:
--- !u!221 &22100000
AnimatorOverrideController:
  m_ObjectHideFlags: 0
  m_PrefabParentObject: {fileID: 0}
  m_PrefabInternal: {fileID: 0}
  m_Name: Animator111
  m_Controller: {fileID: 9100000, guid: 217e3c3e719851a47b0ee794c54d3908, type: 2}
  m_Clips:
  - m_OriginalClip: {fileID: 7400000, guid: a7a271524f41dfa49b5bd4f3d466da7b, type: 2}
    m_OverrideClip: {fileID: 7400000, guid: a7a271524f41dfa49b5bd4f3d466da7b, type: 2}
  - m_OriginalClip: {fileID: 7400000, guid: c599e063fc13b024daa36b49b8f466ef, type: 2}
    m_OverrideClip: {fileID: 7400000, guid: c599e063fc13b024daa36b49b8f466ef, type: 2}
  - m_OriginalClip: {fileID: 7400000, guid: cd8254bfe0c0ea142acb97c0b094903a, type: 2}
    m_OverrideClip: {fileID: 7400000, guid: cd8254bfe0c0ea142acb97c0b094903a, type: 2}
  - m_OriginalClip: {fileID: 7400000, guid: 1f7eba713d48b7a47bc0d403b1609ed0, type: 2}
    m_OverrideClip: {fileID: 7400000, guid: 1f7eba713d48b7a47bc0d403b1609ed0, type: 2}
  - m_OriginalClip: {fileID: 7400000, guid: eab1c68c98c7a9147be3e794acaa2b6e, type: 2}
    m_OverrideClip: {fileID: 7400000, guid: eab1c68c98c7a9147be3e794acaa2b6e, type: 2}
  - m_OriginalClip: {fileID: 7400000, guid: c49b092e9c3e0d142aa49fe6862e8351, type: 2}
    m_OverrideClip: {fileID: 7400000, guid: c49b092e9c3e0d142aa49fe6862e8351, type: 2}
  - m_OriginalClip: {fileID: 7400000, guid: f2154b87d6362214d937b82910d5725a, type: 2}
    m_OverrideClip: {fileID: 7400000, guid: f2154b87d6362214d937b82910d5725a, type: 2}
  - m_OriginalClip: {fileID: 7400000, guid: e1ae3f505a5dbf145ace35bd10537c0d, type: 2}
    m_OverrideClip: {fileID: 7400000, guid: e1ae3f505a5dbf145ace35bd10537c0d, type: 2}
  - m_OriginalClip: {fileID: 7400000, guid: 9c1cc5ed1a2078941b1fdbf3d30db798, type: 2}
    m_OverrideClip: {fileID: 7400000, guid: 9c1cc5ed1a2078941b1fdbf3d30db798, type: 2}
  - m_OriginalClip: {fileID: 7400000, guid: cd2ed5bc3c48d7b428a6f75c470aa466, type: 2}
    m_OverrideClip: {fileID: 7400000, guid: cd2ed5bc3c48d7b428a6f75c470aa466, type: 2}
  - m_OriginalClip: {fileID: 7400000, guid: 2ac17f9a6e4453f409641044fb2bf046, type: 2}
    m_OverrideClip: {fileID: 7400000, guid: 2ac17f9a6e4453f409641044fb2bf046, type: 2}
  - m_OriginalClip: {fileID: 7400000, guid: e8ec6e8376b586740bd5608e2a8e0475, type: 2}
    m_OverrideClip: {fileID: 7400000, guid: e8ec6e8376b586740bd5608e2a8e0475, type: 2}
  - m_OriginalClip: {fileID: 7400000, guid: 73458c8b2c4c8be47a56ef5d4081b283, type: 2}
    m_OverrideClip: {fileID: 7400000, guid: 73458c8b2c4c8be47a56ef5d4081b283, type: 2}
  - m_OriginalClip: {fileID: 7400000, guid: e93e49eabe566be4c9741c1fc4f5c874, type: 2}
    m_OverrideClip: {fileID: 7400000, guid: e93e49eabe566be4c9741c1fc4f5c874, type: 2}
  - m_OriginalClip: {fileID: 7400000, guid: 975546f4fa5f811408bbbb9ad7ae1f26, type: 2}
    m_OverrideClip: {fileID: 7400000, guid: 975546f4fa5f811408bbbb9ad7ae1f26, type: 2}
  - m_OriginalClip: {fileID: 7400000, guid: 5ef5d11e3bb950b409644ee7db5d1971, type: 2}
    m_OverrideClip: {fileID: 7400000, guid: 5ef5d11e3bb950b409644ee7db5d1971, type: 2}
  - m_OriginalClip: {fileID: 7400000, guid: ca181e8542f51a342bfe2be7af2c3cc1, type: 2}
    m_OverrideClip: {fileID: 7400000, guid: ca181e8542f51a342bfe2be7af2c3cc1, type: 2}
  - m_OriginalClip: {fileID: 7400000, guid: d51e0dda713b96044adc09e480e2beed, type: 2}
    m_OverrideClip: {fileID: 7400000, guid: d51e0dda713b96044adc09e480e2beed, type: 2}
  - m_OriginalClip: {fileID: 7400000, guid: 02c8698732fc07143b677466bbf0cc14, type: 2}
    m_OverrideClip: {fileID: 7400000, guid: 02c8698732fc07143b677466bbf0cc14, type: 2}
  - m_OriginalClip: {fileID: 7400000, guid: 8de2f4d5fa2041a4c91193181ebed747, type: 2}
    m_OverrideClip: {fileID: 7400000, guid: 8de2f4d5fa2041a4c91193181ebed747, type: 2}
  - m_OriginalClip: {fileID: 7400000, guid: 266e85a296753f94cbfcadb1ec69cbb8, type: 2}
    m_OverrideClip: {fileID: 7400000, guid: 266e85a296753f94cbfcadb1ec69cbb8, type: 2}
