%YAML 1.1
%TAG !u! tag:unity3d.com,2011:
--- !u!74 &7400000
AnimationClip:
  m_ObjectHideFlags: 0
  m_PrefabParentObject: {fileID: 0}
  m_PrefabInternal: {fileID: 0}
  m_Name: magic_eff_41401_att1_ani
  serializedVersion: 6
  m_Legacy: 0
  m_Compressed: 0
  m_UseHighQualityCurve: 1
  m_RotationCurves: []
  m_CompressedRotationCurves: []
  m_EulerCurves:
  - curve:
      serializedVersion: 2
      m_Curve:
      - time: 0.033333335
        value: {x: 252.853, y: 64.371994, z: -61.928986}
        inSlope: {x: 0, y: 0, z: 0}
        outSlope: {x: 0, y: 0, z: 0}
        tangentMode: 0
      - time: 0.35
        value: {x: 252.061, y: 65.784, z: -81.76898}
        inSlope: {x: 0, y: 0, z: 0}
        outSlope: {x: 0, y: 0, z: 0}
        tangentMode: 0
      m_PreInfinity: 2
      m_PostInfinity: 2
      m_RotationOrder: 4
    path: rotate
  m_PositionCurves: []
  m_ScaleCurves: []
  m_FloatCurves:
  - curve:
      serializedVersion: 2
      m_Curve:
      - time: 0.1
        value: 0
        inSlope: Infinity
        outSlope: Infinity
        tangentMode: 31
      - time: 0.11666667
        value: 1
        inSlope: Infinity
        outSlope: Infinity
        tangentMode: 31
      m_PreInfinity: 2
      m_PostInfinity: 2
      m_RotationOrder: 4
    attribute: m_IsActive
    path: rotate/magic_eff_100401_att_dg3
    classID: 1
    script: {fileID: 0}
  - curve:
      serializedVersion: 2
      m_Curve:
      - time: 0
        value: 0
        inSlope: Infinity
        outSlope: Infinity
        tangentMode: 31
      - time: 0.016666668
        value: 1
        inSlope: Infinity
        outSlope: Infinity
        tangentMode: 31
      m_PreInfinity: 2
      m_PostInfinity: 2
      m_RotationOrder: 4
    attribute: m_IsActive
    path: rotate/magic_eff_100401_att_dg1
    classID: 1
    script: {fileID: 0}
  - curve:
      serializedVersion: 2
      m_Curve:
      - time: 0.016666668
        value: 2.85
        inSlope: 0
        outSlope: 0
        tangentMode: 0
      - time: 0.15
        value: 1
        inSlope: 0
        outSlope: 0
        tangentMode: 0
      m_PreInfinity: 2
      m_PostInfinity: 2
      m_RotationOrder: 4
    attribute: material._MainTex_ST.x
    path: rotate/magic_eff_100401_att_dg1
    classID: 23
    script: {fileID: 0}
  - curve:
      serializedVersion: 2
      m_Curve:
      - time: 0.1
        value: 1.5
        inSlope: 0
        outSlope: 0
        tangentMode: 0
      - time: 0.11666667
        value: 1
        inSlope: 0
        outSlope: 0
        tangentMode: 0
      m_PreInfinity: 2
      m_PostInfinity: 2
      m_RotationOrder: 4
    attribute: material._MainTex_ST.y
    path: rotate/magic_eff_100401_att_dg1
    classID: 23
    script: {fileID: 0}
  - curve:
      serializedVersion: 2
      m_Curve:
      - time: 0.016666668
        value: -1.75
        inSlope: 0
        outSlope: 0
        tangentMode: 0
      - time: 0.15
        value: 0.15
        inSlope: 0
        outSlope: 0
        tangentMode: 0
      m_PreInfinity: 2
      m_PostInfinity: 2
      m_RotationOrder: 4
    attribute: material._MainTex_ST.z
    path: rotate/magic_eff_100401_att_dg1
    classID: 23
    script: {fileID: 0}
  - curve:
      serializedVersion: 2
      m_Curve:
      - time: 0.016666668
        value: -0.25
        inSlope: 0
        outSlope: 0
        tangentMode: 0
      - time: 0.1
        value: -0.25
        inSlope: 0
        outSlope: 0
        tangentMode: 0
      - time: 0.11666667
        value: 0
        inSlope: 0
        outSlope: 0
        tangentMode: 0
      m_PreInfinity: 2
      m_PostInfinity: 2
      m_RotationOrder: 4
    attribute: material._MainTex_ST.w
    path: rotate/magic_eff_100401_att_dg1
    classID: 23
    script: {fileID: 0}
  - curve:
      serializedVersion: 2
      m_Curve:
      - time: 0.13333334
        value: -0.01
        inSlope: 3.5781822
        outSlope: 3.5781822
        tangentMode: 10
      - time: 0.31666666
        value: 0.646
        inSlope: 12.409081
        outSlope: 12.409081
        tangentMode: 10
      - time: 0.33333334
        value: 1
        inSlope: 21.23998
        outSlope: 21.23998
        tangentMode: 10
      m_PreInfinity: 2
      m_PostInfinity: 2
      m_RotationOrder: 4
    attribute: material._diss_amount
    path: rotate/magic_eff_100401_att_dg1
    classID: 23
    script: {fileID: 0}
  - curve:
      serializedVersion: 2
      m_Curve:
      - time: 0.11666667
        value: 0.321
        inSlope: -9.929998
        outSlope: -9.929998
        tangentMode: 10
      - time: 0.15
        value: -0.01
        inSlope: -2.0549994
        outSlope: -2.0549994
        tangentMode: 10
      - time: 0.26666668
        value: 0.669
        inSlope: 11.790007
        outSlope: 11.790007
        tangentMode: 10
      - time: 0.28333333
        value: 0.965
        inSlope: 17.760014
        outSlope: 17.760014
        tangentMode: 10
      m_PreInfinity: 2
      m_PostInfinity: 2
      m_RotationOrder: 4
    attribute: material._diss_amount
    path: rotate/magic_eff_100401_att_dg3
    classID: 23
    script: {fileID: 0}
  - curve:
      serializedVersion: 2
      m_Curve:
      - time: 0.13333334
        value: 1
        inSlope: 1.3333337
        outSlope: 1.3333337
        tangentMode: 10
      - time: 0.28333333
        value: 1.2
        inSlope: 1.3333337
        outSlope: 1.3333337
        tangentMode: 10
      m_PreInfinity: 2
      m_PostInfinity: 2
      m_RotationOrder: 4
    attribute: material._MainTex_ST.x
    path: rotate/magic_eff_100401_att_dg3
    classID: 23
    script: {fileID: 0}
  - curve:
      serializedVersion: 2
      m_Curve:
      - time: 0.13333334
        value: 2
        inSlope: 0
        outSlope: 0
        tangentMode: 10
      - time: 0.28333333
        value: 2
        inSlope: 0
        outSlope: 0
        tangentMode: 10
      m_PreInfinity: 2
      m_PostInfinity: 2
      m_RotationOrder: 4
    attribute: material._MainTex_ST.y
    path: rotate/magic_eff_100401_att_dg3
    classID: 23
    script: {fileID: 0}
  - curve:
      serializedVersion: 2
      m_Curve:
      - time: 0.13333334
        value: 0
        inSlope: 1.3333335
        outSlope: 1.3333335
        tangentMode: 10
      - time: 0.28333333
        value: 0.2
        inSlope: 1.3333335
        outSlope: 1.3333335
        tangentMode: 10
      m_PreInfinity: 2
      m_PostInfinity: 2
      m_RotationOrder: 4
    attribute: material._MainTex_ST.z
    path: rotate/magic_eff_100401_att_dg3
    classID: 23
    script: {fileID: 0}
  - curve:
      serializedVersion: 2
      m_Curve:
      - time: 0.13333334
        value: -0.5
        inSlope: 0
        outSlope: 0
        tangentMode: 10
      - time: 0.28333333
        value: -0.5
        inSlope: 0
        outSlope: 0
        tangentMode: 10
      m_PreInfinity: 2
      m_PostInfinity: 2
      m_RotationOrder: 4
    attribute: material._MainTex_ST.w
    path: rotate/magic_eff_100401_att_dg3
    classID: 23
    script: {fileID: 0}
  - curve:
      serializedVersion: 2
      m_Curve:
      - time: 0.15
        value: 0.9852941
        inSlope: -2.6470587
        outSlope: -2.6470587
        tangentMode: 10
      - time: 0.28333333
        value: 0.63235295
        inSlope: -2.6470587
        outSlope: -2.6470587
        tangentMode: 10
      m_PreInfinity: 2
      m_PostInfinity: 2
      m_RotationOrder: 4
    attribute: material._MainColor.r
    path: rotate/magic_eff_100401_att_dg3
    classID: 23
    script: {fileID: 0}
  - curve:
      serializedVersion: 2
      m_Curve:
      - time: 0.15
        value: 0.4456807
        inSlope: -2.6557393
        outSlope: -2.6557393
        tangentMode: 10
      - time: 0.28333333
        value: 0.091582164
        inSlope: -2.6557393
        outSlope: -2.6557393
        tangentMode: 10
      m_PreInfinity: 2
      m_PostInfinity: 2
      m_RotationOrder: 4
    attribute: material._MainColor.g
    path: rotate/magic_eff_100401_att_dg3
    classID: 23
    script: {fileID: 0}
  - curve:
      serializedVersion: 2
      m_Curve:
      - time: 0.15
        value: 0.2028547
        inSlope: -1.5214103
        outSlope: -1.5214103
        tangentMode: 10
      - time: 0.28333333
        value: 0
        inSlope: -1.5214103
        outSlope: -1.5214103
        tangentMode: 10
      m_PreInfinity: 2
      m_PostInfinity: 2
      m_RotationOrder: 4
    attribute: material._MainColor.b
    path: rotate/magic_eff_100401_att_dg3
    classID: 23
    script: {fileID: 0}
  - curve:
      serializedVersion: 2
      m_Curve:
      - time: 0.15
        value: 1
        inSlope: 0
        outSlope: 0
        tangentMode: 10
      - time: 0.28333333
        value: 1
        inSlope: 0
        outSlope: 0
        tangentMode: 10
      m_PreInfinity: 2
      m_PostInfinity: 2
      m_RotationOrder: 4
    attribute: material._MainColor.a
    path: rotate/magic_eff_100401_att_dg3
    classID: 23
    script: {fileID: 0}
  - curve:
      serializedVersion: 2
      m_Curve:
      - time: 0.05
        value: 0
        inSlope: Infinity
        outSlope: Infinity
        tangentMode: 31
      - time: 0.06666667
        value: 1
        inSlope: Infinity
        outSlope: Infinity
        tangentMode: 31
      m_PreInfinity: 2
      m_PostInfinity: 2
      m_RotationOrder: 4
    attribute: m_IsActive
    path: rotate/magic_eff_100401_att_dg2
    classID: 1
    script: {fileID: 0}
  - curve:
      serializedVersion: 2
      m_Curve:
      - time: 0.06666667
        value: 0.65
        inSlope: 0
        outSlope: 0
        tangentMode: 10
      - time: 0.1
        value: 0.65
        inSlope: 0
        outSlope: 0
        tangentMode: 10
      - time: 0.11666667
        value: 0.65
        inSlope: 0
        outSlope: 0
        tangentMode: 10
      - time: 0.28333333
        value: 0.65
        inSlope: 0
        outSlope: 0
        tangentMode: 10
      m_PreInfinity: 2
      m_PostInfinity: 2
      m_RotationOrder: 4
    attribute: material._MainTex_ST.x
    path: rotate/magic_eff_100401_att_dg2
    classID: 23
    script: {fileID: 0}
  - curve:
      serializedVersion: 2
      m_Curve:
      - time: 0.06666667
        value: 0.75
        inSlope: 0
        outSlope: 0
        tangentMode: 10
      - time: 0.1
        value: 0.75
        inSlope: 0
        outSlope: 0
        tangentMode: 10
      - time: 0.11666667
        value: 0.75
        inSlope: 0
        outSlope: 0
        tangentMode: 10
      - time: 0.28333333
        value: 0.75
        inSlope: 0
        outSlope: 0
        tangentMode: 10
      m_PreInfinity: 2
      m_PostInfinity: 2
      m_RotationOrder: 4
    attribute: material._MainTex_ST.y
    path: rotate/magic_eff_100401_att_dg2
    classID: 23
    script: {fileID: 0}
  - curve:
      serializedVersion: 2
      m_Curve:
      - time: 0.06666667
        value: -0.14
        inSlope: 0.9000001
        outSlope: 0.9000001
        tangentMode: 10
      - time: 0.1
        value: -0.11
        inSlope: 8.25
        outSlope: 8.25
        tangentMode: 10
      - time: 0.11666667
        value: 0.15
        inSlope: 8.85
        outSlope: 8.85
        tangentMode: 10
      - time: 0.28333333
        value: 0.5
        inSlope: 2.1000001
        outSlope: 2.1000001
        tangentMode: 10
      m_PreInfinity: 2
      m_PostInfinity: 2
      m_RotationOrder: 4
    attribute: material._MainTex_ST.z
    path: rotate/magic_eff_100401_att_dg2
    classID: 23
    script: {fileID: 0}
  - curve:
      serializedVersion: 2
      m_Curve:
      - time: 0.06666667
        value: 0.125
        inSlope: 0
        outSlope: 0
        tangentMode: 10
      - time: 0.1
        value: 0.125
        inSlope: 0
        outSlope: 0
        tangentMode: 10
      - time: 0.11666667
        value: 0.125
        inSlope: 0
        outSlope: 0
        tangentMode: 10
      - time: 0.28333333
        value: 0.125
        inSlope: 0
        outSlope: 0
        tangentMode: 10
      m_PreInfinity: 2
      m_PostInfinity: 2
      m_RotationOrder: 4
    attribute: material._MainTex_ST.w
    path: rotate/magic_eff_100401_att_dg2
    classID: 23
    script: {fileID: 0}
  - curve:
      serializedVersion: 2
      m_Curve:
      - time: 0.23333333
        value: 0.3088235
        inSlope: 0.00000044703475
        outSlope: 0.00000044703475
        tangentMode: 10
      - time: 0.3
        value: 0.30882353
        inSlope: 0.00000044703475
        outSlope: 0.00000044703475
        tangentMode: 10
      m_PreInfinity: 2
      m_PostInfinity: 2
      m_RotationOrder: 4
    attribute: material._TintColor.r
    path: rotate/magic_eff_100401_att_dg2
    classID: 23
    script: {fileID: 0}
  - curve:
      serializedVersion: 2
      m_Curve:
      - time: 0.23333333
        value: 0.4851926
        inSlope: 0
        outSlope: 0
        tangentMode: 10
      - time: 0.3
        value: 0.4851926
        inSlope: 0
        outSlope: 0
        tangentMode: 10
      m_PreInfinity: 2
      m_PostInfinity: 2
      m_RotationOrder: 4
    attribute: material._TintColor.g
    path: rotate/magic_eff_100401_att_dg2
    classID: 23
    script: {fileID: 0}
  - curve:
      serializedVersion: 2
      m_Curve:
      - time: 0.23333333
        value: 1
        inSlope: 0
        outSlope: 0
        tangentMode: 10
      - time: 0.3
        value: 1
        inSlope: 0
        outSlope: 0
        tangentMode: 10
      m_PreInfinity: 2
      m_PostInfinity: 2
      m_RotationOrder: 4
    attribute: material._TintColor.b
    path: rotate/magic_eff_100401_att_dg2
    classID: 23
    script: {fileID: 0}
  - curve:
      serializedVersion: 2
      m_Curve:
      - time: 0.23333333
        value: 0.5
        inSlope: -7.4999986
        outSlope: -7.4999986
        tangentMode: 10
      - time: 0.3
        value: 0
        inSlope: -7.4999986
        outSlope: -7.4999986
        tangentMode: 10
      m_PreInfinity: 2
      m_PostInfinity: 2
      m_RotationOrder: 4
    attribute: material._TintColor.a
    path: rotate/magic_eff_100401_att_dg2
    classID: 23
    script: {fileID: 0}
  m_PPtrCurves: []
  m_SampleRate: 60
  m_WrapMode: 0
  m_Bounds:
    m_Center: {x: 0, y: 0, z: 0}
    m_Extent: {x: 0, y: 0, z: 0}
  m_ClipBindingConstant:
    genericBindings:
    - path: 931746316
      attribute: 4
      script: {fileID: 0}
      classID: 4
      customType: 14
      isPPtrCurve: 0
    - path: 3661543970
      attribute: 2086281974
      script: {fileID: 0}
      classID: 1
      customType: 0
      isPPtrCurve: 0
    - path: 875617038
      attribute: 2086281974
      script: {fileID: 0}
      classID: 1
      customType: 0
      isPPtrCurve: 0
    - path: 875617038
      attribute: 109495689
      script: {fileID: 0}
      classID: 23
      customType: 22
      isPPtrCurve: 0
    - path: 875617038
      attribute: 377931145
      script: {fileID: 0}
      classID: 23
      customType: 22
      isPPtrCurve: 0
    - path: 875617038
      attribute: 646366601
      script: {fileID: 0}
      classID: 23
      customType: 22
      isPPtrCurve: 0
    - path: 875617038
      attribute: 914802057
      script: {fileID: 0}
      classID: 23
      customType: 22
      isPPtrCurve: 0
    - path: 875617038
      attribute: 2311776462
      script: {fileID: 0}
      classID: 23
      customType: 22
      isPPtrCurve: 0
    - path: 3661543970
      attribute: 2311776462
      script: {fileID: 0}
      classID: 23
      customType: 22
      isPPtrCurve: 0
    - path: 3661543970
      attribute: 109495689
      script: {fileID: 0}
      classID: 23
      customType: 22
      isPPtrCurve: 0
    - path: 3661543970
      attribute: 646366601
      script: {fileID: 0}
      classID: 23
      customType: 22
      isPPtrCurve: 0
    - path: 3661543970
      attribute: 1164707370
      script: {fileID: 0}
      classID: 23
      customType: 22
      isPPtrCurve: 0
    - path: 3661543970
      attribute: 1433142826
      script: {fileID: 0}
      classID: 23
      customType: 22
      isPPtrCurve: 0
    - path: 3661543970
      attribute: 1701578282
      script: {fileID: 0}
      classID: 23
      customType: 22
      isPPtrCurve: 0
    - path: 2906229428
      attribute: 2086281974
      script: {fileID: 0}
      classID: 1
      customType: 0
      isPPtrCurve: 0
    - path: 2906229428
      attribute: 646366601
      script: {fileID: 0}
      classID: 23
      customType: 22
      isPPtrCurve: 0
    - path: 2906229428
      attribute: 1895888582
      script: {fileID: 0}
      classID: 23
      customType: 22
      isPPtrCurve: 0
    - path: 3661543970
      attribute: 377931145
      script: {fileID: 0}
      classID: 23
      customType: 22
      isPPtrCurve: 0
    - path: 3661543970
      attribute: 914802057
      script: {fileID: 0}
      classID: 23
      customType: 22
      isPPtrCurve: 0
    - path: 3661543970
      attribute: 1970013738
      script: {fileID: 0}
      classID: 23
      customType: 22
      isPPtrCurve: 0
    - path: 2906229428
      attribute: 109495689
      script: {fileID: 0}
      classID: 23
      customType: 22
      isPPtrCurve: 0
    - path: 2906229428
      attribute: 377931145
      script: {fileID: 0}
      classID: 23
      customType: 22
      isPPtrCurve: 0
    - path: 2906229428
      attribute: 914802057
      script: {fileID: 0}
      classID: 23
      customType: 22
      isPPtrCurve: 0
    - path: 2906229428
      attribute: 1090582214
      script: {fileID: 0}
      classID: 23
      customType: 22
      isPPtrCurve: 0
    - path: 2906229428
      attribute: 1359017670
      script: {fileID: 0}
      classID: 23
      customType: 22
      isPPtrCurve: 0
    - path: 2906229428
      attribute: 1627453126
      script: {fileID: 0}
      classID: 23
      customType: 22
      isPPtrCurve: 0
    pptrCurveMapping: []
  m_AnimationClipSettings:
    serializedVersion: 2
    m_AdditiveReferencePoseClip: {fileID: 0}
    m_AdditiveReferencePoseTime: 0
    m_StartTime: 0
    m_StopTime: 0.35
    m_OrientationOffsetY: 0
    m_Level: 0
    m_CycleOffset: 0
    m_HasAdditiveReferencePose: 0
    m_LoopTime: 0
    m_LoopBlend: 0
    m_LoopBlendOrientation: 0
    m_LoopBlendPositionY: 0
    m_LoopBlendPositionXZ: 0
    m_KeepOriginalOrientation: 0
    m_KeepOriginalPositionY: 1
    m_KeepOriginalPositionXZ: 0
    m_HeightFromFeet: 0
    m_Mirror: 0
  m_EditorCurves:
  - curve:
      serializedVersion: 2
      m_Curve:
      - time: 0.1
        value: 0
        inSlope: Infinity
        outSlope: Infinity
        tangentMode: 31
      - time: 0.11666667
        value: 1
        inSlope: Infinity
        outSlope: Infinity
        tangentMode: 31
      m_PreInfinity: 2
      m_PostInfinity: 2
      m_RotationOrder: 4
    attribute: m_IsActive
    path: rotate/magic_eff_100401_att_dg3
    classID: 1
    script: {fileID: 0}
  - curve:
      serializedVersion: 2
      m_Curve:
      - time: 0
        value: 0
        inSlope: Infinity
        outSlope: Infinity
        tangentMode: 31
      - time: 0.016666668
        value: 1
        inSlope: Infinity
        outSlope: Infinity
        tangentMode: 31
      m_PreInfinity: 2
      m_PostInfinity: 2
      m_RotationOrder: 4
    attribute: m_IsActive
    path: rotate/magic_eff_100401_att_dg1
    classID: 1
    script: {fileID: 0}
  - curve:
      serializedVersion: 2
      m_Curve:
      - time: 0.016666668
        value: 2.85
        inSlope: 0
        outSlope: 0
        tangentMode: 0
      - time: 0.15
        value: 1
        inSlope: 0
        outSlope: 0
        tangentMode: 0
      m_PreInfinity: 2
      m_PostInfinity: 2
      m_RotationOrder: 4
    attribute: material._MainTex_ST.x
    path: rotate/magic_eff_100401_att_dg1
    classID: 23
    script: {fileID: 0}
  - curve:
      serializedVersion: 2
      m_Curve:
      - time: 0.1
        value: 1.5
        inSlope: 0
        outSlope: 0
        tangentMode: 0
      - time: 0.11666667
        value: 1
        inSlope: 0
        outSlope: 0
        tangentMode: 0
      m_PreInfinity: 2
      m_PostInfinity: 2
      m_RotationOrder: 4
    attribute: material._MainTex_ST.y
    path: rotate/magic_eff_100401_att_dg1
    classID: 23
    script: {fileID: 0}
  - curve:
      serializedVersion: 2
      m_Curve:
      - time: 0.016666668
        value: -1.75
        inSlope: 0
        outSlope: 0
        tangentMode: 0
      - time: 0.15
        value: 0.15
        inSlope: 0
        outSlope: 0
        tangentMode: 0
      m_PreInfinity: 2
      m_PostInfinity: 2
      m_RotationOrder: 4
    attribute: material._MainTex_ST.z
    path: rotate/magic_eff_100401_att_dg1
    classID: 23
    script: {fileID: 0}
  - curve:
      serializedVersion: 2
      m_Curve:
      - time: 0.016666668
        value: -0.25
        inSlope: 0
        outSlope: 0
        tangentMode: 0
      - time: 0.1
        value: -0.25
        inSlope: 0
        outSlope: 0
        tangentMode: 0
      - time: 0.11666667
        value: 0
        inSlope: 0
        outSlope: 0
        tangentMode: 0
      m_PreInfinity: 2
      m_PostInfinity: 2
      m_RotationOrder: 4
    attribute: material._MainTex_ST.w
    path: rotate/magic_eff_100401_att_dg1
    classID: 23
    script: {fileID: 0}
  - curve:
      serializedVersion: 2
      m_Curve:
      - time: 0.13333334
        value: -0.01
        inSlope: 3.5781822
        outSlope: 3.5781822
        tangentMode: 10
      - time: 0.31666666
        value: 0.646
        inSlope: 12.409081
        outSlope: 12.409081
        tangentMode: 10
      - time: 0.33333334
        value: 1
        inSlope: 21.23998
        outSlope: 21.23998
        tangentMode: 10
      m_PreInfinity: 2
      m_PostInfinity: 2
      m_RotationOrder: 4
    attribute: material._diss_amount
    path: rotate/magic_eff_100401_att_dg1
    classID: 23
    script: {fileID: 0}
  - curve:
      serializedVersion: 2
      m_Curve:
      - time: 0.11666667
        value: 0.321
        inSlope: -9.929998
        outSlope: -9.929998
        tangentMode: 10
      - time: 0.15
        value: -0.01
        inSlope: -2.0549994
        outSlope: -2.0549994
        tangentMode: 10
      - time: 0.26666668
        value: 0.669
        inSlope: 11.790007
        outSlope: 11.790007
        tangentMode: 10
      - time: 0.28333333
        value: 0.965
        inSlope: 17.760014
        outSlope: 17.760014
        tangentMode: 10
      m_PreInfinity: 2
      m_PostInfinity: 2
      m_RotationOrder: 4
    attribute: material._diss_amount
    path: rotate/magic_eff_100401_att_dg3
    classID: 23
    script: {fileID: 0}
  - curve:
      serializedVersion: 2
      m_Curve:
      - time: 0.13333334
        value: 1
        inSlope: 1.3333337
        outSlope: 1.3333337
        tangentMode: 10
      - time: 0.28333333
        value: 1.2
        inSlope: 1.3333337
        outSlope: 1.3333337
        tangentMode: 10
      m_PreInfinity: 2
      m_PostInfinity: 2
      m_RotationOrder: 4
    attribute: material._MainTex_ST.x
    path: rotate/magic_eff_100401_att_dg3
    classID: 23
    script: {fileID: 0}
  - curve:
      serializedVersion: 2
      m_Curve:
      - time: 0.13333334
        value: 2
        inSlope: 0
        outSlope: 0
        tangentMode: 10
      - time: 0.28333333
        value: 2
        inSlope: 0
        outSlope: 0
        tangentMode: 10
      m_PreInfinity: 2
      m_PostInfinity: 2
      m_RotationOrder: 4
    attribute: material._MainTex_ST.y
    path: rotate/magic_eff_100401_att_dg3
    classID: 23
    script: {fileID: 0}
  - curve:
      serializedVersion: 2
      m_Curve:
      - time: 0.13333334
        value: 0
        inSlope: 1.3333335
        outSlope: 1.3333335
        tangentMode: 10
      - time: 0.28333333
        value: 0.2
        inSlope: 1.3333335
        outSlope: 1.3333335
        tangentMode: 10
      m_PreInfinity: 2
      m_PostInfinity: 2
      m_RotationOrder: 4
    attribute: material._MainTex_ST.z
    path: rotate/magic_eff_100401_att_dg3
    classID: 23
    script: {fileID: 0}
  - curve:
      serializedVersion: 2
      m_Curve:
      - time: 0.13333334
        value: -0.5
        inSlope: 0
        outSlope: 0
        tangentMode: 10
      - time: 0.28333333
        value: -0.5
        inSlope: 0
        outSlope: 0
        tangentMode: 10
      m_PreInfinity: 2
      m_PostInfinity: 2
      m_RotationOrder: 4
    attribute: material._MainTex_ST.w
    path: rotate/magic_eff_100401_att_dg3
    classID: 23
    script: {fileID: 0}
  - curve:
      serializedVersion: 2
      m_Curve:
      - time: 0.15
        value: 0.9852941
        inSlope: -2.6470587
        outSlope: -2.6470587
        tangentMode: 10
      - time: 0.28333333
        value: 0.63235295
        inSlope: -2.6470587
        outSlope: -2.6470587
        tangentMode: 10
      m_PreInfinity: 2
      m_PostInfinity: 2
      m_RotationOrder: 4
    attribute: material._MainColor.r
    path: rotate/magic_eff_100401_att_dg3
    classID: 23
    script: {fileID: 0}
  - curve:
      serializedVersion: 2
      m_Curve:
      - time: 0.15
        value: 0.4456807
        inSlope: -2.6557393
        outSlope: -2.6557393
        tangentMode: 10
      - time: 0.28333333
        value: 0.091582164
        inSlope: -2.6557393
        outSlope: -2.6557393
        tangentMode: 10
      m_PreInfinity: 2
      m_PostInfinity: 2
      m_RotationOrder: 4
    attribute: material._MainColor.g
    path: rotate/magic_eff_100401_att_dg3
    classID: 23
    script: {fileID: 0}
  - curve:
      serializedVersion: 2
      m_Curve:
      - time: 0.15
        value: 0.2028547
        inSlope: -1.5214103
        outSlope: -1.5214103
        tangentMode: 10
      - time: 0.28333333
        value: 0
        inSlope: -1.5214103
        outSlope: -1.5214103
        tangentMode: 10
      m_PreInfinity: 2
      m_PostInfinity: 2
      m_RotationOrder: 4
    attribute: material._MainColor.b
    path: rotate/magic_eff_100401_att_dg3
    classID: 23
    script: {fileID: 0}
  - curve:
      serializedVersion: 2
      m_Curve:
      - time: 0.15
        value: 1
        inSlope: 0
        outSlope: 0
        tangentMode: 10
      - time: 0.28333333
        value: 1
        inSlope: 0
        outSlope: 0
        tangentMode: 10
      m_PreInfinity: 2
      m_PostInfinity: 2
      m_RotationOrder: 4
    attribute: material._MainColor.a
    path: rotate/magic_eff_100401_att_dg3
    classID: 23
    script: {fileID: 0}
  - curve:
      serializedVersion: 2
      m_Curve:
      - time: 0.033333335
        value: 252.853
        inSlope: 0
        outSlope: 0
        tangentMode: 0
      - time: 0.35
        value: 252.061
        inSlope: 0
        outSlope: 0
        tangentMode: 0
      m_PreInfinity: 2
      m_PostInfinity: 2
      m_RotationOrder: 4
    attribute: localEulerAnglesRaw.x
    path: rotate
    classID: 4
    script: {fileID: 0}
  - curve:
      serializedVersion: 2
      m_Curve:
      - time: 0.033333335
        value: 64.371994
        inSlope: 0
        outSlope: 0
        tangentMode: 0
      - time: 0.35
        value: 65.784
        inSlope: 0
        outSlope: 0
        tangentMode: 0
      m_PreInfinity: 2
      m_PostInfinity: 2
      m_RotationOrder: 4
    attribute: localEulerAnglesRaw.y
    path: rotate
    classID: 4
    script: {fileID: 0}
  - curve:
      serializedVersion: 2
      m_Curve:
      - time: 0.033333335
        value: -61.928986
        inSlope: 0
        outSlope: 0
        tangentMode: 0
      - time: 0.35
        value: -81.76898
        inSlope: 0
        outSlope: 0
        tangentMode: 0
      m_PreInfinity: 2
      m_PostInfinity: 2
      m_RotationOrder: 4
    attribute: localEulerAnglesRaw.z
    path: rotate
    classID: 4
    script: {fileID: 0}
  - curve:
      serializedVersion: 2
      m_Curve:
      - time: 0.05
        value: 0
        inSlope: Infinity
        outSlope: Infinity
        tangentMode: 31
      - time: 0.06666667
        value: 1
        inSlope: Infinity
        outSlope: Infinity
        tangentMode: 31
      m_PreInfinity: 2
      m_PostInfinity: 2
      m_RotationOrder: 4
    attribute: m_IsActive
    path: rotate/magic_eff_100401_att_dg2
    classID: 1
    script: {fileID: 0}
  - curve:
      serializedVersion: 2
      m_Curve:
      - time: 0.06666667
        value: 0.65
        inSlope: 0
        outSlope: 0
        tangentMode: 10
      - time: 0.1
        value: 0.65
        inSlope: 0
        outSlope: 0
        tangentMode: 10
      - time: 0.11666667
        value: 0.65
        inSlope: 0
        outSlope: 0
        tangentMode: 10
      - time: 0.28333333
        value: 0.65
        inSlope: 0
        outSlope: 0
        tangentMode: 10
      m_PreInfinity: 2
      m_PostInfinity: 2
      m_RotationOrder: 4
    attribute: material._MainTex_ST.x
    path: rotate/magic_eff_100401_att_dg2
    classID: 23
    script: {fileID: 0}
  - curve:
      serializedVersion: 2
      m_Curve:
      - time: 0.06666667
        value: 0.75
        inSlope: 0
        outSlope: 0
        tangentMode: 10
      - time: 0.1
        value: 0.75
        inSlope: 0
        outSlope: 0
        tangentMode: 10
      - time: 0.11666667
        value: 0.75
        inSlope: 0
        outSlope: 0
        tangentMode: 10
      - time: 0.28333333
        value: 0.75
        inSlope: 0
        outSlope: 0
        tangentMode: 10
      m_PreInfinity: 2
      m_PostInfinity: 2
      m_RotationOrder: 4
    attribute: material._MainTex_ST.y
    path: rotate/magic_eff_100401_att_dg2
    classID: 23
    script: {fileID: 0}
  - curve:
      serializedVersion: 2
      m_Curve:
      - time: 0.06666667
        value: -0.14
        inSlope: 0.9000001
        outSlope: 0.9000001
        tangentMode: 10
      - time: 0.1
        value: -0.11
        inSlope: 8.25
        outSlope: 8.25
        tangentMode: 10
      - time: 0.11666667
        value: 0.15
        inSlope: 8.85
        outSlope: 8.85
        tangentMode: 10
      - time: 0.28333333
        value: 0.5
        inSlope: 2.1000001
        outSlope: 2.1000001
        tangentMode: 10
      m_PreInfinity: 2
      m_PostInfinity: 2
      m_RotationOrder: 4
    attribute: material._MainTex_ST.z
    path: rotate/magic_eff_100401_att_dg2
    classID: 23
    script: {fileID: 0}
  - curve:
      serializedVersion: 2
      m_Curve:
      - time: 0.06666667
        value: 0.125
        inSlope: 0
        outSlope: 0
        tangentMode: 10
      - time: 0.1
        value: 0.125
        inSlope: 0
        outSlope: 0
        tangentMode: 10
      - time: 0.11666667
        value: 0.125
        inSlope: 0
        outSlope: 0
        tangentMode: 10
      - time: 0.28333333
        value: 0.125
        inSlope: 0
        outSlope: 0
        tangentMode: 10
      m_PreInfinity: 2
      m_PostInfinity: 2
      m_RotationOrder: 4
    attribute: material._MainTex_ST.w
    path: rotate/magic_eff_100401_att_dg2
    classID: 23
    script: {fileID: 0}
  - curve:
      serializedVersion: 2
      m_Curve:
      - time: 0.23333333
        value: 0.3088235
        inSlope: 0.00000044703475
        outSlope: 0.00000044703475
        tangentMode: 10
      - time: 0.3
        value: 0.30882353
        inSlope: 0.00000044703475
        outSlope: 0.00000044703475
        tangentMode: 10
      m_PreInfinity: 2
      m_PostInfinity: 2
      m_RotationOrder: 4
    attribute: material._TintColor.r
    path: rotate/magic_eff_100401_att_dg2
    classID: 23
    script: {fileID: 0}
  - curve:
      serializedVersion: 2
      m_Curve:
      - time: 0.23333333
        value: 0.4851926
        inSlope: 0
        outSlope: 0
        tangentMode: 10
      - time: 0.3
        value: 0.4851926
        inSlope: 0
        outSlope: 0
        tangentMode: 10
      m_PreInfinity: 2
      m_PostInfinity: 2
      m_RotationOrder: 4
    attribute: material._TintColor.g
    path: rotate/magic_eff_100401_att_dg2
    classID: 23
    script: {fileID: 0}
  - curve:
      serializedVersion: 2
      m_Curve:
      - time: 0.23333333
        value: 1
        inSlope: 0
        outSlope: 0
        tangentMode: 10
      - time: 0.3
        value: 1
        inSlope: 0
        outSlope: 0
        tangentMode: 10
      m_PreInfinity: 2
      m_PostInfinity: 2
      m_RotationOrder: 4
    attribute: material._TintColor.b
    path: rotate/magic_eff_100401_att_dg2
    classID: 23
    script: {fileID: 0}
  - curve:
      serializedVersion: 2
      m_Curve:
      - time: 0.23333333
        value: 0.5
        inSlope: -7.4999986
        outSlope: -7.4999986
        tangentMode: 10
      - time: 0.3
        value: 0
        inSlope: -7.4999986
        outSlope: -7.4999986
        tangentMode: 10
      m_PreInfinity: 2
      m_PostInfinity: 2
      m_RotationOrder: 4
    attribute: material._TintColor.a
    path: rotate/magic_eff_100401_att_dg2
    classID: 23
    script: {fileID: 0}
  m_EulerEditorCurves:
  - curve:
      serializedVersion: 2
      m_Curve: []
      m_PreInfinity: 2
      m_PostInfinity: 2
      m_RotationOrder: 4
    attribute: m_LocalEulerAngles.x
    path: rotate
    classID: 4
    script: {fileID: 0}
  - curve:
      serializedVersion: 2
      m_Curve: []
      m_PreInfinity: 2
      m_PostInfinity: 2
      m_RotationOrder: 4
    attribute: m_LocalEulerAngles.y
    path: rotate
    classID: 4
    script: {fileID: 0}
  - curve:
      serializedVersion: 2
      m_Curve: []
      m_PreInfinity: 2
      m_PostInfinity: 2
      m_RotationOrder: 4
    attribute: m_LocalEulerAngles.z
    path: rotate
    classID: 4
    script: {fileID: 0}
  m_HasGenericRootTransform: 0
  m_HasMotionFloatCurves: 0
  m_GenerateMotionCurves: 0
  m_Events: []
