%YAML 1.1
%TAG !u! tag:unity3d.com,2011:
--- !u!74 &7400000
AnimationClip:
  m_ObjectHideFlags: 0
  m_PrefabParentObject: {fileID: 0}
  m_PrefabInternal: {fileID: 0}
  m_Name: 51002_hit1_ani
  serializedVersion: 6
  m_Legacy: 0
  m_Compressed: 0
  m_UseHighQualityCurve: 1
  m_RotationCurves: []
  m_CompressedRotationCurves: []
  m_EulerCurves:
  - curve:
      serializedVersion: 2
      m_Curve:
      - time: 1.1833333
        value: {x: -0, y: 0, z: 0}
        inSlope: {x: 0, y: 3.3786209, z: 0}
        outSlope: {x: 0, y: 3.3786209, z: 0}
        tangentMode: 0
      - time: 1.6666666
        value: {x: 0, y: 1.6330001, z: 0}
        inSlope: {x: 0, y: 0.103925705, z: 0}
        outSlope: {x: 0, y: 0.103925705, z: 0}
        tangentMode: 0
      - time: 2.3166666
        value: {x: 0, y: -0.42800003, z: 0}
        inSlope: {x: 0, y: -1.0915387, z: 0}
        outSlope: {x: 0, y: -1.0915387, z: 0}
        tangentMode: 0
      - time: 2.75
        value: {x: -0, y: 0, z: 0}
        inSlope: {x: -0, y: 0.98769224, z: 0}
        outSlope: {x: -0, y: 0.98769224, z: 0}
        tangentMode: 0
      m_PreInfinity: 2
      m_PostInfinity: 2
      m_RotationOrder: 4
    path: magic_eff_51002_moshen
  - curve:
      serializedVersion: 2
      m_Curve:
      - time: 1.0166667
        value: {x: 0, y: 0, z: 0}
        inSlope: {x: -7.734, y: 2.012, z: -6.058}
        outSlope: {x: -7.734, y: 2.012, z: -6.058}
        tangentMode: 0
      - time: 1.5166667
        value: {x: -3.867, y: 1.006, z: -3.029}
        inSlope: {x: 2.9571185, y: -15.591061, z: 11.535119}
        outSlope: {x: 2.9571185, y: -15.591061, z: 11.535119}
        tangentMode: 0
      - time: 1.8
        value: {x: 0, y: -8.399, z: 5.2240005}
        inSlope: {x: 13.648237, y: -33.194122, z: 29.128239}
        outSlope: {x: 13.648237, y: -33.194122, z: 29.128239}
        tangentMode: 0
      m_PreInfinity: 2
      m_PostInfinity: 2
      m_RotationOrder: 4
    path: 
  m_PositionCurves:
  - curve:
      serializedVersion: 2
      m_Curve:
      - time: 0.016666668
        value: {x: 4.11, y: -6.55, z: -0}
        inSlope: {x: 0, y: 3.1225798, z: 0}
        outSlope: {x: 0, y: 3.1225798, z: 0}
        tangentMode: 0
      - time: 1.1833333
        value: {x: 4.11, y: -3.33, z: -0}
        inSlope: {x: 0.13749954, y: 1.8174999, z: -0.17499995}
        outSlope: {x: 0.13749954, y: 1.8174999, z: -0.17499995}
        tangentMode: 0
      - time: 1.5833334
        value: {x: 4.22, y: -2.98, z: -0.14}
        inSlope: {x: 0.02499982, y: 0.4299998, z: -0.03249994}
        outSlope: {x: 0.02499982, y: 0.4299998, z: -0.03249994}
        tangentMode: 0
      - time: 2.25
        value: {x: 4.07, y: -2.99, z: 0.05}
        inSlope: {x: -0.07249976, y: -0.12749988, z: 0.092500016}
        outSlope: {x: -0.07249976, y: -0.12749988, z: 0.092500016}
        tangentMode: 0
      - time: 2.75
        value: {x: 4.11, y: -3.11, z: -0}
        inSlope: {x: 0.03999996, y: -0.22363627, z: -0.05}
        outSlope: {x: 0.03999996, y: -0.22363627, z: -0.05}
        tangentMode: 0
      - time: 3.6666667
        value: {x: 4.11, y: -3.3, z: 0}
        inSlope: {x: 0, y: -0.20727277, z: 0}
        outSlope: {x: 0, y: -0.20727277, z: 0}
        tangentMode: 0
      m_PreInfinity: 2
      m_PostInfinity: 2
      m_RotationOrder: 4
    path: magic_eff_51002_moshen
  m_ScaleCurves: []
  m_FloatCurves:
  - curve:
      serializedVersion: 2
      m_Curve:
      - time: 0.5
        value: 0.1525356
        inSlope: 0
        outSlope: 0
        tangentMode: 0
      - time: 3
        value: 0.1525356
        inSlope: 0
        outSlope: 0
        tangentMode: 0
      - time: 3.6666667
        value: 0.1525356
        inSlope: 0
        outSlope: 0
        tangentMode: 0
      m_PreInfinity: 2
      m_PostInfinity: 2
      m_RotationOrder: 4
    attribute: material._OutlineColor.r
    path: magic_eff_51002_moshen
    classID: 23
    script: {fileID: 0}
  - curve:
      serializedVersion: 2
      m_Curve:
      - time: 0.5
        value: 0
        inSlope: 0
        outSlope: 0
        tangentMode: 0
      - time: 3
        value: 0
        inSlope: 0
        outSlope: 0
        tangentMode: 0
      - time: 3.6666667
        value: 0
        inSlope: 0
        outSlope: 0
        tangentMode: 0
      m_PreInfinity: 2
      m_PostInfinity: 2
      m_RotationOrder: 4
    attribute: material._OutlineColor.g
    path: magic_eff_51002_moshen
    classID: 23
    script: {fileID: 0}
  - curve:
      serializedVersion: 2
      m_Curve:
      - time: 0.5
        value: 0.4705882
        inSlope: 0
        outSlope: 0
        tangentMode: 0
      - time: 3
        value: 0.4705882
        inSlope: 0
        outSlope: 0
        tangentMode: 0
      - time: 3.6666667
        value: 0.4705882
        inSlope: 0
        outSlope: 0
        tangentMode: 0
      m_PreInfinity: 2
      m_PostInfinity: 2
      m_RotationOrder: 4
    attribute: material._OutlineColor.b
    path: magic_eff_51002_moshen
    classID: 23
    script: {fileID: 0}
  - curve:
      serializedVersion: 2
      m_Curve:
      - time: 0.016666668
        value: 0
        inSlope: 0
        outSlope: 0
        tangentMode: 0
      - time: 0.5
        value: 1
        inSlope: 0
        outSlope: 0
        tangentMode: 0
      - time: 3
        value: 1
        inSlope: 0
        outSlope: 0
        tangentMode: 0
      - time: 3.6666667
        value: 0
        inSlope: 0
        outSlope: 0
        tangentMode: 0
      m_PreInfinity: 2
      m_PostInfinity: 2
      m_RotationOrder: 4
    attribute: material._OutlineColor.a
    path: magic_eff_51002_moshen
    classID: 23
    script: {fileID: 0}
  - curve:
      serializedVersion: 2
      m_Curve:
      - time: 0
        value: 0
        inSlope: Infinity
        outSlope: Infinity
        tangentMode: 31
      - time: 0.016666668
        value: 1
        inSlope: Infinity
        outSlope: Infinity
        tangentMode: 31
      m_PreInfinity: 2
      m_PostInfinity: 2
      m_RotationOrder: 4
    attribute: m_IsActive
    path: magic_eff_51002_moshen
    classID: 1
    script: {fileID: 0}
  m_PPtrCurves: []
  m_SampleRate: 60
  m_WrapMode: 0
  m_Bounds:
    m_Center: {x: 0, y: 0, z: 0}
    m_Extent: {x: 0, y: 0, z: 0}
  m_ClipBindingConstant:
    genericBindings:
    - path: 1957738234
      attribute: 1
      script: {fileID: 0}
      classID: 4
      customType: 0
      isPPtrCurve: 0
    - path: 1957738234
      attribute: 4
      script: {fileID: 0}
      classID: 4
      customType: 14
      isPPtrCurve: 0
    - path: 0
      attribute: 4
      script: {fileID: 0}
      classID: 4
      customType: 14
      isPPtrCurve: 0
    - path: 1957738234
      attribute: 1951967125
      script: {fileID: 0}
      classID: 23
      customType: 22
      isPPtrCurve: 0
    - path: 1957738234
      attribute: 2086281974
      script: {fileID: 0}
      classID: 1
      customType: 0
      isPPtrCurve: 0
    - path: 1957738234
      attribute: 1146660757
      script: {fileID: 0}
      classID: 23
      customType: 22
      isPPtrCurve: 0
    - path: 1957738234
      attribute: 1415096213
      script: {fileID: 0}
      classID: 23
      customType: 22
      isPPtrCurve: 0
    - path: 1957738234
      attribute: 1683531669
      script: {fileID: 0}
      classID: 23
      customType: 22
      isPPtrCurve: 0
    pptrCurveMapping: []
  m_AnimationClipSettings:
    serializedVersion: 2
    m_AdditiveReferencePoseClip: {fileID: 0}
    m_AdditiveReferencePoseTime: 0
    m_StartTime: 0
    m_StopTime: 3.6666667
    m_OrientationOffsetY: 0
    m_Level: 0
    m_CycleOffset: 0
    m_HasAdditiveReferencePose: 0
    m_LoopTime: 0
    m_LoopBlend: 0
    m_LoopBlendOrientation: 0
    m_LoopBlendPositionY: 0
    m_LoopBlendPositionXZ: 0
    m_KeepOriginalOrientation: 0
    m_KeepOriginalPositionY: 1
    m_KeepOriginalPositionXZ: 0
    m_HeightFromFeet: 0
    m_Mirror: 0
  m_EditorCurves:
  - curve:
      serializedVersion: 2
      m_Curve:
      - time: 0.5
        value: 0.1525356
        inSlope: 0
        outSlope: 0
        tangentMode: 0
      - time: 3
        value: 0.1525356
        inSlope: 0
        outSlope: 0
        tangentMode: 0
      - time: 3.6666667
        value: 0.1525356
        inSlope: 0
        outSlope: 0
        tangentMode: 0
      m_PreInfinity: 2
      m_PostInfinity: 2
      m_RotationOrder: 4
    attribute: material._OutlineColor.r
    path: magic_eff_51002_moshen
    classID: 23
    script: {fileID: 0}
  - curve:
      serializedVersion: 2
      m_Curve:
      - time: 0.5
        value: 0
        inSlope: 0
        outSlope: 0
        tangentMode: 0
      - time: 3
        value: 0
        inSlope: 0
        outSlope: 0
        tangentMode: 0
      - time: 3.6666667
        value: 0
        inSlope: 0
        outSlope: 0
        tangentMode: 0
      m_PreInfinity: 2
      m_PostInfinity: 2
      m_RotationOrder: 4
    attribute: material._OutlineColor.g
    path: magic_eff_51002_moshen
    classID: 23
    script: {fileID: 0}
  - curve:
      serializedVersion: 2
      m_Curve:
      - time: 0.5
        value: 0.4705882
        inSlope: 0
        outSlope: 0
        tangentMode: 0
      - time: 3
        value: 0.4705882
        inSlope: 0
        outSlope: 0
        tangentMode: 0
      - time: 3.6666667
        value: 0.4705882
        inSlope: 0
        outSlope: 0
        tangentMode: 0
      m_PreInfinity: 2
      m_PostInfinity: 2
      m_RotationOrder: 4
    attribute: material._OutlineColor.b
    path: magic_eff_51002_moshen
    classID: 23
    script: {fileID: 0}
  - curve:
      serializedVersion: 2
      m_Curve:
      - time: 0.016666668
        value: 0
        inSlope: 0
        outSlope: 0
        tangentMode: 0
      - time: 0.5
        value: 1
        inSlope: 0
        outSlope: 0
        tangentMode: 0
      - time: 3
        value: 1
        inSlope: 0
        outSlope: 0
        tangentMode: 0
      - time: 3.6666667
        value: 0
        inSlope: 0
        outSlope: 0
        tangentMode: 0
      m_PreInfinity: 2
      m_PostInfinity: 2
      m_RotationOrder: 4
    attribute: material._OutlineColor.a
    path: magic_eff_51002_moshen
    classID: 23
    script: {fileID: 0}
  - curve:
      serializedVersion: 2
      m_Curve:
      - time: 0.016666668
        value: 4.11
        inSlope: 0
        outSlope: 0
        tangentMode: 10
      - time: 1.1833333
        value: 4.11
        inSlope: 0.13749954
        outSlope: 0.13749954
        tangentMode: 10
      - time: 1.5833334
        value: 4.22
        inSlope: 0.02499982
        outSlope: 0.02499982
        tangentMode: 10
      - time: 2.25
        value: 4.07
        inSlope: -0.07249976
        outSlope: -0.07249976
        tangentMode: 10
      - time: 2.75
        value: 4.11
        inSlope: 0.03999996
        outSlope: 0.03999996
        tangentMode: 10
      - time: 3.6666667
        value: 4.11
        inSlope: 0
        outSlope: 0
        tangentMode: 10
      m_PreInfinity: 2
      m_PostInfinity: 2
      m_RotationOrder: 4
    attribute: m_LocalPosition.x
    path: magic_eff_51002_moshen
    classID: 4
    script: {fileID: 0}
  - curve:
      serializedVersion: 2
      m_Curve:
      - time: 0.016666668
        value: -6.55
        inSlope: 3.1225798
        outSlope: 3.1225798
        tangentMode: 0
      - time: 1.1833333
        value: -3.33
        inSlope: 1.8174999
        outSlope: 1.8174999
        tangentMode: 10
      - time: 1.5833334
        value: -2.98
        inSlope: 0.4299998
        outSlope: 0.4299998
        tangentMode: 10
      - time: 2.25
        value: -2.99
        inSlope: -0.12749988
        outSlope: -0.12749988
        tangentMode: 10
      - time: 2.75
        value: -3.11
        inSlope: -0.22363627
        outSlope: -0.22363627
        tangentMode: 10
      - time: 3.6666667
        value: -3.3
        inSlope: -0.20727277
        outSlope: -0.20727277
        tangentMode: 10
      m_PreInfinity: 2
      m_PostInfinity: 2
      m_RotationOrder: 4
    attribute: m_LocalPosition.y
    path: magic_eff_51002_moshen
    classID: 4
    script: {fileID: 0}
  - curve:
      serializedVersion: 2
      m_Curve:
      - time: 0.016666668
        value: -0
        inSlope: 0
        outSlope: 0
        tangentMode: 10
      - time: 1.1833333
        value: -0
        inSlope: -0.17499995
        outSlope: -0.17499995
        tangentMode: 10
      - time: 1.5833334
        value: -0.14
        inSlope: -0.03249994
        outSlope: -0.03249994
        tangentMode: 10
      - time: 2.25
        value: 0.05
        inSlope: 0.092500016
        outSlope: 0.092500016
        tangentMode: 10
      - time: 2.75
        value: -0
        inSlope: -0.05
        outSlope: -0.05
        tangentMode: 10
      - time: 3.6666667
        value: 0
        inSlope: 0
        outSlope: 0
        tangentMode: 10
      m_PreInfinity: 2
      m_PostInfinity: 2
      m_RotationOrder: 4
    attribute: m_LocalPosition.z
    path: magic_eff_51002_moshen
    classID: 4
    script: {fileID: 0}
  - curve:
      serializedVersion: 2
      m_Curve:
      - time: 1.1833333
        value: -0
        inSlope: 0
        outSlope: 0
        tangentMode: 10
      - time: 1.6666666
        value: 0
        inSlope: 0
        outSlope: 0
        tangentMode: 10
      - time: 2.3166666
        value: 0
        inSlope: 0
        outSlope: 0
        tangentMode: 10
      - time: 2.75
        value: -0
        inSlope: -0
        outSlope: -0
        tangentMode: 10
      m_PreInfinity: 2
      m_PostInfinity: 2
      m_RotationOrder: 4
    attribute: localEulerAnglesRaw.x
    path: magic_eff_51002_moshen
    classID: 4
    script: {fileID: 0}
  - curve:
      serializedVersion: 2
      m_Curve:
      - time: 1.1833333
        value: 0
        inSlope: 3.3786209
        outSlope: 3.3786209
        tangentMode: 10
      - time: 1.6666666
        value: 1.6330001
        inSlope: 0.103925705
        outSlope: 0.103925705
        tangentMode: 10
      - time: 2.3166666
        value: -0.42800003
        inSlope: -1.0915387
        outSlope: -1.0915387
        tangentMode: 10
      - time: 2.75
        value: 0
        inSlope: 0.98769224
        outSlope: 0.98769224
        tangentMode: 10
      m_PreInfinity: 2
      m_PostInfinity: 2
      m_RotationOrder: 4
    attribute: localEulerAnglesRaw.y
    path: magic_eff_51002_moshen
    classID: 4
    script: {fileID: 0}
  - curve:
      serializedVersion: 2
      m_Curve:
      - time: 1.1833333
        value: 0
        inSlope: 0
        outSlope: 0
        tangentMode: 10
      - time: 1.6666666
        value: 0
        inSlope: 0
        outSlope: 0
        tangentMode: 10
      - time: 2.3166666
        value: 0
        inSlope: 0
        outSlope: 0
        tangentMode: 10
      - time: 2.75
        value: 0
        inSlope: 0
        outSlope: 0
        tangentMode: 10
      m_PreInfinity: 2
      m_PostInfinity: 2
      m_RotationOrder: 4
    attribute: localEulerAnglesRaw.z
    path: magic_eff_51002_moshen
    classID: 4
    script: {fileID: 0}
  - curve:
      serializedVersion: 2
      m_Curve:
      - time: 0
        value: 0
        inSlope: Infinity
        outSlope: Infinity
        tangentMode: 31
      - time: 0.016666668
        value: 1
        inSlope: Infinity
        outSlope: Infinity
        tangentMode: 31
      m_PreInfinity: 2
      m_PostInfinity: 2
      m_RotationOrder: 4
    attribute: m_IsActive
    path: magic_eff_51002_moshen
    classID: 1
    script: {fileID: 0}
  - curve:
      serializedVersion: 2
      m_Curve:
      - time: 1.0166667
        value: 0
        inSlope: -7.734
        outSlope: -7.734
        tangentMode: 10
      - time: 1.5166667
        value: -3.867
        inSlope: 2.9571185
        outSlope: 2.9571185
        tangentMode: 10
      - time: 1.8
        value: 0
        inSlope: 13.648237
        outSlope: 13.648237
        tangentMode: 10
      m_PreInfinity: 2
      m_PostInfinity: 2
      m_RotationOrder: 4
    attribute: localEulerAnglesRaw.x
    path: 
    classID: 4
    script: {fileID: 0}
  - curve:
      serializedVersion: 2
      m_Curve:
      - time: 1.0166667
        value: 0
        inSlope: 2.012
        outSlope: 2.012
        tangentMode: 10
      - time: 1.5166667
        value: 1.006
        inSlope: -15.591061
        outSlope: -15.591061
        tangentMode: 10
      - time: 1.8
        value: -8.399
        inSlope: -33.194122
        outSlope: -33.194122
        tangentMode: 10
      m_PreInfinity: 2
      m_PostInfinity: 2
      m_RotationOrder: 4
    attribute: localEulerAnglesRaw.y
    path: 
    classID: 4
    script: {fileID: 0}
  - curve:
      serializedVersion: 2
      m_Curve:
      - time: 1.0166667
        value: 0
        inSlope: -6.058
        outSlope: -6.058
        tangentMode: 10
      - time: 1.5166667
        value: -3.029
        inSlope: 11.535119
        outSlope: 11.535119
        tangentMode: 10
      - time: 1.8
        value: 5.2240005
        inSlope: 29.128239
        outSlope: 29.128239
        tangentMode: 10
      m_PreInfinity: 2
      m_PostInfinity: 2
      m_RotationOrder: 4
    attribute: localEulerAnglesRaw.z
    path: 
    classID: 4
    script: {fileID: 0}
  m_EulerEditorCurves:
  - curve:
      serializedVersion: 2
      m_Curve: []
      m_PreInfinity: 2
      m_PostInfinity: 2
      m_RotationOrder: 4
    attribute: m_LocalEulerAngles.x
    path: magic_eff_51002_moshen
    classID: 4
    script: {fileID: 0}
  - curve:
      serializedVersion: 2
      m_Curve: []
      m_PreInfinity: 2
      m_PostInfinity: 2
      m_RotationOrder: 4
    attribute: m_LocalEulerAngles.y
    path: magic_eff_51002_moshen
    classID: 4
    script: {fileID: 0}
  - curve:
      serializedVersion: 2
      m_Curve: []
      m_PreInfinity: 2
      m_PostInfinity: 2
      m_RotationOrder: 4
    attribute: m_LocalEulerAngles.z
    path: magic_eff_51002_moshen
    classID: 4
    script: {fileID: 0}
  - curve:
      serializedVersion: 2
      m_Curve: []
      m_PreInfinity: 2
      m_PostInfinity: 2
      m_RotationOrder: 4
    attribute: m_LocalEulerAngles.x
    path: 
    classID: 4
    script: {fileID: 0}
  - curve:
      serializedVersion: 2
      m_Curve: []
      m_PreInfinity: 2
      m_PostInfinity: 2
      m_RotationOrder: 4
    attribute: m_LocalEulerAngles.y
    path: 
    classID: 4
    script: {fileID: 0}
  - curve:
      serializedVersion: 2
      m_Curve: []
      m_PreInfinity: 2
      m_PostInfinity: 2
      m_RotationOrder: 4
    attribute: m_LocalEulerAngles.z
    path: 
    classID: 4
    script: {fileID: 0}
  m_HasGenericRootTransform: 1
  m_HasMotionFloatCurves: 0
  m_GenerateMotionCurves: 0
  m_Events: []
