%YAML 1.1
%TAG !u! tag:unity3d.com,2011:
--- !u!90 &9000000
Avatar:
  m_ObjectHideFlags: 0
  m_CorrespondingSourceObject: {fileID: 0}
  m_PrefabInstance: {fileID: 0}
  m_PrefabAsset: {fileID: 0}
  m_Name: ms_zb04_0_0
  m_AvatarSize: 4184
  m_Avatar:
    serializedVersion: 3
    m_AvatarSkeleton:
      data:
        m_Node:
        - m_ParentId: -1
          m_AxesId: -1
        - m_ParentId: 0
          m_AxesId: -1
        - m_ParentId: 1
          m_AxesId: -1
        - m_ParentId: 2
          m_AxesId: -1
        - m_ParentId: 3
          m_AxesId: -1
        - m_ParentId: 4
          m_AxesId: -1
        - m_ParentId: 5
          m_AxesId: -1
        - m_ParentId: 6
          m_AxesId: -1
        - m_ParentId: 7
          m_AxesId: -1
        - m_ParentId: 8
          m_AxesId: -1
        - m_ParentId: 4
          m_AxesId: -1
        - m_ParentId: 10
          m_AxesId: -1
        - m_ParentId: 11
          m_AxesId: -1
        - m_ParentId: 12
          m_AxesId: -1
        - m_ParentId: 13
          m_AxesId: -1
        - m_ParentId: 14
          m_AxesId: -1
        - m_ParentId: 14
          m_AxesId: -1
        - m_ParentId: 4
          m_AxesId: -1
        - m_ParentId: 17
          m_AxesId: -1
        - m_ParentId: 18
          m_AxesId: -1
        - m_ParentId: 19
          m_AxesId: -1
        - m_ParentId: 20
          m_AxesId: -1
        - m_ParentId: 4
          m_AxesId: -1
        - m_ParentId: 22
          m_AxesId: -1
        - m_ParentId: 23
          m_AxesId: -1
        - m_ParentId: 24
          m_AxesId: -1
        - m_ParentId: 25
          m_AxesId: -1
        - m_ParentId: 26
          m_AxesId: -1
        - m_ParentId: 4
          m_AxesId: -1
        - m_ParentId: 0
          m_AxesId: -1
        - m_ParentId: 0
          m_AxesId: -1
        - m_ParentId: 0
          m_AxesId: -1
        - m_ParentId: 0
          m_AxesId: -1
        - m_ParentId: 0
          m_AxesId: -1
        m_ID: 0000000027dbd698d9f345bf206fe2957940a484ae14c5b73088a93ec37e0276a3647a6b4a9a51beb7d0a8b056a4e87385549892b7adebf97d2f8244127998ef3814fb5360d1b4dea302831c97e72c8ff858bb3fb78c48f87915d9d9b69702464d55a5a6eb2854e3af594626972df88b06bb7e4d5e8653a0b39c853a83316ebf2c36149b70889858
        m_AxesArray: []
    m_AvatarSkeletonPose:
      data:
        m_X:
        - t: {x: 0, y: 0, z: 0}
          q: {x: 0, y: 0, z: 0, w: 1}
          s: {x: 1, y: 1, z: 1}
        - t: {x: 0, y: 0, z: 7.965197e-10}
          q: {x: -0.7071068, y: 0, z: 0, w: 0.7071068}
          s: {x: 1, y: 1, z: 1}
        - t: {x: 0, y: 0.000000005560992, z: 0}
          q: {x: 0.7071068, y: 0, z: 0, w: 0.7071067}
          s: {x: 1, y: 1, z: 1}
        - t: {x: 0, y: 1.108808, z: -0.0000001192093}
          q: {x: 0, y: 0, z: 0, w: 1}
          s: {x: 1, y: 1, z: 1}
        - t: {x: 0, y: 0.3427009, z: 0.0000001192093}
          q: {x: 0, y: 0, z: 0, w: 1}
          s: {x: 1, y: 1, z: 1}
        - t: {x: -0.7073913, y: 0.5647761, z: 0}
          q: {x: -0.1350595, y: 0.9908375, z: -0.0000002316753, w: 0.0000002722026}
          s: {x: -1, y: -1, z: -1}
        - t: {x: -0.751278, y: 0, z: 0.00000005449556}
          q: {x: -0.000000002874843, y: 0.0000002384013, z: 0.01205797, w: 0.9999273}
          s: {x: 1, y: 1, z: 1}
        - t: {x: -0.5544143, y: 0, z: 0.00000007763072}
          q: {x: -0.000000001010818, y: -0.00000008715615, z: -0.01159701, w: 0.9999328}
          s: {x: 0.9999999, y: 0.9999999, z: 1}
        - t: {x: -0.4919394, y: 0.0000002384186, z: 0}
          q: {x: 0, y: -4.440892e-16, z: 0, w: 1}
          s: {x: 1, y: 1, z: 1}
        - t: {x: -0.05064273, y: -0.0001779262, z: -0.0000001192093}
          q: {x: -6.123234e-17, y: -6.123234e-17, z: -6.123234e-17, w: 1}
          s: {x: 1, y: 1, z: 1}
        - t: {x: -0.7413201, y: 0.7934878, z: 0}
          q: {x: -0.00423721, y: 0.9999911, z: -0.0000001321466, w: 0.0000002389807}
          s: {x: -1, y: -1, z: -1}
        - t: {x: -0.7492958, y: 0, z: 0.00000006522845}
          q: {x: -0.000000001010161, y: 0.0000002384165, z: 0.004236924, w: 0.9999911}
          s: {x: 1, y: 1, z: 1}
        - t: {x: -0.541844, y: 0.00001597404, z: 0.00000009687237}
          q: {x: 1.165341e-12, y: -0.00000007544453, z: 0.00001544633, w: 1}
          s: {x: 1, y: 1, z: 1}
        - t: {x: -0.5185618, y: 0.00000834465, z: -1.392664e-12}
          q: {x: 0, y: 0, z: 1.224647e-16, w: 1}
          s: {x: 1, y: 1, z: 1}
        - t: {x: -0.05000019, y: 0.0000001406703, z: 0.0000002384186}
          q: {x: 0.0000001331581, y: 6.123233e-17, z: -6.123235e-17, w: 1}
          s: {x: 1, y: 1, z: 1}
        - t: {x: -1.10747, y: -0.006529668, z: 0.0000002384186}
          q: {x: -0.7063419, y: 0.7078708, z: 0.000004921565, w: -0.000005247746}
          s: {x: -1, y: -1, z: -1}
        - t: {x: 0, y: -0.0000002384186, z: 0}
          q: {x: 0.00000003331664, y: -0.00000003593185, z: -0.0000001452254, w: 1}
          s: {x: -1, y: -1, z: -1}
        - t: {x: 0.7413201, y: 0.7934878, z: 0}
          q: {x: 0.000000400631, y: -0.000000001697466, z: 0.9999911, w: 0.004236944}
          s: {x: 1, y: 1, z: 1}
        - t: {x: -0.7492958, y: 0, z: 0.00000006522845}
          q: {x: -0.000000001010161, y: 0.0000002384165, z: 0.004236924, w: 0.9999911}
          s: {x: 1, y: 1, z: 1}
        - t: {x: -0.541844, y: 0.00001597404, z: 0.00000009687237}
          q: {x: 1.165341e-12, y: -0.00000007544453, z: 0.00001544633, w: 1}
          s: {x: 1, y: 1, z: 1}
        - t: {x: -0.5185618, y: 0.00000834465, z: -1.392664e-12}
          q: {x: 0, y: 0, z: 1.224647e-16, w: 1}
          s: {x: 1, y: 1, z: 1}
        - t: {x: -0.05000019, y: 0.0000001406703, z: 0.0000002384186}
          q: {x: 0.0000001331581, y: 6.123233e-17, z: -6.123235e-17, w: 1}
          s: {x: 1, y: 1, z: 1}
        - t: {x: 0.7073913, y: 0.5647761, z: 0}
          q: {x: 0.0000003975204, y: 0.0000002145935, z: 0.9908375, w: 0.1350594}
          s: {x: 1, y: 1, z: 1}
        - t: {x: -0.751278, y: 0, z: 0.00000005449556}
          q: {x: -0.000000002874843, y: 0.0000002384013, z: 0.01205797, w: 0.9999273}
          s: {x: 1, y: 1, z: 1}
        - t: {x: -0.5544143, y: 0, z: 0.00000007763072}
          q: {x: -0.000000001010818, y: -0.00000008715615, z: -0.01159701, w: 0.9999328}
          s: {x: 0.9999999, y: 0.9999999, z: 1}
        - t: {x: -0.4919394, y: 0.0000002384186, z: 0}
          q: {x: 0, y: -4.440892e-16, z: 0, w: 1}
          s: {x: 1, y: 1, z: 1}
        - t: {x: -0.05064273, y: -0.0001779262, z: -0.0000001192093}
          q: {x: -6.123234e-17, y: -6.123234e-17, z: -6.123234e-17, w: 1}
          s: {x: 1, y: 1, z: 1}
        - t: {x: -0.0000002384186, y: 0, z: 0.0000001192093}
          q: {x: 0.000000003531831, y: -0.00000009110052, z: 0.00000007450582, w: 1}
          s: {x: 1, y: 1, z: 1}
        - t: {x: 0.008510828, y: 2.188201, z: 0.1846821}
          q: {x: -0.0000002384186, y: 0, z: 0, w: 1}
          s: {x: 1, y: 1, z: 1}
        - t: {x: 0, y: 0, z: 0.00000004507771}
          q: {x: 0.00000008146034, y: 0, z: 0, w: 1}
          s: {x: 1, y: 1, z: 1}
        - t: {x: 0.008511066, y: 1.675124, z: 1.80462}
          q: {x: 0.00000008146034, y: 0, z: 0, w: 1}
          s: {x: 1, y: 1, z: 1}
        - t: {x: 0, y: 0, z: 0}
          q: {x: -0.7071068, y: 0.00000006181724, z: -2.702117e-15, w: 0.7071068}
          s: {x: 1, y: 1, z: 1}
        - t: {x: 0.6733694, y: 0.00000005960464, z: 0.00000007450581}
          q: {x: 0.0000000220025, y: 1.819113e-11, z: 0.00000005604757, w: 1}
          s: {x: 1, y: 1, z: 1}
        - t: {x: -0.6729999, y: 0, z: 0.00000007078052}
          q: {x: 0.00000002142042, y: -0.000000003718014, z: 6.846087e-11, w: 1}
          s: {x: 1, y: 1, z: 1}
    m_DefaultPose:
      data:
        m_X:
        - t: {x: 0, y: 0, z: 0}
          q: {x: 0, y: 0, z: 0, w: 1}
          s: {x: 1, y: 1, z: 1}
        - t: {x: 0, y: 0, z: 7.965197e-10}
          q: {x: -0.7071068, y: 0, z: 0, w: 0.7071068}
          s: {x: 1, y: 1, z: 1}
        - t: {x: 0, y: 0.000000005560992, z: 0}
          q: {x: 0.7071068, y: 0, z: 0, w: 0.7071067}
          s: {x: 1, y: 1, z: 1}
        - t: {x: 0, y: 1.108808, z: -0.0000001192093}
          q: {x: 0, y: 0, z: 0, w: 1}
          s: {x: 1, y: 1, z: 1}
        - t: {x: 0, y: 0.3427009, z: 0.0000001192093}
          q: {x: 0, y: 0, z: 0, w: 1}
          s: {x: 1, y: 1, z: 1}
        - t: {x: -0.7073913, y: 0.5647761, z: 0}
          q: {x: -0.1350595, y: 0.9908375, z: -0.0000002316753, w: 0.0000002722026}
          s: {x: -1, y: -1, z: -1}
        - t: {x: -0.751278, y: 0, z: 0.00000005449556}
          q: {x: -0.000000002874843, y: 0.0000002384013, z: 0.01205797, w: 0.9999273}
          s: {x: 1, y: 1, z: 1}
        - t: {x: -0.5544143, y: 0, z: 0.00000007763072}
          q: {x: -0.000000001010818, y: -0.00000008715615, z: -0.01159701, w: 0.9999328}
          s: {x: 0.9999999, y: 0.9999999, z: 1}
        - t: {x: -0.4919394, y: 0.0000002384186, z: 0}
          q: {x: 0, y: -4.440892e-16, z: 0, w: 1}
          s: {x: 1, y: 1, z: 1}
        - t: {x: -0.05064273, y: -0.0001779262, z: -0.0000001192093}
          q: {x: -6.123234e-17, y: -6.123234e-17, z: -6.123234e-17, w: 1}
          s: {x: 1, y: 1, z: 1}
        - t: {x: -0.7413201, y: 0.7934878, z: 0}
          q: {x: -0.00423721, y: 0.9999911, z: -0.0000001321466, w: 0.0000002389807}
          s: {x: -1, y: -1, z: -1}
        - t: {x: -0.7492958, y: 0, z: 0.00000006522845}
          q: {x: -0.000000001010161, y: 0.0000002384165, z: 0.004236924, w: 0.9999911}
          s: {x: 1, y: 1, z: 1}
        - t: {x: -0.541844, y: 0.00001597404, z: 0.00000009687237}
          q: {x: 1.165341e-12, y: -0.00000007544453, z: 0.00001544633, w: 1}
          s: {x: 1, y: 1, z: 1}
        - t: {x: -0.5185618, y: 0.00000834465, z: -1.392664e-12}
          q: {x: 0, y: 0, z: 1.224647e-16, w: 1}
          s: {x: 1, y: 1, z: 1}
        - t: {x: -0.05000019, y: 0.0000001406703, z: 0.0000002384186}
          q: {x: 0.0000001331581, y: 6.123233e-17, z: -6.123235e-17, w: 1}
          s: {x: 1, y: 1, z: 1}
        - t: {x: -1.10747, y: -0.006529668, z: 0.0000002384186}
          q: {x: -0.7063419, y: 0.7078708, z: 0.000004921565, w: -0.000005247746}
          s: {x: -1, y: -1, z: -1}
        - t: {x: 0, y: -0.0000002384186, z: 0}
          q: {x: 0.00000003331664, y: -0.00000003593185, z: -0.0000001452254, w: 1}
          s: {x: -1, y: -1, z: -1}
        - t: {x: 0.7413201, y: 0.7934878, z: 0}
          q: {x: 0.000000400631, y: -0.000000001697466, z: 0.9999911, w: 0.004236944}
          s: {x: 1, y: 1, z: 1}
        - t: {x: -0.7492958, y: 0, z: 0.00000006522845}
          q: {x: -0.000000001010161, y: 0.0000002384165, z: 0.004236924, w: 0.9999911}
          s: {x: 1, y: 1, z: 1}
        - t: {x: -0.541844, y: 0.00001597404, z: 0.00000009687237}
          q: {x: 1.165341e-12, y: -0.00000007544453, z: 0.00001544633, w: 1}
          s: {x: 1, y: 1, z: 1}
        - t: {x: -0.5185618, y: 0.00000834465, z: -1.392664e-12}
          q: {x: 0, y: 0, z: 1.224647e-16, w: 1}
          s: {x: 1, y: 1, z: 1}
        - t: {x: -0.05000019, y: 0.0000001406703, z: 0.0000002384186}
          q: {x: 0.0000001331581, y: 6.123233e-17, z: -6.123235e-17, w: 1}
          s: {x: 1, y: 1, z: 1}
        - t: {x: 0.7073913, y: 0.5647761, z: 0}
          q: {x: 0.0000003975204, y: 0.0000002145935, z: 0.9908375, w: 0.1350594}
          s: {x: 1, y: 1, z: 1}
        - t: {x: -0.751278, y: 0, z: 0.00000005449556}
          q: {x: -0.000000002874843, y: 0.0000002384013, z: 0.01205797, w: 0.9999273}
          s: {x: 1, y: 1, z: 1}
        - t: {x: -0.5544143, y: 0, z: 0.00000007763072}
          q: {x: -0.000000001010818, y: -0.00000008715615, z: -0.01159701, w: 0.9999328}
          s: {x: 0.9999999, y: 0.9999999, z: 1}
        - t: {x: -0.4919394, y: 0.0000002384186, z: 0}
          q: {x: 0, y: -4.440892e-16, z: 0, w: 1}
          s: {x: 1, y: 1, z: 1}
        - t: {x: -0.05064273, y: -0.0001779262, z: -0.0000001192093}
          q: {x: -6.123234e-17, y: -6.123234e-17, z: -6.123234e-17, w: 1}
          s: {x: 1, y: 1, z: 1}
        - t: {x: -0.0000002384186, y: 0, z: 0.0000001192093}
          q: {x: 0.000000003531831, y: -0.00000009110052, z: 0.00000007450582, w: 1}
          s: {x: 1, y: 1, z: 1}
        - t: {x: 0.008510828, y: 2.188201, z: 0.1846821}
          q: {x: -0.0000002384186, y: 0, z: 0, w: 1}
          s: {x: 1, y: 1, z: 1}
        - t: {x: 0, y: 0, z: 0.00000004507771}
          q: {x: 0.00000008146034, y: 0, z: 0, w: 1}
          s: {x: 1, y: 1, z: 1}
        - t: {x: 0.008511066, y: 1.675124, z: 1.80462}
          q: {x: 0.00000008146034, y: 0, z: 0, w: 1}
          s: {x: 1, y: 1, z: 1}
        - t: {x: 0, y: 0, z: 0}
          q: {x: -0.7071068, y: 0.00000006181724, z: -2.702117e-15, w: 0.7071068}
          s: {x: 1, y: 1, z: 1}
        - t: {x: 0.6733694, y: 0.00000005960464, z: 0.00000007450581}
          q: {x: 0.0000000220025, y: 1.819113e-11, z: 0.00000005604757, w: 1}
          s: {x: 1, y: 1, z: 1}
        - t: {x: -0.6729999, y: 0, z: 0.00000007078052}
          q: {x: 0.00000002142042, y: -0.000000003718014, z: 6.846087e-11, w: 1}
          s: {x: 1, y: 1, z: 1}
    m_SkeletonNameIDArray: 0000000027dbd6983d6cbca620f66e7fb6c669082bde225ebdee252907bf2cb0884b46c06b7c91c3321a4f59d7938839a42a482e1e7b41b7fd4c96b4918f2bc7c41506a0e51b53375f4a5aaec97a5dd96aef3947d12d985afcdf3e30468e37a9d0be30de41a38f4e471d9f2d9b5ad19aa259c1075e8653a0b39c853a83316ebf2c36149b70889858
    m_Human:
      data:
        serializedVersion: 2
        m_RootX:
          t: {x: 0, y: 0, z: 0}
          q: {x: 0, y: 0, z: 0, w: 1}
          s: {x: 1, y: 1, z: 1}
        m_Skeleton:
          data:
            m_Node: []
            m_ID: 
            m_AxesArray: []
        m_SkeletonPose:
          data:
            m_X: []
        m_LeftHand:
          data:
            m_HandBoneIndex: ffffffffffffffffffffffffffffffffffffffffffffffffffffffffffffffffffffffffffffffffffffffffffffffffffffffffffffffffffffffff
        m_RightHand:
          data:
            m_HandBoneIndex: ffffffffffffffffffffffffffffffffffffffffffffffffffffffffffffffffffffffffffffffffffffffffffffffffffffffffffffffffffffffff
        m_HumanBoneIndex: ffffffffffffffffffffffffffffffffffffffffffffffffffffffffffffffffffffffffffffffffffffffffffffffffffffffffffffffffffffffffffffffffffffffffffffffffffffffffffffffffffffffffffffffffffffffffffffffffffffffff
        m_HumanBoneMass:
        - 0.1454546
        - 0.1212121
        - 0.1212121
        - 0.04848485
        - 0.04848485
        - 0.009696971
        - 0.009696971
        - 0.03030303
        - 0.1454546
        - 0.1454546
        - 0.01212121
        - 0.04848485
        - 0.006060607
        - 0.006060607
        - 0.02424243
        - 0.02424243
        - 0.01818182
        - 0.01818182
        - 0.006060607
        - 0.006060607
        - 0.002424243
        - 0.002424243
        - 0
        - 0
        - 0
        m_Scale: 1
        m_ArmTwist: 0.5
        m_ForeArmTwist: 0.5
        m_UpperLegTwist: 0.5
        m_LegTwist: 0.5
        m_ArmStretch: 0.05
        m_LegStretch: 0.05
        m_FeetSpacing: 0
        m_HasLeftHand: 0
        m_HasRightHand: 0
        m_HasTDoF: 0
    m_HumanSkeletonIndexArray: 
    m_HumanSkeletonReverseIndexArray: 
    m_RootMotionBoneIndex: -1
    m_RootMotionBoneX:
      t: {x: 0, y: 0, z: 0}
      q: {x: 0, y: 0, z: 0, w: 1}
      s: {x: 1, y: 1, z: 1}
    m_RootMotionSkeleton:
      data:
        m_Node: []
        m_ID: 
        m_AxesArray: []
    m_RootMotionSkeletonPose:
      data:
        m_X: []
    m_RootMotionSkeletonIndexArray: 
  m_TOS:
    1408963640: Dummy016/Bip001/Dummy018/Dummy019/Bone010/Bone009/Bone011/Bone012/Dummy022/LeftWeapon
    3209032665: Dummy016/Bip001
    3083146414: Dummy016/Bip001/Dummy018/Dummy019/Bone014
    1174575030: Dummy016/Bip001/Dummy018/Dummy019/Bone005/Bone006
    1051297840: Dummy016/Bip001/Dummy018/Dummy019/Bone014/Bone015
    1944626262: Dummy016/Bip001/Dummy018/Dummy019/Bone010/Bone009
    4019747090: Dummy016/Bip001/Dummy018/Dummy019/Bone010/Bone009/Bone011/Bone012/Dummy022/Bone017
    2564217639: Dummy016
    2795853133: Dummy016/Bip001/Dummy018/Dummy019/Bone005/Bone006/Bone007
    1979875011: Dummy016/Bip001/Dummy018/Dummy019/Bone014/Bone015/Bone016
    3193018954: Dummy016/Bip001/Dummy018/Dummy019/Bone014/Bone015/Bone016/Bone013/Dummy023
    3211669891: Ms_zb04_0
    2963853495: Dummy016/Bip001/Dummy018/Dummy019/Bone010
    1149382525: Dummy016/Bip001/Dummy018/Dummy019/Bone010/Bone009/Bone011/Bone012/Dummy022
    642144687: Dummy016/Bip001/Dummy018/Dummy019/Bone005/Bone006/Bone007/Bone008/Dummy021
    4165504183: Dummy016/Bip001/Dummy018/Dummy019/Bone001/Bone002/Bone003/Bone004/Dummy020
    3654882681: Dummy016/Bip001/Dummy018/Dummy019/Bone005
    2514644768: Dummy016/Bip001/Dummy018
    2225356921: Dummy016/Bip001/Dummy018/Dummy019
    2601793068: RightFoot
    2348297623: Dummy016/Bip001/Dummy018/Dummy019/Bone005/Bone006/Bone007/Bone008/Dummy021/RightWeapon
    2402084759: Dummy016/Bip001/Dummy018/Dummy019/Bone001/Bone002/Bone003
    1803183267: Dummy016/Bip001/Dummy018/Dummy019/Bone014/Bone015/Bone016/Bone013
    3813943531: Dummy016/Bip001/Dummy018/Dummy019/Bone005/Bone006/Bone007/Bone008
    0: 
    981834931: Chest
    4192972215: Dummy016/Bip001/Dummy018/Dummy019/Bone010/Bone009/Bone011/Bone012
    1486391408: LeftFoot
    2689828446: Ground
    1069242616: Dummy016/Bip001/Dummy018/Dummy019/Bone001/Bone002/Bone003/Bone004
    1300151046: Dummy016/Bip001/Dummy018/Dummy019/Head
    2459456645: Dummy016/Bip001/Dummy018/Dummy019/Bone010/Bone009/Bone011
    3736392032: Dummy016/Bip001/Dummy018/Dummy019/Bone001
    478347939: Dummy016/Bip001/Dummy018/Dummy019/Bone001/Bone002
  m_HumanDescription:
    serializedVersion: 3
    m_Human: []
    m_Skeleton: []
    m_ArmTwist: 0.5
    m_ForeArmTwist: 0.5
    m_UpperLegTwist: 0.5
    m_LegTwist: 0.5
    m_ArmStretch: 0.05
    m_LegStretch: 0.05
    m_FeetSpacing: 0
    m_GlobalScale: 1
    m_RootMotionBoneName: 
    m_HasTranslationDoF: 0
    m_HasExtraRoot: 0
    m_SkeletonHasParents: 1
