%YAML 1.1
%TAG !u! tag:unity3d.com,2011:
--- !u!74 &7400000
AnimationClip:
  m_ObjectHideFlags: 0
  m_PrefabParentObject: {fileID: 0}
  m_PrefabInternal: {fileID: 0}
  m_Name: ui_eff_1158_tanchu
  serializedVersion: 6
  m_Legacy: 0
  m_Compressed: 0
  m_UseHighQualityCurve: 1
  m_RotationCurves: []
  m_CompressedRotationCurves: []
  m_EulerCurves: []
  m_PositionCurves:
  - curve:
      serializedVersion: 2
      m_Curve:
      - time: 0
        value: {x: 0, y: 0, z: 0}
        inSlope: {x: 0, y: 250, z: 0}
        outSlope: {x: 0, y: 250, z: 0}
        tangentMode: 0
      - time: 0.2
        value: {x: 0, y: 50, z: 0}
        inSlope: {x: 0, y: 250, z: 0}
        outSlope: {x: 0, y: -0, z: 0}
        tangentMode: 0
      - time: 1
        value: {x: 0, y: 50, z: 0}
        inSlope: {x: 0, y: 0, z: 0}
        outSlope: {x: 0, y: -299.99997, z: 0}
        tangentMode: 0
      - time: 1.3333334
        value: {x: 0, y: -50, z: 0}
        inSlope: {x: 0, y: -299.99997, z: 0}
        outSlope: {x: 0, y: -299.99997, z: 0}
        tangentMode: 0
      m_PreInfinity: 2
      m_PostInfinity: 2
      m_RotationOrder: 4
    path: 1
  - curve:
      serializedVersion: 2
      m_Curve:
      - time: 0
        value: {x: 0, y: 0, z: 0}
        inSlope: {x: 0, y: 250, z: 0}
        outSlope: {x: 0, y: 250, z: 0}
        tangentMode: 0
      - time: 0.2
        value: {x: 0, y: 50, z: 0}
        inSlope: {x: 0, y: 250, z: 0}
        outSlope: {x: 0, y: 250, z: 0}
        tangentMode: 0
      m_PreInfinity: 2
      m_PostInfinity: 2
      m_RotationOrder: 4
    path: 
  m_ScaleCurves:
  - curve:
      serializedVersion: 2
      m_Curve:
      - time: 0
        value: {x: 0, y: 0, z: 1}
        inSlope: {x: 5, y: 5, z: 0}
        outSlope: {x: 5, y: 5, z: 0}
        tangentMode: 0
      - time: 0.2
        value: {x: 1, y: 1, z: 1}
        inSlope: {x: 7.7500005, y: 7.7500005, z: 0}
        outSlope: {x: 7.7500005, y: 7.7500005, z: 0}
        tangentMode: 0
      - time: 0.23333333
        value: {x: 1.35, y: 1.35, z: 1}
        inSlope: {x: 2.6250007, y: 2.6250007, z: 0}
        outSlope: {x: 2.6250007, y: 2.6250007, z: 0}
        tangentMode: 0
      - time: 0.3
        value: {x: 1, y: 1, z: 1}
        inSlope: {x: -5.2499995, y: -5.2499995, z: 0}
        outSlope: {x: 3.000001, y: 3.000001, z: -0}
        tangentMode: 0
      - time: 0.33333334
        value: {x: 1.1, y: 1.1, z: 1}
        inSlope: {x: 3.000001, y: 3.000001, z: 0}
        outSlope: {x: -3.000001, y: -3.000001, z: -0}
        tangentMode: 0
      - time: 0.36666667
        value: {x: 1, y: 1, z: 1}
        inSlope: {x: -3.000001, y: -3.000001, z: 0}
        outSlope: {x: -0, y: -0, z: -0}
        tangentMode: 0
      - time: 1
        value: {x: 1, y: 1, z: 1}
        inSlope: {x: 0, y: 0, z: 0}
        outSlope: {x: -1.4999999, y: -0, z: -0}
        tangentMode: 0
      - time: 1.3333334
        value: {x: 0.5, y: 1, z: 1}
        inSlope: {x: -1.4999999, y: 0, z: 0}
        outSlope: {x: -1.4999999, y: 0, z: 0}
        tangentMode: 0
      m_PreInfinity: 2
      m_PostInfinity: 2
      m_RotationOrder: 4
    path: 1
  m_FloatCurves:
  - curve:
      serializedVersion: 2
      m_Curve:
      - time: 0.16666667
        value: 0
        inSlope: 30.000002
        outSlope: 30.000002
        tangentMode: 10
      - time: 0.2
        value: 1
        inSlope: 12.509806
        outSlope: 12.509806
        tangentMode: 10
      - time: 0.3
        value: 0.5019608
        inSlope: -4.9803915
        outSlope: -0
        tangentMode: 21
      - time: 1
        value: 0.5019608
        inSlope: 0
        outSlope: -0
        tangentMode: 21
      - time: 1.3333334
        value: 0.5019608
        inSlope: 0
        outSlope: 0
        tangentMode: 10
      m_PreInfinity: 2
      m_PostInfinity: 2
      m_RotationOrder: 4
    attribute: material._TintColor.r
    path: 1/yansetu
    classID: 23
    script: {fileID: 0}
  - curve:
      serializedVersion: 2
      m_Curve:
      - time: 0.16666667
        value: 0
        inSlope: 30.000002
        outSlope: 30.000002
        tangentMode: 10
      - time: 0.2
        value: 1
        inSlope: 12.509806
        outSlope: 12.509806
        tangentMode: 10
      - time: 0.3
        value: 0.5019608
        inSlope: -4.9803915
        outSlope: -0
        tangentMode: 21
      - time: 1
        value: 0.5019608
        inSlope: 0
        outSlope: -0
        tangentMode: 21
      - time: 1.3333334
        value: 0.5019608
        inSlope: 0
        outSlope: 0
        tangentMode: 10
      m_PreInfinity: 2
      m_PostInfinity: 2
      m_RotationOrder: 4
    attribute: material._TintColor.g
    path: 1/yansetu
    classID: 23
    script: {fileID: 0}
  - curve:
      serializedVersion: 2
      m_Curve:
      - time: 0.16666667
        value: 0
        inSlope: 30.000002
        outSlope: 30.000002
        tangentMode: 10
      - time: 0.2
        value: 1
        inSlope: 12.509806
        outSlope: 12.509806
        tangentMode: 10
      - time: 0.3
        value: 0.5019608
        inSlope: -4.9803915
        outSlope: -0
        tangentMode: 21
      - time: 1
        value: 0.5019608
        inSlope: 0
        outSlope: -0
        tangentMode: 21
      - time: 1.3333334
        value: 0.5019608
        inSlope: 0
        outSlope: 0
        tangentMode: 10
      m_PreInfinity: 2
      m_PostInfinity: 2
      m_RotationOrder: 4
    attribute: material._TintColor.b
    path: 1/yansetu
    classID: 23
    script: {fileID: 0}
  - curve:
      serializedVersion: 2
      m_Curve:
      - time: 0.16666667
        value: 0
        inSlope: 30.000002
        outSlope: 30.000002
        tangentMode: 10
      - time: 0.2
        value: 1
        inSlope: 12.509806
        outSlope: 12.509806
        tangentMode: 10
      - time: 0.3
        value: 0.5019608
        inSlope: -4.9803915
        outSlope: -0
        tangentMode: 21
      - time: 1
        value: 0.5019608
        inSlope: 0
        outSlope: -1.5058823
        tangentMode: 21
      - time: 1.3333334
        value: 0
        inSlope: -1.5058823
        outSlope: -1.5058823
        tangentMode: 10
      m_PreInfinity: 2
      m_PostInfinity: 2
      m_RotationOrder: 4
    attribute: material._TintColor.a
    path: 1/yansetu
    classID: 23
    script: {fileID: 0}
  m_PPtrCurves: []
  m_SampleRate: 30
  m_WrapMode: 0
  m_Bounds:
    m_Center: {x: 0, y: 0, z: 0}
    m_Extent: {x: 0, y: 0, z: 0}
  m_ClipBindingConstant:
    genericBindings:
    - path: 2212294583
      attribute: 1
      script: {fileID: 0}
      classID: 4
      customType: 0
      isPPtrCurve: 0
    - path: 0
      attribute: 1
      script: {fileID: 0}
      classID: 4
      customType: 0
      isPPtrCurve: 0
    - path: 2212294583
      attribute: 3
      script: {fileID: 0}
      classID: 4
      customType: 0
      isPPtrCurve: 0
    - path: 1071976214
      attribute: 1090582214
      script: {fileID: 0}
      classID: 23
      customType: 22
      isPPtrCurve: 0
    - path: 1071976214
      attribute: 1359017670
      script: {fileID: 0}
      classID: 23
      customType: 22
      isPPtrCurve: 0
    - path: 1071976214
      attribute: 1627453126
      script: {fileID: 0}
      classID: 23
      customType: 22
      isPPtrCurve: 0
    - path: 1071976214
      attribute: 1895888582
      script: {fileID: 0}
      classID: 23
      customType: 22
      isPPtrCurve: 0
    pptrCurveMapping: []
  m_AnimationClipSettings:
    serializedVersion: 2
    m_AdditiveReferencePoseClip: {fileID: 0}
    m_AdditiveReferencePoseTime: 0
    m_StartTime: 0
    m_StopTime: 1.3333334
    m_OrientationOffsetY: 0
    m_Level: 0
    m_CycleOffset: 0
    m_HasAdditiveReferencePose: 0
    m_LoopTime: 0
    m_LoopBlend: 0
    m_LoopBlendOrientation: 0
    m_LoopBlendPositionY: 0
    m_LoopBlendPositionXZ: 0
    m_KeepOriginalOrientation: 0
    m_KeepOriginalPositionY: 1
    m_KeepOriginalPositionXZ: 0
    m_HeightFromFeet: 0
    m_Mirror: 0
  m_EditorCurves:
  - curve:
      serializedVersion: 2
      m_Curve:
      - time: 0
        value: 0
        inSlope: 5
        outSlope: 5
        tangentMode: 10
      - time: 0.2
        value: 1
        inSlope: 7.7500005
        outSlope: 7.7500005
        tangentMode: 10
      - time: 0.23333333
        value: 1.35
        inSlope: 2.6250007
        outSlope: 2.6250007
        tangentMode: 10
      - time: 0.3
        value: 1
        inSlope: -5.2499995
        outSlope: 3.000001
        tangentMode: 21
      - time: 0.33333334
        value: 1.1
        inSlope: 3.000001
        outSlope: -3.000001
        tangentMode: 21
      - time: 0.36666667
        value: 1
        inSlope: -3.000001
        outSlope: -0
        tangentMode: 21
      - time: 1
        value: 1
        inSlope: 0
        outSlope: -1.4999999
        tangentMode: 21
      - time: 1.3333334
        value: 0.5
        inSlope: -1.4999999
        outSlope: -1.4999999
        tangentMode: 10
      m_PreInfinity: 2
      m_PostInfinity: 2
      m_RotationOrder: 4
    attribute: m_LocalScale.x
    path: 1
    classID: 4
    script: {fileID: 0}
  - curve:
      serializedVersion: 2
      m_Curve:
      - time: 0
        value: 0
        inSlope: 5
        outSlope: 5
        tangentMode: 10
      - time: 0.2
        value: 1
        inSlope: 7.7500005
        outSlope: 7.7500005
        tangentMode: 10
      - time: 0.23333333
        value: 1.35
        inSlope: 2.6250007
        outSlope: 2.6250007
        tangentMode: 10
      - time: 0.3
        value: 1
        inSlope: -5.2499995
        outSlope: 3.000001
        tangentMode: 21
      - time: 0.33333334
        value: 1.1
        inSlope: 3.000001
        outSlope: -3.000001
        tangentMode: 21
      - time: 0.36666667
        value: 1
        inSlope: -3.000001
        outSlope: -0
        tangentMode: 21
      - time: 1
        value: 1
        inSlope: 0
        outSlope: -0
        tangentMode: 21
      - time: 1.3333334
        value: 1
        inSlope: 0
        outSlope: 0
        tangentMode: 10
      m_PreInfinity: 2
      m_PostInfinity: 2
      m_RotationOrder: 4
    attribute: m_LocalScale.y
    path: 1
    classID: 4
    script: {fileID: 0}
  - curve:
      serializedVersion: 2
      m_Curve:
      - time: 0
        value: 1
        inSlope: 0
        outSlope: 0
        tangentMode: 10
      - time: 0.2
        value: 1
        inSlope: 0
        outSlope: 0
        tangentMode: 10
      - time: 0.23333333
        value: 1
        inSlope: 0
        outSlope: 0
        tangentMode: 10
      - time: 0.3
        value: 1
        inSlope: 0
        outSlope: -0
        tangentMode: 21
      - time: 0.33333334
        value: 1
        inSlope: 0
        outSlope: -0
        tangentMode: 21
      - time: 0.36666667
        value: 1
        inSlope: 0
        outSlope: -0
        tangentMode: 21
      - time: 1
        value: 1
        inSlope: 0
        outSlope: -0
        tangentMode: 21
      - time: 1.3333334
        value: 1
        inSlope: 0
        outSlope: 0
        tangentMode: 10
      m_PreInfinity: 2
      m_PostInfinity: 2
      m_RotationOrder: 4
    attribute: m_LocalScale.z
    path: 1
    classID: 4
    script: {fileID: 0}
  - curve:
      serializedVersion: 2
      m_Curve:
      - time: 0
        value: 0
        inSlope: 0
        outSlope: 0
        tangentMode: 10
      - time: 0.2
        value: 0
        inSlope: 0
        outSlope: 0
        tangentMode: 10
      - time: 1
        value: 0
        inSlope: 0
        outSlope: 0
        tangentMode: 10
      - time: 1.3333334
        value: 0
        inSlope: 0
        outSlope: 0
        tangentMode: 10
      m_PreInfinity: 2
      m_PostInfinity: 2
      m_RotationOrder: 4
    attribute: m_LocalPosition.x
    path: 1
    classID: 4
    script: {fileID: 0}
  - curve:
      serializedVersion: 2
      m_Curve:
      - time: 0
        value: 0
        inSlope: 250
        outSlope: 250
        tangentMode: 10
      - time: 0.2
        value: 50
        inSlope: 250
        outSlope: -0
        tangentMode: 21
      - time: 1
        value: 50
        inSlope: 0
        outSlope: -299.99997
        tangentMode: 21
      - time: 1.3333334
        value: -50
        inSlope: -299.99997
        outSlope: -299.99997
        tangentMode: 10
      m_PreInfinity: 2
      m_PostInfinity: 2
      m_RotationOrder: 4
    attribute: m_LocalPosition.y
    path: 1
    classID: 4
    script: {fileID: 0}
  - curve:
      serializedVersion: 2
      m_Curve:
      - time: 0
        value: 0
        inSlope: 0
        outSlope: 0
        tangentMode: 10
      - time: 0.2
        value: 0
        inSlope: 0
        outSlope: 0
        tangentMode: 10
      - time: 1
        value: 0
        inSlope: 0
        outSlope: 0
        tangentMode: 10
      - time: 1.3333334
        value: 0
        inSlope: 0
        outSlope: 0
        tangentMode: 10
      m_PreInfinity: 2
      m_PostInfinity: 2
      m_RotationOrder: 4
    attribute: m_LocalPosition.z
    path: 1
    classID: 4
    script: {fileID: 0}
  - curve:
      serializedVersion: 2
      m_Curve:
      - time: 0
        value: 0
        inSlope: 0
        outSlope: 0
        tangentMode: 10
      - time: 0.2
        value: 0
        inSlope: 0
        outSlope: 0
        tangentMode: 10
      m_PreInfinity: 2
      m_PostInfinity: 2
      m_RotationOrder: 4
    attribute: m_LocalPosition.x
    path: 
    classID: 4
    script: {fileID: 0}
  - curve:
      serializedVersion: 2
      m_Curve:
      - time: 0
        value: 0
        inSlope: 250
        outSlope: 250
        tangentMode: 10
      - time: 0.2
        value: 50
        inSlope: 250
        outSlope: 250
        tangentMode: 10
      m_PreInfinity: 2
      m_PostInfinity: 2
      m_RotationOrder: 4
    attribute: m_LocalPosition.y
    path: 
    classID: 4
    script: {fileID: 0}
  - curve:
      serializedVersion: 2
      m_Curve:
      - time: 0
        value: 0
        inSlope: 0
        outSlope: 0
        tangentMode: 10
      - time: 0.2
        value: 0
        inSlope: 0
        outSlope: 0
        tangentMode: 10
      m_PreInfinity: 2
      m_PostInfinity: 2
      m_RotationOrder: 4
    attribute: m_LocalPosition.z
    path: 
    classID: 4
    script: {fileID: 0}
  - curve:
      serializedVersion: 2
      m_Curve:
      - time: 0.16666667
        value: 0
        inSlope: 30.000002
        outSlope: 30.000002
        tangentMode: 10
      - time: 0.2
        value: 1
        inSlope: 12.509806
        outSlope: 12.509806
        tangentMode: 10
      - time: 0.3
        value: 0.5019608
        inSlope: -4.9803915
        outSlope: -0
        tangentMode: 21
      - time: 1
        value: 0.5019608
        inSlope: 0
        outSlope: -0
        tangentMode: 21
      - time: 1.3333334
        value: 0.5019608
        inSlope: 0
        outSlope: 0
        tangentMode: 10
      m_PreInfinity: 2
      m_PostInfinity: 2
      m_RotationOrder: 4
    attribute: material._TintColor.r
    path: 1/yansetu
    classID: 23
    script: {fileID: 0}
  - curve:
      serializedVersion: 2
      m_Curve:
      - time: 0.16666667
        value: 0
        inSlope: 30.000002
        outSlope: 30.000002
        tangentMode: 10
      - time: 0.2
        value: 1
        inSlope: 12.509806
        outSlope: 12.509806
        tangentMode: 10
      - time: 0.3
        value: 0.5019608
        inSlope: -4.9803915
        outSlope: -0
        tangentMode: 21
      - time: 1
        value: 0.5019608
        inSlope: 0
        outSlope: -0
        tangentMode: 21
      - time: 1.3333334
        value: 0.5019608
        inSlope: 0
        outSlope: 0
        tangentMode: 10
      m_PreInfinity: 2
      m_PostInfinity: 2
      m_RotationOrder: 4
    attribute: material._TintColor.g
    path: 1/yansetu
    classID: 23
    script: {fileID: 0}
  - curve:
      serializedVersion: 2
      m_Curve:
      - time: 0.16666667
        value: 0
        inSlope: 30.000002
        outSlope: 30.000002
        tangentMode: 10
      - time: 0.2
        value: 1
        inSlope: 12.509806
        outSlope: 12.509806
        tangentMode: 10
      - time: 0.3
        value: 0.5019608
        inSlope: -4.9803915
        outSlope: -0
        tangentMode: 21
      - time: 1
        value: 0.5019608
        inSlope: 0
        outSlope: -0
        tangentMode: 21
      - time: 1.3333334
        value: 0.5019608
        inSlope: 0
        outSlope: 0
        tangentMode: 10
      m_PreInfinity: 2
      m_PostInfinity: 2
      m_RotationOrder: 4
    attribute: material._TintColor.b
    path: 1/yansetu
    classID: 23
    script: {fileID: 0}
  - curve:
      serializedVersion: 2
      m_Curve:
      - time: 0.16666667
        value: 0
        inSlope: 30.000002
        outSlope: 30.000002
        tangentMode: 10
      - time: 0.2
        value: 1
        inSlope: 12.509806
        outSlope: 12.509806
        tangentMode: 10
      - time: 0.3
        value: 0.5019608
        inSlope: -4.9803915
        outSlope: -0
        tangentMode: 21
      - time: 1
        value: 0.5019608
        inSlope: 0
        outSlope: -1.5058823
        tangentMode: 21
      - time: 1.3333334
        value: 0
        inSlope: -1.5058823
        outSlope: -1.5058823
        tangentMode: 10
      m_PreInfinity: 2
      m_PostInfinity: 2
      m_RotationOrder: 4
    attribute: material._TintColor.a
    path: 1/yansetu
    classID: 23
    script: {fileID: 0}
  m_EulerEditorCurves: []
  m_HasGenericRootTransform: 1
  m_HasMotionFloatCurves: 0
  m_GenerateMotionCurves: 0
  m_Events: []
