%YAML 1.1
%TAG !u! tag:unity3d.com,2011:
--- !u!21 &2100000
Material:
  serializedVersion: 6
  m_ObjectHideFlags: 0
  m_CorrespondingSourceObject: {fileID: 0}
  m_PrefabInstance: {fileID: 0}
  m_PrefabAsset: {fileID: 0}
  m_Name: ui_Fire_wgb7
  m_Shader: {fileID: 202, guid: 0000000000000000f000000000000000, type: 0}
  m_ShaderKeywords: 
  m_LightmapFlags: 4
  m_EnableInstancingVariants: 1
  m_DoubleSidedGI: 0
  m_CustomRenderQueue: -1
  stringTagMap: {}
  disabledShaderPasses: []
  m_SavedProperties:
    serializedVersion: 3
    m_TexEnvs:
    - _DetailTex:
        m_Texture: {fileID: 0}
        m_Scale: {x: 1, y: 1}
        m_Offset: {x: 0, y: 0}
    - _MainTex:
        m_Texture: {fileID: 2800000, guid: d513279cd1a19434eb3e224006a45da6, type: 3}
        m_Scale: {x: 1, y: 1}
        m_Offset: {x: 0, y: -0.01}
    m_Floats:
    - _AlphaCon: 1
    - _Alpha_Intensity: 1
    - _Brightness: 1.12
    - _ColorMask: 15
    - _Conster: 1
    - _Contrast: 11.9
    - _Cutoff: 0.5
    - _Depth: 0
    - _Desaturate: 0
    - _Displacement_x_intensity: 0
    - _Displacement_y_intensity: 0
    - _Disslove: 0
    - _FrenselValue: 1
    - _FresnelBrightness: 1
    - _FresnelMultiplyAlpha: 0
    - _Inst: 2
    - _InvFade: 1
    - _MMultiplier: 1.8
    - _MainTexBrightness: 1.12
    - _MainTexContrast: 2.7
    - _MainTexPannerX: 0
    - _MainTexPannerY: 0
    - _MaskTexDynmatic: 0
    - _MaskTexPannerX: 0
    - _MaskTexPannerY: 0
    - _Mesh_depth: 0
    - _Mesh_depth_Intensity: 0
    - _Multi: 4.85
    - _N_BY_KD: 0.01
    - _N_BY_QD: 0
    - _N_mask: 2.48
    - _NormalTexPannerX: 0
    - _NormalTexPannerY: 0
    - _Particlesormesh: 0
    - _RefractionIntensity: 0
    - _Scroll2X: 0
    - _Scroll2Y: 0
    - _ScrollX: 0
    - _ScrollY: 0
    - _Stencil: 0
    - _StencilComp: 8
    - _StencilOp: 0
    - _StencilReadMask: 255
    - _StencilWriteMask: 255
    - _TurbulencePower: 0
    - _TurbulenceTexPannerX: 0
    - _TurbulenceTexPannerY: 0
    - _USpeed: 0
    - _UVEffectPower: 0
    - _VSpeed: 0
    - _dis_x_time: 0
    - _dis_y_time: 0
    - _fororones: 0
    - _mask_x_speed: 0
    - _mask_y_speed: 0
    - _roralpha: 0
    m_Colors:
    - _Alpha: {r: 1, g: 1, b: 1, a: 1}
    - _C_BYcolor: {r: 1, g: 0, b: 0, a: 1}
    - _Color: {r: 1, g: 0.9991497, b: 0.995283, a: 1}
    - _ColorAlpha: {r: 1, g: 1, b: 1, a: 1}
    - _FrenselColor: {r: 1, g: 1, b: 1, a: 1}
    - _MainColor: {r: 1, g: 0.6579639, b: 0.02352941, a: 1}
    - _TintColor: {r: 0.9191176, g: 0.9191176, b: 0.9191176, a: 0.759}
  m_BuildTextureStacks: []
