%YAML 1.1
%TAG !u! tag:unity3d.com,2011:
--- !u!1 &1000010033326742
GameObject:
  m_ObjectHideFlags: 0
  m_CorrespondingSourceObject: {fileID: 0}
  m_PrefabInstance: {fileID: 0}
  m_PrefabAsset: {fileID: 0}
  serializedVersion: 6
  m_Component:
  - component: {fileID: 4000013562369286}
  - component: {fileID: 114000011830364434}
  m_Layer: 0
  m_Name: LimitRewardAtlas
  m_TagString: Untagged
  m_Icon: {fileID: 0}
  m_NavMeshLayer: 0
  m_StaticEditorFlags: 0
  m_IsActive: 1
--- !u!4 &4000013562369286
Transform:
  m_ObjectHideFlags: 0
  m_CorrespondingSourceObject: {fileID: 0}
  m_PrefabInstance: {fileID: 0}
  m_PrefabAsset: {fileID: 0}
  m_GameObject: {fileID: 1000010033326742}
  m_LocalRotation: {x: 0, y: 0, z: 0, w: 1}
  m_LocalPosition: {x: 0, y: 0, z: 0}
  m_LocalScale: {x: 1, y: 1, z: 1}
  m_Children: []
  m_Father: {fileID: 0}
  m_RootOrder: 0
  m_LocalEulerAnglesHint: {x: 0, y: 0, z: 0}
--- !u!114 &114000011830364434
MonoBehaviour:
  m_ObjectHideFlags: 0
  m_CorrespondingSourceObject: {fileID: 0}
  m_PrefabInstance: {fileID: 0}
  m_PrefabAsset: {fileID: 0}
  m_GameObject: {fileID: 1000010033326742}
  m_Enabled: 1
  m_EditorHideFlags: 0
  m_Script: {fileID: 11500000, guid: 4d0c51bb0b6e93049af5e88f93826e3b, type: 3}
  m_Name: 
  m_EditorClassIdentifier: 
  material: {fileID: 2100000, guid: 4efd92d1870d61c449966516fe769942, type: 2}
  mSprites:
  - name: pic_chongzhijifen_kuang
    x: 331
    y: 315
    width: 163
    height: 197
    borderLeft: 0
    borderRight: 0
    borderTop: 0
    borderBottom: 0
    paddingLeft: 0
    paddingRight: 0
    paddingTop: 0
    paddingBottom: 0
  - name: pic_chongzhijifen_qianwanchongzhi
    x: 173
    y: 16
    width: 89
    height: 56
    borderLeft: 0
    borderRight: 0
    borderTop: 0
    borderBottom: 0
    paddingLeft: 10
    paddingRight: 25
    paddingTop: 5
    paddingBottom: 4
  - name: pic_dianji_chakan
    x: 173
    y: 73
    width: 168
    height: 73
    borderLeft: 0
    borderRight: 0
    borderTop: 0
    borderBottom: 0
    paddingLeft: 0
    paddingRight: 0
    paddingTop: 0
    paddingBottom: 0
  - name: pic_dianji_chakanwenzi
    x: 173
    y: 170
    width: 100
    height: 53
    borderLeft: 0
    borderRight: 0
    borderTop: 0
    borderBottom: 0
    paddingLeft: 8
    paddingRight: 16
    paddingTop: 5
    paddingBottom: 7
  - name: pic_jifenduihuan_kuang
    x: 0
    y: 194
    width: 154
    height: 193
    borderLeft: 0
    borderRight: 0
    borderTop: 0
    borderBottom: 0
    paddingLeft: 0
    paddingRight: 0
    paddingTop: 0
    paddingBottom: 0
  - name: pic_kim_limit
    x: 319
    y: 147
    width: 128
    height: 167
    borderLeft: 0
    borderRight: 0
    borderTop: 0
    borderBottom: 0
    paddingLeft: 0
    paddingRight: 0
    paddingTop: 0
    paddingBottom: 38
  - name: pic_leiji_jindutiao1
    x: 263
    y: 48
    width: 175
    height: 24
    borderLeft: 10
    borderRight: 10
    borderTop: 8
    borderBottom: 8
    paddingLeft: 0
    paddingRight: 0
    paddingTop: 0
    paddingBottom: 0
  - name: pic_leiji_jindutiao2
    x: 0
    y: 34
    width: 169
    height: 18
    borderLeft: 10
    borderRight: 10
    borderTop: 8
    borderBottom: 8
    paddingLeft: 3
    paddingRight: 3
    paddingTop: 3
    paddingBottom: 3
  - name: pic_leijixiaohao_di
    x: 0
    y: 388
    width: 330
    height: 124
    borderLeft: 150
    borderRight: 150
    borderTop: 55
    borderBottom: 55
    paddingLeft: 0
    paddingRight: 0
    paddingTop: 0
    paddingBottom: 0
  - name: pic_star_limit
    x: 155
    y: 224
    width: 163
    height: 163
    borderLeft: 0
    borderRight: 0
    borderTop: 0
    borderBottom: 0
    paddingLeft: 0
    paddingRight: 0
    paddingTop: 0
    paddingBottom: 0
  - name: pic_yijian_wangqian
    x: 0
    y: 53
    width: 172
    height: 140
    borderLeft: 0
    borderRight: 0
    borderTop: 0
    borderBottom: 0
    paddingLeft: 1
    paddingRight: 5
    paddingTop: 0
    paddingBottom: 0
  - name: text_xianshikuangkuang
    x: 439
    y: 103
    width: 61
    height: 43
    borderLeft: 0
    borderRight: 0
    borderTop: 0
    borderBottom: 0
    paddingLeft: 0
    paddingRight: 0
    paddingTop: 0
    paddingBottom: 0
  mPixelSize: 1
  mReplacement: {fileID: 0}
  mCoordinates: 0
  sprites: []
