%YAML 1.1
%TAG !u! tag:unity3d.com,2011:
--- !u!21 &2100000
Material:
  serializedVersion: 6
  m_ObjectHideFlags: 0
  m_PrefabParentObject: {fileID: 0}
  m_PrefabInternal: {fileID: 0}
  m_Name: smoke_013_stepadd04
  m_Shader: {fileID: 4800000, guid: 08dbe515513fa314a960babf504a48b4, type: 3}
  m_ShaderKeywords: _DISS_SWITCH_ON _EMISSION
  m_LightmapFlags: 1
  m_CustomRenderQueue: -1
  stringTagMap: {}
  m_SavedProperties:
    serializedVersion: 2
    m_TexEnvs:
    - first:
        name: _BumpMap
      second:
        m_Texture: {fileID: 0}
        m_Scale: {x: 1, y: 1}
        m_Offset: {x: 0, y: 0}
    - first:
        name: _DetailAlbedoMap
      second:
        m_Texture: {fileID: 0}
        m_Scale: {x: 1, y: 1}
        m_Offset: {x: 0, y: 0}
    - first:
        name: _DetailMask
      second:
        m_Texture: {fileID: 0}
        m_Scale: {x: 1, y: 1}
        m_Offset: {x: 0, y: 0}
    - first:
        name: _DetailNormalMap
      second:
        m_Texture: {fileID: 0}
        m_Scale: {x: 1, y: 1}
        m_Offset: {x: 0, y: 0}
    - first:
        name: _Diss_Tex
      second:
        m_Texture: {fileID: 2800000, guid: 6475569e57de23843b4c52854998a6af, type: 3}
        m_Scale: {x: 2, y: 0.5}
        m_Offset: {x: 0, y: 0}
    - first:
        name: _Dissoled
      second:
        m_Texture: {fileID: 2800000, guid: 9a3c093aa80a8c34ca15053ab7abda2c, type: 3}
        m_Scale: {x: 1, y: 1}
        m_Offset: {x: 0, y: 0}
    - first:
        name: _Dssoled
      second:
        m_Texture: {fileID: 0}
        m_Scale: {x: 1, y: 1}
        m_Offset: {x: 0, y: 0}
    - first:
        name: _EmissionMap
      second:
        m_Texture: {fileID: 0}
        m_Scale: {x: 1, y: 1}
        m_Offset: {x: 0, y: 0}
    - first:
        name: _MainTex
      second:
        m_Texture: {fileID: 2800000, guid: fe2ccea9ae35b2d4d93f206c53c48a89, type: 3}
        m_Scale: {x: 1, y: 1}
        m_Offset: {x: 0, y: 0}
    - first:
        name: _Mask
      second:
        m_Texture: {fileID: 2800000, guid: 0b6953bd52162924e8fce550f8ac7a58, type: 3}
        m_Scale: {x: 1, y: 1}
        m_Offset: {x: 0, y: 0}
    - first:
        name: _MetallicGlossMap
      second:
        m_Texture: {fileID: 0}
        m_Scale: {x: 1, y: 1}
        m_Offset: {x: 0, y: 0}
    - first:
        name: _Noise01
      second:
        m_Texture: {fileID: 2800000, guid: fefbf7dfd2152db4f8baa6251c2c29da, type: 3}
        m_Scale: {x: 1, y: 1}
        m_Offset: {x: 0, y: 0}
    - first:
        name: _Noise02
      second:
        m_Texture: {fileID: 2800000, guid: dc366a37011f3e44e8441208e90529a1, type: 3}
        m_Scale: {x: 1, y: 1}
        m_Offset: {x: 0, y: 0}
    - first:
        name: _OcclusionMap
      second:
        m_Texture: {fileID: 0}
        m_Scale: {x: 1, y: 1}
        m_Offset: {x: 0, y: 0}
    - first:
        name: _ParallaxMap
      second:
        m_Texture: {fileID: 0}
        m_Scale: {x: 1, y: 1}
        m_Offset: {x: 0, y: 0}
    - first:
        name: _SKY
      second:
        m_Texture: {fileID: 0}
        m_Scale: {x: 1, y: 1}
        m_Offset: {x: 0, y: 0}
    - first:
        name: _TEX
      second:
        m_Texture: {fileID: 2800000, guid: 7c6903f80844d9d499db85695b26d2a1, type: 3}
        m_Scale: {x: 1, y: 1}
        m_Offset: {x: 0, y: 0}
    m_Floats:
    - first:
        name: _ALPHA
      second: 1
    - first:
        name: _Alpha
      second: 2
    - first:
        name: _BumpScale
      second: 1
    - first:
        name: _Color_Swith
      second: 0
    - first:
        name: _Cutoff
      second: 0.5
    - first:
        name: _DISS
      second: 0
    - first:
        name: _DetailNormalMapScale
      second: 1
    - first:
        name: _Diss
      second: 0
    - first:
        name: _Diss_Switch
      second: 0.8080663
    - first:
        name: _Diss_Swith
      second: 0
    - first:
        name: _Disturbance
      second: 20
    - first:
        name: _DstBlend
      second: 0
    - first:
        name: _Gloss
      second: 3
    - first:
        name: _GlossMapScale
      second: 1
    - first:
        name: _Glossiness
      second: 0.5
    - first:
        name: _GlossyReflections
      second: 1
    - first:
        name: _Light
      second: 2
    - first:
        name: _Metallic
      second: 0
    - first:
        name: _Mode
      second: 0
    - first:
        name: _OcclusionStrength
      second: 1
    - first:
        name: _POWER
      second: 1
    - first:
        name: _Parallax
      second: 0.02
    - first:
        name: _Power
      second: 3
    - first:
        name: _SKY_Switch
      second: 0
    - first:
        name: _SKY_ZT
      second: 1
    - first:
        name: _SmoothnessTextureChannel
      second: 0
    - first:
        name: _SpecularHighlights
      second: 1
    - first:
        name: _SrcBlend
      second: 1
    - first:
        name: _UVSec
      second: 0
    - first:
        name: _U_Speed
      second: 0
    - first:
        name: _U_Speed_copy
      second: 5.6
    - first:
        name: _V_Speed
      second: 10
    - first:
        name: _V_Speed_copy
      second: 20
    - first:
        name: _VertexColor_power
      second: 4
    - first:
        name: _ZT
      second: 1
    - first:
        name: _ZWrite
      second: 1
    m_Colors:
    - first:
        name: _Color
      second: {r: 1, g: 1, b: 1, a: 1}
    - first:
        name: _EmissionColor
      second: {r: 0, g: 0, b: 0, a: 1}
    - first:
        name: _Sky_Color
      second: {r: 1, g: 1, b: 1, a: 1}
    - first:
        name: _TintColor
      second: {r: 1, g: 1, b: 1, a: 1}
