%YAML 1.1
%TAG !u! tag:unity3d.com,2011:
--- !u!21 &2100000
Material:
  serializedVersion: 6
  m_ObjectHideFlags: 0
  m_PrefabParentObject: {fileID: 0}
  m_PrefabInternal: {fileID: 0}
  m_Name: water_104_add
  m_Shader: {fileID: 4800000, guid: 2a2435d2a4a9aa44fbede5c9df07a83f, type: 3}
  m_ShaderKeywords: _COLOR_SWITH_ON
  m_LightmapFlags: 5
  m_CustomRenderQueue: -1
  stringTagMap: {}
  m_SavedProperties:
    serializedVersion: 2
    m_TexEnvs:
    - first:
        name: _Diss_Tex
      second:
        m_Texture: {fileID: 2800000, guid: fefbf7dfd2152db4f8baa6251c2c29da, type: 3}
        m_Scale: {x: 2, y: 4}
        m_Offset: {x: 0, y: 0}
    - first:
        name: _Dissoled
      second:
        m_Texture: {fileID: 2800000, guid: f32d8cbdfa3df5e48a885c48e037a62b, type: 3}
        m_Scale: {x: 8, y: 16}
        m_Offset: {x: 0, y: 0}
    - first:
        name: _Dssoled
      second:
        m_Texture: {fileID: 2800000, guid: f32d8cbdfa3df5e48a885c48e037a62b, type: 3}
        m_Scale: {x: 4, y: 8}
        m_Offset: {x: 0, y: 0}
    - first:
        name: _MainTex
      second:
        m_Texture: {fileID: 2800000, guid: 1941efb37a3da6c45a4e7f5334f571d2, type: 3}
        m_Scale: {x: 1, y: 1}
        m_Offset: {x: 0, y: 0}
    - first:
        name: _Mask
      second:
        m_Texture: {fileID: 0}
        m_Scale: {x: 1, y: 1}
        m_Offset: {x: 0, y: 0}
    - first:
        name: _TEX
      second:
        m_Texture: {fileID: 2800000, guid: 716b5b679907e7f4a9b3ede4d96b18a5, type: 3}
        m_Scale: {x: 1, y: 1}
        m_Offset: {x: 0, y: 0}
    m_Floats:
    - first:
        name: _ALPHA
      second: 1
    - first:
        name: _Alpha
      second: 1
    - first:
        name: _Color_Swith
      second: 1
    - first:
        name: _Cutoff
      second: 0.5
    - first:
        name: _DISS
      second: 0
    - first:
        name: _Diss
      second: 0
    - first:
        name: _Diss_Switch
      second: 0
    - first:
        name: _Diss_Swith
      second: 0
    - first:
        name: _InvFade
      second: 1
    - first:
        name: _Light
      second: 1
    - first:
        name: _Power
      second: 1
    - first:
        name: _VertexColor_power
      second: 5
    m_Colors:
    - first:
        name: _Color
      second: {r: 0.47794116, g: 0.47794116, b: 0.47794116, a: 1}
    - first:
        name: _TintColor
      second: {r: 1, g: 1, b: 1, a: 1}
