%YAML 1.1
%TAG !u! tag:unity3d.com,2011:
--- !u!21 &2100000
Material:
  serializedVersion: 6
  m_ObjectHideFlags: 0
  m_CorrespondingSourceObject: {fileID: 0}
  m_PrefabInstance: {fileID: 0}
  m_PrefabAsset: {fileID: 0}
  m_Name: Env_027xhlz_shitou01_d
  m_Shader: {fileID: 10752, guid: 0000000000000000f000000000000000, type: 0}
  m_ShaderKeywords: _EMISSION_ON
  m_LightmapFlags: 4
  m_EnableInstancingVariants: 1
  m_DoubleSidedGI: 0
  m_CustomRenderQueue: -1
  stringTagMap: {}
  disabledShaderPasses: []
  m_SavedProperties:
    serializedVersion: 3
    m_TexEnvs:
    - _EmissionTex:
        m_Texture: {fileID: 2800000, guid: f6e59baa2fb4e1e419b7f239c1617dbd, type: 3}
        m_Scale: {x: 1, y: 1}
        m_Offset: {x: 0, y: 0}
    - _MainTex:
        m_Texture: {fileID: 2800000, guid: 7176d580dea85c14ab9d1bbf8dc10c72, type: 3}
        m_Scale: {x: 1, y: 1}
        m_Offset: {x: 0, y: 0}
    m_Floats:
    - _BreathSpeed: 1
    - _BumpScale: 1
    - _Cutoff: 0.5
    - _DetailNormalMapScale: 1
    - _DiffusePower: 1
    - _DstBlend: 0
    - _Emission: 1
    - _GEmissionOn: 1
    - _GlossMapScale: 1
    - _Glossiness: 1
    - _GlossyReflections: 1
    - _Metallic: 0
    - _Mode: 0
    - _OcclusionStrength: 1
    - _Parallax: 0.02
    - _Smoothness: 0.2
    - _SmoothnessTextureChannel: 0
    - _SpecForec: 1
    - _SpecularHighlights: 1
    - _SpecularPower: 1
    - _SrcBlend: 1
    - _UVSec: 0
    - _ZWrite: 1
    - __ems: 0.5
    - _ems: 1.35
    m_Colors:
    - _Color: {r: 0.8867924, g: 0.8867924, b: 0.8867924, a: 1}
    - _Color1: {r: 1, g: 0.1305468, b: 0, a: 1}
    - _Color2: {r: 1, g: 1, b: 1, a: 1}
    - _DiffuseAmbientColor: {r: 0, g: 0, b: 0, a: 1}
    - _EmissionColor: {r: 0, g: 0, b: 0, a: 0}
    - __Color: {r: 1, g: 1, b: 1, a: 1}
    - __emsColor: {r: 1, g: 0.4316475, b: 0, a: 1}
    - _emsColor: {r: 1, g: 0.512649, b: 0.08962262, a: 1}
  m_BuildTextureStacks: []
