%YAML 1.1
%TAG !u! tag:unity3d.com,2011:
--- !u!221 &22100000
AnimatorOverrideController:
  m_ObjectHideFlags: 0
  m_CorrespondingSourceObject: {fileID: 0}
  m_PrefabInstance: {fileID: 0}
  m_PrefabAsset: {fileID: 0}
  m_Name: Animator602
  m_Controller: {fileID: 9100000, guid: 217e3c3e719851a47b0ee794c54d3908, type: 2}
  m_Clips:
  - m_OriginalClip: {fileID: 7400000, guid: cd2ed5bc3c48d7b428a6f75c470aa466, type: 2}
    m_OverrideClip: {fileID: 7400000, guid: 70c89c0cf642dc948973e4faf0a0bccd, type: 2}
