%YAML 1.1
%TAG !u! tag:unity3d.com,2011:
--- !u!21 &2100000
Material:
  serializedVersion: 6
  m_ObjectHideFlags: 0
  m_CorrespondingSourceObject: {fileID: 0}
  m_PrefabInstance: {fileID: 0}
  m_PrefabAsset: {fileID: 0}
  m_Name: Ms_011hww_z
  m_Shader: {fileID: 10752, guid: 0000000000000000f000000000000000, type: 0}
  m_ShaderKeywords: _FRESNELONLIGHT_ON _LIGHTTYPE_PLAYER _SHOWSHADOWTONLIGHT_ON _SWITCHGLOSSTEXTURE_ON
  m_LightmapFlags: 4
  m_EnableInstancingVariants: 0
  m_DoubleSidedGI: 0
  m_CustomRenderQueue: -1
  stringTagMap: {}
  disabledShaderPasses: []
  m_SavedProperties:
    serializedVersion: 3
    m_TexEnvs:
    - _AlbedoInfoTex:
        m_Texture: {fileID: 2800000, guid: dda1e4ad9a75f3e40a00ed8a68f4c69e, type: 3}
        m_Scale: {x: 1, y: 1}
        m_Offset: {x: 0, y: 0}
    - _GlossMaskTexture:
        m_Texture: {fileID: 2800000, guid: 877e080f771f0fb449fb503f7e9c3802, type: 3}
        m_Scale: {x: 1, y: 1}
        m_Offset: {x: 0, y: 0}
    - _GlossTexture:
        m_Texture: {fileID: 2800000, guid: bec4cb9c9b050474d96788db8fed1fbd, type: 3}
        m_Scale: {x: 2.33, y: 1}
        m_Offset: {x: 0, y: 0}
    - _LightInfoTex:
        m_Texture: {fileID: 2800000, guid: 4c5731e6c8bf501469930caf53c4251e, type: 3}
        m_Scale: {x: 1, y: 1}
        m_Offset: {x: 0, y: 0}
    - _MainTex:
        m_Texture: {fileID: 2800000, guid: 0b5339beb8854c348b0b846b986b090f, type: 3}
        m_Scale: {x: 1, y: 1}
        m_Offset: {x: 0, y: 0}
    - _ShadowColorTex:
        m_Texture: {fileID: 2800000, guid: 0b5339beb8854c348b0b846b986b090f, type: 3}
        m_Scale: {x: 1, y: 1}
        m_Offset: {x: 0, y: 0}
    m_Floats:
    - _AOIntensity: 0.5
    - _AdjustLightDirectionalLight: 1
    - _BumpScale: 1
    - _Cutoff: 0.5
    - _DetailNormalMapScale: 1
    - _DstBlend: 0
    - _EmissionIntensity: 1.65
    - _FresnelFill: 0.85
    - _FresnelIntensity: 0.12
    - _FresnelOnLight: 1
    - _FresnelOnShadowDark: 0
    - _GlossIntensity: 0
    - _GlossMapScale: 1
    - _GlossTextureHorizontalMoveSpeed: 1
    - _GlossTextureHorizontalOffset: 0
    - _GlossTextureHorizontaloffset: 0
    - _GlossTextureMoveSpeed: 1
    - _GlossTextureOffset: 2.2
    - _GlossTextureVerticalMoveSpeed: 0
    - _GlossTextureVerticalOffset: 0
    - _GlossTextureVerticaloffset: 0
    - _Glossiness: 0.5
    - _GlossyReflections: 1
    - _HardEdgeFresnel: 0
    - _LightFalloffAffectShadowT: 0
    - _LightType: 0
    - _MainTextureColorGloss: 0
    - _Metallic: 0
    - _Mode: 0
    - _OcclusionStrength: 1
    - _OutlineBlendToMainTexture: 0
    - _OutlineBlendTomainTexture: 0
    - _OutlineWidth: 1.13
    - _Parallax: 0.02
    - _ReflectionBlendToMainTexture: 0
    - _ReflectionIntensity: 0
    - _RimDensity: 0.613
    - _RimInDark: 0.915
    - _RimIntensity: 0.3
    - _RimLightThreshold: 0.2
    - _Saturation: 1
    - _SelfLitHighContrast: 0
    - _SelfLitIntensity: 1.5
    - _SelfLitPower: 10
    - _SelfShadowHardness: 1
    - _SelfShadowIntensity: 1
    - _SelfShadowSize: 0.56
    - _ShadowAddLight: 1
    - _ShadowColorTextureIntensity: 0
    - _ShadowColorTexturePower: 0
    - _ShadowIntensity: 0.51
    - _ShadowMapToggle: 0
    - _ShadowTIntensity: 0
    - _ShadowTLightSize: 0.5
    - _ShadowTShadowSize: 0
    - _ShadowThreshold: 0.42
    - _ShowFresnel: 0
    - _ShowGlossTexture: 0
    - _ShowRim: 0
    - _ShowShadowTOnLight: 1
    - _ShowShadowTOnSelfShadow: 0
    - _SmoothnessTextureChannel: 0
    - _SpecularHighlights: 1
    - _SpecularInShadow: 0.608
    - _SpecularIntensity: 0.68
    - _SpecularLightPercent: 1
    - _SpecularPower: 77
    - _SpecularThreshold: 0.53
    - _SrcBlend: 1
    - _Stencil: 0
    - _StencilComp: 8
    - _SwitchGlossTexture: 1
    - _UVSec: 0
    - _UseSceneLight: 0
    - _ZWrite: 1
    m_Colors:
    - _Ambient: {r: 0.8584906, g: 0.8584906, b: 0.8584906, a: 1}
    - _Color: {r: 1, g: 1, b: 1, a: 1}
    - _EmissionColor: {r: 0, g: 0, b: 0, a: 1}
    - _FresnelColor: {r: 0.1534895, g: 0.05490196, b: 0.2627451, a: 1}
    - _LightColor: {r: 0.9433962, g: 0.9433962, b: 0.9433962, a: 1}
    - _MainCol: {r: 1.547405, g: 1.51091, b: 1.51091, a: 1}
    - _MainColor: {r: 1, g: 1, b: 1, a: 1}
    - _ModelAxis: {r: 0, g: 1, b: 0, a: 0}
    - _OutlineColor: {r: 0, g: 0, b: 0, a: 1}
    - _Outlinecolor: {r: 1, g: 1, b: 1, a: 1}
    - _RimColor: {r: 0.6918832, g: 0.7890094, b: 0.8679245, a: 1}
    - _SelfLitColor: {r: 1, g: 1, b: 1, a: 1}
    - _SelfShadowColor: {r: 0, g: 0, b: 0, a: 1}
    - _ShadowColorAdjustment: {r: 0.7329566, g: 0.8584906, b: 0.8539257, a: 1}
    - _ShadowOverrideColor: {r: 1, g: 1, b: 1, a: 1}
  m_BuildTextureStacks: []
