%YAML 1.1
%TAG !u! tag:unity3d.com,2011:
--- !u!21 &2100000
Material:
  serializedVersion: 6
  m_ObjectHideFlags: 0
  m_PrefabParentObject: {fileID: 0}
  m_PrefabInternal: {fileID: 0}
  m_Name: fazhen_130
  m_Shader: {fileID: 4800000, guid: 8b828bced33076d4ca8cb2946b8500e0, type: 3}
  m_ShaderKeywords: _COLOR_SWITH_ON
  m_LightmapFlags: 5
  m_CustomRenderQueue: -1
  stringTagMap: {}
  m_SavedProperties:
    serializedVersion: 2
    m_TexEnvs:
    - first:
        name: _Diss_Tex
      second:
        m_Texture: {fileID: 2800000, guid: fefbf7dfd2152db4f8baa6251c2c29da, type: 3}
        m_Scale: {x: 1, y: 1}
        m_Offset: {x: 0, y: 0}
    - first:
        name: _MainTex
      second:
        m_Texture: {fileID: 2800000, guid: 599bf1cd53b51434294a1504dc93f782, type: 3}
        m_Scale: {x: 1, y: 1}
        m_Offset: {x: 0, y: 0}
    - first:
        name: _Mask
      second:
        m_Texture: {fileID: 0}
        m_Scale: {x: 1, y: 1}
        m_Offset: {x: 0, y: 0}
    m_Floats:
    - first:
        name: _Alpha
      second: 1
    - first:
        name: _Color_Swith
      second: 1
    - first:
        name: _Cutoff
      second: 0.5
    - first:
        name: _Diss
      second: 1
    - first:
        name: _Diss_Swith
      second: 0
    - first:
        name: _InvFade
      second: 1
    - first:
        name: _ZT
      second: 1.75
    m_Colors:
    - first:
        name: _TintColor
      second: {r: 1, g: 1, b: 1, a: 0.5}
