%YAML 1.1
%TAG !u! tag:unity3d.com,2011:
--- !u!21 &2100000
Material:
  serializedVersion: 6
  m_ObjectHideFlags: 0
  m_PrefabParentObject: {fileID: 0}
  m_PrefabInternal: {fileID: 0}
  m_Name: dilie_132
  m_Shader: {fileID: 203, guid: 0000000000000000f000000000000000, type: 0}
  m_ShaderKeywords: _COLOR_SWITH_ON
  m_LightmapFlags: 5
  m_CustomRenderQueue: -1
  stringTagMap: {}
  m_SavedProperties:
    serializedVersion: 2
    m_TexEnvs:
    - first:
        name: _Diss_Tex
      second:
        m_Texture: {fileID: 2800000, guid: 42d4b0193274f6e47ab28a39bfde987f, type: 3}
        m_Scale: {x: 1, y: 1}
        m_Offset: {x: 0, y: 0}
    - first:
        name: _Dssoled
      second:
        m_Texture: {fileID: 2800000, guid: 42d4b0193274f6e47ab28a39bfde987f, type: 3}
        m_Scale: {x: 1, y: 1}
        m_Offset: {x: 0, y: 0}
    - first:
        name: _MainTex
      second:
        m_Texture: {fileID: 2800000, guid: 5cdb72705453a354abaad5ee441d0822, type: 3}
        m_Scale: {x: 1, y: 1}
        m_Offset: {x: 0, y: 0}
    - first:
        name: _Mask
      second:
        m_Texture: {fileID: 0}
        m_Scale: {x: 1, y: 1}
        m_Offset: {x: 0, y: 0}
    - first:
        name: _TEX
      second:
        m_Texture: {fileID: 2800000, guid: 92613be7c0672544fa354ce97ee02ec1, type: 3}
        m_Scale: {x: 1, y: 1}
        m_Offset: {x: 0, y: 0}
    m_Floats:
    - first:
        name: _ALPHA
      second: 1
    - first:
        name: _Alpha
      second: 1
    - first:
        name: _Color_Swith
      second: 1
    - first:
        name: _Cutoff
      second: 0.5
    - first:
        name: _Diss
      second: 0
    - first:
        name: _Diss_Swith
      second: 0
    - first:
        name: _InvFade
      second: 1
    - first:
        name: _Light
      second: 1
    - first:
        name: _Power
      second: 1
    - first:
        name: _VertexColor_power
      second: 1
    - first:
        name: _ZT
      second: 1
    m_Colors:
    - first:
        name: _Color
      second: {r: 0.44117647, g: 0.44117647, b: 0.44117647, a: 1}
    - first:
        name: _TintColor
      second: {r: 0.5294118, g: 0.5294118, b: 0.5294118, a: 0.703}
