%YAML 1.1
%TAG !u! tag:unity3d.com,2011:
--- !u!1 &1000010849381216
GameObject:
  m_ObjectHideFlags: 0
  m_CorrespondingSourceObject: {fileID: 0}
  m_PrefabInstance: {fileID: 0}
  m_PrefabAsset: {fileID: 0}
  serializedVersion: 6
  m_Component:
  - component: {fileID: 4000011848263860}
  - component: {fileID: 114000013747910912}
  m_Layer: 0
  m_Name: ItemAtlas3
  m_TagString: Untagged
  m_Icon: {fileID: 0}
  m_NavMeshLayer: 0
  m_StaticEditorFlags: 0
  m_IsActive: 1
--- !u!4 &4000011848263860
Transform:
  m_ObjectHideFlags: 0
  m_CorrespondingSourceObject: {fileID: 0}
  m_PrefabInstance: {fileID: 0}
  m_PrefabAsset: {fileID: 0}
  m_GameObject: {fileID: 1000010849381216}
  m_LocalRotation: {x: 0, y: 0, z: 0, w: 1}
  m_LocalPosition: {x: 0, y: 0, z: 0}
  m_LocalScale: {x: 1, y: 1, z: 1}
  m_Children: []
  m_Father: {fileID: 0}
  m_RootOrder: 0
  m_LocalEulerAnglesHint: {x: 0, y: 0, z: 0}
--- !u!114 &114000013747910912
MonoBehaviour:
  m_ObjectHideFlags: 0
  m_CorrespondingSourceObject: {fileID: 0}
  m_PrefabInstance: {fileID: 0}
  m_PrefabAsset: {fileID: 0}
  m_GameObject: {fileID: 1000010849381216}
  m_Enabled: 1
  m_EditorHideFlags: 0
  m_Script: {fileID: 11500000, guid: 4d0c51bb0b6e93049af5e88f93826e3b, type: 3}
  m_Name: 
  m_EditorClassIdentifier: 
  material: {fileID: 2100000, guid: d85f7ec2a2edd7b46906634623c343ba, type: 2}
  mSprites:
  - name: 1_none
    x: 396
    y: 236
    width: 4
    height: 4
    borderLeft: 0
    borderRight: 0
    borderTop: 0
    borderBottom: 0
    paddingLeft: 0
    paddingRight: 0
    paddingTop: 0
    paddingBottom: 0
  - name: 10210
    x: 385
    y: 840
    width: 86
    height: 84
    borderLeft: 0
    borderRight: 0
    borderTop: 0
    borderBottom: 0
    paddingLeft: 6
    paddingRight: 8
    paddingTop: 6
    paddingBottom: 10
  - name: 10211
    x: 815
    y: 839
    width: 87
    height: 88
    borderLeft: 0
    borderRight: 0
    borderTop: 0
    borderBottom: 0
    paddingLeft: 6
    paddingRight: 7
    paddingTop: 4
    paddingBottom: 8
  - name: 10212
    x: 0
    y: 818
    width: 85
    height: 88
    borderLeft: 0
    borderRight: 0
    borderTop: 0
    borderBottom: 0
    paddingLeft: 7
    paddingRight: 8
    paddingTop: 4
    paddingBottom: 8
  - name: 10213
    x: 473
    y: 752
    width: 86
    height: 83
    borderLeft: 0
    borderRight: 0
    borderTop: 0
    borderBottom: 0
    paddingLeft: 6
    paddingRight: 8
    paddingTop: 7
    paddingBottom: 10
  - name: 10214
    x: 0
    y: 649
    width: 83
    height: 83
    borderLeft: 0
    borderRight: 0
    borderTop: 0
    borderBottom: 0
    paddingLeft: 8
    paddingRight: 9
    paddingTop: 6
    paddingBottom: 11
  - name: 10215
    x: 292
    y: 754
    width: 85
    height: 84
    borderLeft: 0
    borderRight: 0
    borderTop: 0
    borderBottom: 0
    paddingLeft: 7
    paddingRight: 8
    paddingTop: 6
    paddingBottom: 10
  - name: 10217
    x: 207
    y: 754
    width: 84
    height: 87
    borderLeft: 0
    borderRight: 0
    borderTop: 0
    borderBottom: 0
    paddingLeft: 8
    paddingRight: 8
    paddingTop: 4
    paddingBottom: 9
  - name: 10218
    x: 385
    y: 756
    width: 87
    height: 83
    borderLeft: 0
    borderRight: 0
    borderTop: 0
    borderBottom: 0
    paddingLeft: 6
    paddingRight: 7
    paddingTop: 7
    paddingBottom: 10
  - name: 10219
    x: 86
    y: 752
    width: 85
    height: 85
    borderLeft: 0
    borderRight: 0
    borderTop: 0
    borderBottom: 0
    paddingLeft: 7
    paddingRight: 8
    paddingTop: 6
    paddingBottom: 9
  - name: 10231
    x: 86
    y: 664
    width: 81
    height: 87
    borderLeft: 0
    borderRight: 0
    borderTop: 0
    borderBottom: 0
    paddingLeft: 9
    paddingRight: 10
    paddingTop: 4
    paddingBottom: 9
  - name: 10232
    x: 378
    y: 674
    width: 88
    height: 81
    borderLeft: 0
    borderRight: 0
    borderTop: 0
    borderBottom: 0
    paddingLeft: 5
    paddingRight: 7
    paddingTop: 8
    paddingBottom: 11
  - name: 10233
    x: 648
    y: 675
    width: 79
    height: 83
    borderLeft: 0
    borderRight: 0
    borderTop: 0
    borderBottom: 0
    paddingLeft: 9
    paddingRight: 12
    paddingTop: 7
    paddingBottom: 10
  - name: 10234
    x: 0
    y: 733
    width: 85
    height: 84
    borderLeft: 0
    borderRight: 0
    borderTop: 0
    borderBottom: 0
    paddingLeft: 7
    paddingRight: 8
    paddingTop: 6
    paddingBottom: 10
  - name: 10235
    x: 560
    y: 757
    width: 87
    height: 78
    borderLeft: 0
    borderRight: 0
    borderTop: 0
    borderBottom: 0
    paddingLeft: 6
    paddingRight: 7
    paddingTop: 9
    paddingBottom: 13
  - name: 10240
    x: 119
    y: 838
    width: 87
    height: 86
    borderLeft: 0
    borderRight: 0
    borderTop: 0
    borderBottom: 0
    paddingLeft: 6
    paddingRight: 7
    paddingTop: 5
    paddingBottom: 9
  - name: 10241
    x: 298
    y: 839
    width: 86
    height: 85
    borderLeft: 0
    borderRight: 0
    borderTop: 0
    borderBottom: 0
    paddingLeft: 6
    paddingRight: 8
    paddingTop: 6
    paddingBottom: 9
  - name: 10242
    x: 258
    y: 674
    width: 87
    height: 79
    borderLeft: 0
    borderRight: 0
    borderTop: 0
    borderBottom: 0
    paddingLeft: 6
    paddingRight: 7
    paddingTop: 8
    paddingBottom: 13
  - name: 10243
    x: 737
    y: 759
    width: 76
    height: 76
    borderLeft: 0
    borderRight: 0
    borderTop: 0
    borderBottom: 0
    paddingLeft: 10
    paddingRight: 14
    paddingTop: 9
    paddingBottom: 15
  - name: 10244
    x: 172
    y: 670
    width: 85
    height: 83
    borderLeft: 0
    borderRight: 0
    borderTop: 0
    borderBottom: 0
    paddingLeft: 7
    paddingRight: 8
    paddingTop: 7
    paddingBottom: 10
  - name: 10245
    x: 467
    y: 673
    width: 80
    height: 78
    borderLeft: 0
    borderRight: 0
    borderTop: 0
    borderBottom: 0
    paddingLeft: 9
    paddingRight: 11
    paddingTop: 9
    paddingBottom: 13
  - name: 10250
    x: 207
    y: 842
    width: 90
    height: 82
    borderLeft: 0
    borderRight: 0
    borderTop: 0
    borderBottom: 0
    paddingLeft: 4
    paddingRight: 6
    paddingTop: 8
    paddingBottom: 10
  - name: 10251
    x: 560
    y: 683
    width: 86
    height: 73
    borderLeft: 0
    borderRight: 0
    borderTop: 0
    borderBottom: 0
    paddingLeft: 6
    paddingRight: 8
    paddingTop: 11
    paddingBottom: 16
  - name: 10252
    x: 621
    y: 597
    width: 78
    height: 77
    borderLeft: 0
    borderRight: 0
    borderTop: 0
    borderBottom: 0
    paddingLeft: 9
    paddingRight: 13
    paddingTop: 8
    paddingBottom: 15
  - name: 10254
    x: 728
    y: 682
    width: 85
    height: 76
    borderLeft: 0
    borderRight: 0
    borderTop: 0
    borderBottom: 0
    paddingLeft: 7
    paddingRight: 8
    paddingTop: 8
    paddingBottom: 16
  - name: 10255
    x: 648
    y: 759
    width: 88
    height: 76
    borderLeft: 0
    borderRight: 0
    borderTop: 0
    borderBottom: 0
    paddingLeft: 5
    paddingRight: 7
    paddingTop: 8
    paddingBottom: 16
  - name: 11010
    x: 0
    y: 907
    width: 118
    height: 117
    borderLeft: 0
    borderRight: 0
    borderTop: 0
    borderBottom: 0
    paddingLeft: 2
    paddingRight: 2
    paddingTop: 2
    paddingBottom: 2
  - name: 11011
    x: 0
    y: 427
    width: 69
    height: 73
    borderLeft: 0
    borderRight: 0
    borderTop: 0
    borderBottom: 0
    paddingLeft: 15
    paddingRight: 16
    paddingTop: 15
    paddingBottom: 12
  - name: 11012
    x: 461
    y: 525
    width: 69
    height: 73
    borderLeft: 0
    borderRight: 0
    borderTop: 0
    borderBottom: 0
    paddingLeft: 15
    paddingRight: 16
    paddingTop: 15
    paddingBottom: 12
  - name: 11013
    x: 388
    y: 452
    width: 69
    height: 73
    borderLeft: 0
    borderRight: 0
    borderTop: 0
    borderBottom: 0
    paddingLeft: 15
    paddingRight: 16
    paddingTop: 15
    paddingBottom: 12
  - name: 11014
    x: 531
    y: 524
    width: 69
    height: 73
    borderLeft: 0
    borderRight: 0
    borderTop: 0
    borderBottom: 0
    paddingLeft: 15
    paddingRight: 16
    paddingTop: 15
    paddingBottom: 12
  - name: 11015
    x: 458
    y: 451
    width: 69
    height: 73
    borderLeft: 0
    borderRight: 0
    borderTop: 0
    borderBottom: 0
    paddingLeft: 15
    paddingRight: 16
    paddingTop: 15
    paddingBottom: 12
  - name: 18000
    x: 703
    y: 155
    width: 45
    height: 42
    borderLeft: 0
    borderRight: 0
    borderTop: 0
    borderBottom: 0
    paddingLeft: 27
    paddingRight: 28
    paddingTop: 29
    paddingBottom: 29
  - name: 18001
    x: 523
    y: 154
    width: 45
    height: 43
    borderLeft: 0
    borderRight: 0
    borderTop: 0
    borderBottom: 0
    paddingLeft: 27
    paddingRight: 28
    paddingTop: 29
    paddingBottom: 28
  - name: 18002
    x: 929
    y: 224
    width: 50
    height: 48
    borderLeft: 0
    borderRight: 0
    borderTop: 0
    borderBottom: 0
    paddingLeft: 25
    paddingRight: 25
    paddingTop: 26
    paddingBottom: 26
  - name: 18003
    x: 0
    y: 291
    width: 56
    height: 53
    borderLeft: 0
    borderRight: 0
    borderTop: 0
    borderBottom: 0
    paddingLeft: 22
    paddingRight: 22
    paddingTop: 24
    paddingBottom: 23
  - name: 18004
    x: 0
    y: 77
    width: 62
    height: 61
    borderLeft: 0
    borderRight: 0
    borderTop: 0
    borderBottom: 0
    paddingLeft: 19
    paddingRight: 19
    paddingTop: 20
    paddingBottom: 19
  - name: 18005
    x: 336
    y: 241
    width: 67
    height: 61
    borderLeft: 0
    borderRight: 0
    borderTop: 0
    borderBottom: 0
    paddingLeft: 16
    paddingRight: 17
    paddingTop: 20
    paddingBottom: 19
  - name: 18006
    x: 323
    y: 109
    width: 58
    height: 62
    borderLeft: 0
    borderRight: 0
    borderTop: 0
    borderBottom: 0
    paddingLeft: 21
    paddingRight: 21
    paddingTop: 19
    paddingBottom: 19
  - name: 18007
    x: 742
    y: 296
    width: 58
    height: 63
    borderLeft: 0
    borderRight: 0
    borderTop: 0
    borderBottom: 0
    paddingLeft: 21
    paddingRight: 21
    paddingTop: 19
    paddingBottom: 18
  - name: 18008
    x: 0
    y: 501
    width: 71
    height: 73
    borderLeft: 0
    borderRight: 0
    borderTop: 0
    borderBottom: 0
    paddingLeft: 14
    paddingRight: 15
    paddingTop: 14
    paddingBottom: 13
  - name: 18009
    x: 874
    y: 586
    width: 76
    height: 73
    borderLeft: 0
    borderRight: 0
    borderTop: 0
    borderBottom: 0
    paddingLeft: 12
    paddingRight: 12
    paddingTop: 14
    paddingBottom: 13
  - name: 18100
    x: 909
    y: 181
    width: 45
    height: 42
    borderLeft: 0
    borderRight: 0
    borderTop: 0
    borderBottom: 0
    paddingLeft: 27
    paddingRight: 28
    paddingTop: 29
    paddingBottom: 29
  - name: 18101
    x: 64
    y: 159
    width: 45
    height: 43
    borderLeft: 0
    borderRight: 0
    borderTop: 0
    borderBottom: 0
    paddingLeft: 27
    paddingRight: 28
    paddingTop: 29
    paddingBottom: 28
  - name: 18102
    x: 969
    y: 389
    width: 50
    height: 48
    borderLeft: 0
    borderRight: 0
    borderTop: 0
    borderBottom: 0
    paddingLeft: 25
    paddingRight: 25
    paddingTop: 26
    paddingBottom: 26
  - name: 18103
    x: 872
    y: 322
    width: 56
    height: 53
    borderLeft: 0
    borderRight: 0
    borderTop: 0
    borderBottom: 0
    paddingLeft: 22
    paddingRight: 22
    paddingTop: 24
    paddingBottom: 23
  - name: 18104
    x: 0
    y: 15
    width: 62
    height: 61
    borderLeft: 0
    borderRight: 0
    borderTop: 0
    borderBottom: 0
    paddingLeft: 19
    paddingRight: 19
    paddingTop: 20
    paddingBottom: 19
  - name: 18105
    x: 745
    y: 360
    width: 67
    height: 61
    borderLeft: 0
    borderRight: 0
    borderTop: 0
    borderBottom: 0
    paddingLeft: 16
    paddingRight: 17
    paddingTop: 20
    paddingBottom: 19
  - name: 18106
    x: 190
    y: 92
    width: 58
    height: 62
    borderLeft: 0
    borderRight: 0
    borderTop: 0
    borderBottom: 0
    paddingLeft: 21
    paddingRight: 21
    paddingTop: 19
    paddingBottom: 19
  - name: 18107
    x: 464
    y: 178
    width: 58
    height: 63
    borderLeft: 0
    borderRight: 0
    borderTop: 0
    borderBottom: 0
    paddingLeft: 21
    paddingRight: 21
    paddingTop: 19
    paddingBottom: 18
  - name: 18108
    x: 77
    y: 516
    width: 71
    height: 73
    borderLeft: 0
    borderRight: 0
    borderTop: 0
    borderBottom: 0
    paddingLeft: 14
    paddingRight: 15
    paddingTop: 14
    paddingBottom: 13
  - name: 18109
    x: 168
    y: 596
    width: 76
    height: 73
    borderLeft: 0
    borderRight: 0
    borderTop: 0
    borderBottom: 0
    paddingLeft: 12
    paddingRight: 12
    paddingTop: 14
    paddingBottom: 13
  - name: 18200
    x: 839
    y: 176
    width: 45
    height: 42
    borderLeft: 0
    borderRight: 0
    borderTop: 0
    borderBottom: 0
    paddingLeft: 27
    paddingRight: 28
    paddingTop: 29
    paddingBottom: 29
  - name: 18201
    x: 606
    y: 159
    width: 45
    height: 43
    borderLeft: 0
    borderRight: 0
    borderTop: 0
    borderBottom: 0
    paddingLeft: 27
    paddingRight: 28
    paddingTop: 29
    paddingBottom: 28
  - name: 18202
    x: 606
    y: 203
    width: 50
    height: 48
    borderLeft: 0
    borderRight: 0
    borderTop: 0
    borderBottom: 0
    paddingLeft: 25
    paddingRight: 25
    paddingTop: 26
    paddingBottom: 26
  - name: 18203
    x: 801
    y: 258
    width: 56
    height: 53
    borderLeft: 0
    borderRight: 0
    borderTop: 0
    borderBottom: 0
    paddingLeft: 22
    paddingRight: 22
    paddingTop: 24
    paddingBottom: 23
  - name: 18204
    x: 906
    y: 376
    width: 62
    height: 61
    borderLeft: 0
    borderRight: 0
    borderTop: 0
    borderBottom: 0
    paddingLeft: 19
    paddingRight: 19
    paddingTop: 20
    paddingBottom: 19
  - name: 18205
    x: 674
    y: 316
    width: 67
    height: 61
    borderLeft: 0
    borderRight: 0
    borderTop: 0
    borderBottom: 0
    paddingLeft: 16
    paddingRight: 17
    paddingTop: 20
    paddingBottom: 19
  - name: 18206
    x: 253
    y: 99
    width: 58
    height: 62
    borderLeft: 0
    borderRight: 0
    borderTop: 0
    borderBottom: 0
    paddingLeft: 21
    paddingRight: 21
    paddingTop: 19
    paddingBottom: 19
  - name: 18207
    x: 547
    y: 198
    width: 58
    height: 63
    borderLeft: 0
    borderRight: 0
    borderTop: 0
    borderBottom: 0
    paddingLeft: 21
    paddingRight: 21
    paddingTop: 19
    paddingBottom: 18
  - name: 18208
    x: 245
    y: 526
    width: 71
    height: 73
    borderLeft: 0
    borderRight: 0
    borderTop: 0
    borderBottom: 0
    paddingLeft: 14
    paddingRight: 15
    paddingTop: 14
    paddingBottom: 13
  - name: 18209
    x: 0
    y: 575
    width: 76
    height: 73
    borderLeft: 0
    borderRight: 0
    borderTop: 0
    borderBottom: 0
    paddingLeft: 12
    paddingRight: 12
    paddingTop: 14
    paddingBottom: 13
  - name: 18300
    x: 455
    y: 135
    width: 45
    height: 42
    borderLeft: 0
    borderRight: 0
    borderTop: 0
    borderBottom: 0
    paddingLeft: 27
    paddingRight: 28
    paddingTop: 29
    paddingBottom: 29
  - name: 18301
    x: 793
    y: 214
    width: 45
    height: 43
    borderLeft: 0
    borderRight: 0
    borderTop: 0
    borderBottom: 0
    paddingLeft: 27
    paddingRight: 28
    paddingTop: 29
    paddingBottom: 28
  - name: 18302
    x: 677
    y: 204
    width: 50
    height: 48
    borderLeft: 0
    borderRight: 0
    borderTop: 0
    borderBottom: 0
    paddingLeft: 25
    paddingRight: 25
    paddingTop: 26
    paddingBottom: 26
  - name: 18303
    x: 872
    y: 268
    width: 56
    height: 53
    borderLeft: 0
    borderRight: 0
    borderTop: 0
    borderBottom: 0
    paddingLeft: 22
    paddingRight: 22
    paddingTop: 24
    paddingBottom: 23
  - name: 18304
    x: 127
    y: 95
    width: 62
    height: 61
    borderLeft: 0
    borderRight: 0
    borderTop: 0
    borderBottom: 0
    paddingLeft: 19
    paddingRight: 19
    paddingTop: 20
    paddingBottom: 19
  - name: 18305
    x: 479
    y: 242
    width: 67
    height: 61
    borderLeft: 0
    borderRight: 0
    borderTop: 0
    borderBottom: 0
    paddingLeft: 16
    paddingRight: 17
    paddingTop: 20
    paddingBottom: 19
  - name: 18306
    x: 122
    y: 32
    width: 58
    height: 62
    borderLeft: 0
    borderRight: 0
    borderTop: 0
    borderBottom: 0
    paddingLeft: 21
    paddingRight: 21
    paddingTop: 19
    paddingBottom: 19
  - name: 18307
    x: 396
    y: 169
    width: 58
    height: 63
    borderLeft: 0
    borderRight: 0
    borderTop: 0
    borderBottom: 0
    paddingLeft: 21
    paddingRight: 21
    paddingTop: 19
    paddingBottom: 18
  - name: 18308
    x: 407
    y: 599
    width: 71
    height: 73
    borderLeft: 0
    borderRight: 0
    borderTop: 0
    borderBottom: 0
    paddingLeft: 14
    paddingRight: 15
    paddingTop: 14
    paddingBottom: 13
  - name: 18309
    x: 84
    y: 590
    width: 76
    height: 73
    borderLeft: 0
    borderRight: 0
    borderTop: 0
    borderBottom: 0
    paddingLeft: 12
    paddingRight: 12
    paddingTop: 14
    paddingBottom: 13
  - name: 18400
    x: 382
    y: 126
    width: 45
    height: 42
    borderLeft: 0
    borderRight: 0
    borderTop: 0
    borderBottom: 0
    paddingLeft: 27
    paddingRight: 28
    paddingTop: 29
    paddingBottom: 29
  - name: 18401
    x: 728
    y: 198
    width: 45
    height: 43
    borderLeft: 0
    borderRight: 0
    borderTop: 0
    borderBottom: 0
    paddingLeft: 27
    paddingRight: 28
    paddingTop: 29
    paddingBottom: 28
  - name: 18402
    x: 858
    y: 219
    width: 50
    height: 48
    borderLeft: 0
    borderRight: 0
    borderTop: 0
    borderBottom: 0
    paddingLeft: 25
    paddingRight: 25
    paddingTop: 26
    paddingBottom: 26
  - name: 18403
    x: 929
    y: 322
    width: 56
    height: 53
    borderLeft: 0
    borderRight: 0
    borderTop: 0
    borderBottom: 0
    paddingLeft: 22
    paddingRight: 22
    paddingTop: 24
    paddingBottom: 23
  - name: 18404
    x: 64
    y: 95
    width: 62
    height: 61
    borderLeft: 0
    borderRight: 0
    borderTop: 0
    borderBottom: 0
    paddingLeft: 19
    paddingRight: 19
    paddingTop: 20
    paddingBottom: 19
  - name: 18405
    x: 838
    y: 376
    width: 67
    height: 61
    borderLeft: 0
    borderRight: 0
    borderTop: 0
    borderBottom: 0
    paddingLeft: 16
    paddingRight: 17
    paddingTop: 20
    paddingBottom: 19
  - name: 18406
    x: 677
    y: 253
    width: 58
    height: 62
    borderLeft: 0
    borderRight: 0
    borderTop: 0
    borderBottom: 0
    paddingLeft: 21
    paddingRight: 21
    paddingTop: 19
    paddingBottom: 19
  - name: 18407
    x: 813
    y: 312
    width: 58
    height: 63
    borderLeft: 0
    borderRight: 0
    borderTop: 0
    borderBottom: 0
    paddingLeft: 21
    paddingRight: 21
    paddingTop: 19
    paddingBottom: 18
  - name: 18408
    x: 161
    y: 522
    width: 71
    height: 73
    borderLeft: 0
    borderRight: 0
    borderTop: 0
    borderBottom: 0
    paddingLeft: 14
    paddingRight: 15
    paddingTop: 14
    paddingBottom: 13
  - name: 18409
    x: 258
    y: 600
    width: 76
    height: 73
    borderLeft: 0
    borderRight: 0
    borderTop: 0
    borderBottom: 0
    paddingLeft: 12
    paddingRight: 12
    paddingTop: 14
    paddingBottom: 13
  - name: 18500
    x: 774
    y: 171
    width: 45
    height: 42
    borderLeft: 0
    borderRight: 0
    borderTop: 0
    borderBottom: 0
    paddingLeft: 27
    paddingRight: 28
    paddingTop: 29
    paddingBottom: 29
  - name: 18501
    x: 657
    y: 160
    width: 45
    height: 43
    borderLeft: 0
    borderRight: 0
    borderTop: 0
    borderBottom: 0
    paddingLeft: 27
    paddingRight: 28
    paddingTop: 29
    paddingBottom: 28
  - name: 18502
    x: 929
    y: 273
    width: 50
    height: 48
    borderLeft: 0
    borderRight: 0
    borderTop: 0
    borderBottom: 0
    paddingLeft: 25
    paddingRight: 25
    paddingTop: 26
    paddingBottom: 26
  - name: 18503
    x: 736
    y: 242
    width: 56
    height: 53
    borderLeft: 0
    borderRight: 0
    borderTop: 0
    borderBottom: 0
    paddingLeft: 22
    paddingRight: 22
    paddingTop: 24
    paddingBottom: 23
  - name: 18504
    x: 122
    y: 157
    width: 62
    height: 61
    borderLeft: 0
    borderRight: 0
    borderTop: 0
    borderBottom: 0
    paddingLeft: 19
    paddingRight: 19
    paddingTop: 20
    paddingBottom: 19
  - name: 18505
    x: 550
    y: 262
    width: 67
    height: 61
    borderLeft: 0
    borderRight: 0
    borderTop: 0
    borderBottom: 0
    paddingLeft: 16
    paddingRight: 17
    paddingTop: 20
    paddingBottom: 19
  - name: 18506
    x: 63
    y: 32
    width: 58
    height: 62
    borderLeft: 0
    borderRight: 0
    borderTop: 0
    borderBottom: 0
    paddingLeft: 21
    paddingRight: 21
    paddingTop: 19
    paddingBottom: 19
  - name: 18507
    x: 618
    y: 252
    width: 58
    height: 63
    borderLeft: 0
    borderRight: 0
    borderTop: 0
    borderBottom: 0
    paddingLeft: 21
    paddingRight: 21
    paddingTop: 19
    paddingBottom: 18
  - name: 18508
    x: 335
    y: 600
    width: 71
    height: 73
    borderLeft: 0
    borderRight: 0
    borderTop: 0
    borderBottom: 0
    paddingLeft: 14
    paddingRight: 15
    paddingTop: 14
    paddingBottom: 13
  - name: 18509
    x: 874
    y: 512
    width: 76
    height: 73
    borderLeft: 0
    borderRight: 0
    borderTop: 0
    borderBottom: 0
    paddingLeft: 12
    paddingRight: 12
    paddingTop: 14
    paddingBottom: 13
  - name: 210
    x: 594
    y: 449
    width: 64
    height: 73
    borderLeft: 0
    borderRight: 0
    borderTop: 0
    borderBottom: 0
    paddingLeft: 14
    paddingRight: 11
    paddingTop: 11
    paddingBottom: 15
  - name: 211
    x: 414
    y: 303
    width: 64
    height: 73
    borderLeft: 0
    borderRight: 0
    borderTop: 0
    borderBottom: 0
    paddingLeft: 14
    paddingRight: 11
    paddingTop: 11
    paddingBottom: 15
  - name: 212
    x: 927
    y: 438
    width: 64
    height: 73
    borderLeft: 0
    borderRight: 0
    borderTop: 0
    borderBottom: 0
    paddingLeft: 14
    paddingRight: 11
    paddingTop: 11
    paddingBottom: 15
  - name: 213
    x: 198
    y: 223
    width: 64
    height: 73
    borderLeft: 0
    borderRight: 0
    borderTop: 0
    borderBottom: 0
    paddingLeft: 14
    paddingRight: 11
    paddingTop: 11
    paddingBottom: 15
  - name: 214
    x: 528
    y: 450
    width: 65
    height: 73
    borderLeft: 0
    borderRight: 0
    borderTop: 0
    borderBottom: 0
    paddingLeft: 14
    paddingRight: 10
    paddingTop: 11
    paddingBottom: 15
  - name: 215
    x: 0
    y: 213
    width: 64
    height: 73
    borderLeft: 0
    borderRight: 0
    borderTop: 0
    borderBottom: 0
    paddingLeft: 14
    paddingRight: 11
    paddingTop: 11
    paddingBottom: 15
  - name: 217
    x: 479
    y: 599
    width: 65
    height: 73
    borderLeft: 0
    borderRight: 0
    borderTop: 0
    borderBottom: 0
    paddingLeft: 14
    paddingRight: 10
    paddingTop: 11
    paddingBottom: 15
  - name: 218
    x: 63
    y: 287
    width: 64
    height: 73
    borderLeft: 0
    borderRight: 0
    borderTop: 0
    borderBottom: 0
    paddingLeft: 14
    paddingRight: 11
    paddingTop: 11
    paddingBottom: 15
  - name: 219
    x: 601
    y: 523
    width: 65
    height: 73
    borderLeft: 0
    borderRight: 0
    borderTop: 0
    borderBottom: 0
    paddingLeft: 14
    paddingRight: 10
    paddingTop: 11
    paddingBottom: 15
  - name: 231
    x: 133
    y: 293
    width: 64
    height: 73
    borderLeft: 0
    borderRight: 0
    borderTop: 0
    borderBottom: 0
    paddingLeft: 14
    paddingRight: 11
    paddingTop: 11
    paddingBottom: 15
  - name: 232
    x: 349
    y: 378
    width: 65
    height: 73
    borderLeft: 0
    borderRight: 0
    borderTop: 0
    borderBottom: 0
    paddingLeft: 14
    paddingRight: 10
    paddingTop: 11
    paddingBottom: 15
  - name: 233
    x: 797
    y: 505
    width: 64
    height: 73
    borderLeft: 0
    borderRight: 0
    borderTop: 0
    borderBottom: 0
    paddingLeft: 14
    paddingRight: 11
    paddingTop: 11
    paddingBottom: 15
  - name: 234
    x: 206
    y: 297
    width: 64
    height: 73
    borderLeft: 0
    borderRight: 0
    borderTop: 0
    borderBottom: 0
    paddingLeft: 14
    paddingRight: 11
    paddingTop: 11
    paddingBottom: 15
  - name: 235
    x: 349
    y: 303
    width: 64
    height: 74
    borderLeft: 0
    borderRight: 0
    borderTop: 0
    borderBottom: 0
    paddingLeft: 14
    paddingRight: 11
    paddingTop: 10
    paddingBottom: 15
  - name: 240
    x: 271
    y: 230
    width: 64
    height: 73
    borderLeft: 0
    borderRight: 0
    borderTop: 0
    borderBottom: 0
    paddingLeft: 14
    paddingRight: 11
    paddingTop: 11
    paddingBottom: 15
  - name: 241
    x: 415
    y: 377
    width: 65
    height: 73
    borderLeft: 0
    borderRight: 0
    borderTop: 0
    borderBottom: 0
    paddingLeft: 14
    paddingRight: 10
    paddingTop: 11
    paddingBottom: 15
  - name: 242
    x: 283
    y: 304
    width: 65
    height: 73
    borderLeft: 0
    borderRight: 0
    borderTop: 0
    borderBottom: 0
    paddingLeft: 14
    paddingRight: 10
    paddingTop: 11
    paddingBottom: 15
  - name: 243
    x: 862
    y: 438
    width: 64
    height: 73
    borderLeft: 0
    borderRight: 0
    borderTop: 0
    borderBottom: 0
    paddingLeft: 14
    paddingRight: 11
    paddingTop: 11
    paddingBottom: 15
  - name: 244
    x: 128
    y: 219
    width: 64
    height: 73
    borderLeft: 0
    borderRight: 0
    borderTop: 0
    borderBottom: 0
    paddingLeft: 14
    paddingRight: 11
    paddingTop: 11
    paddingBottom: 15
  - name: 245
    x: 0
    y: 139
    width: 63
    height: 73
    borderLeft: 0
    borderRight: 0
    borderTop: 0
    borderBottom: 0
    paddingLeft: 15
    paddingRight: 11
    paddingTop: 11
    paddingBottom: 15
  - name: 250
    x: 404
    y: 233
    width: 59
    height: 69
    borderLeft: 0
    borderRight: 0
    borderTop: 0
    borderBottom: 0
    paddingLeft: 17
    paddingRight: 13
    paddingTop: 15
    paddingBottom: 15
  - name: 251
    x: 263
    y: 162
    width: 59
    height: 67
    borderLeft: 0
    borderRight: 0
    borderTop: 0
    borderBottom: 0
    paddingLeft: 16
    paddingRight: 14
    paddingTop: 15
    paddingBottom: 17
  - name: 252
    x: 193
    y: 155
    width: 59
    height: 67
    borderLeft: 0
    borderRight: 0
    borderTop: 0
    borderBottom: 0
    paddingLeft: 16
    paddingRight: 14
    paddingTop: 15
    paddingBottom: 17
  - name: 254
    x: 336
    y: 172
    width: 59
    height: 68
    borderLeft: 0
    borderRight: 0
    borderTop: 0
    borderBottom: 0
    paddingLeft: 16
    paddingRight: 14
    paddingTop: 14
    paddingBottom: 17
  - name: 255
    x: 283
    y: 378
    width: 65
    height: 74
    borderLeft: 0
    borderRight: 0
    borderTop: 0
    borderBottom: 0
    paddingLeft: 13
    paddingRight: 11
    paddingTop: 10
    paddingBottom: 15
  - name: 310001
    x: 674
    y: 378
    width: 70
    height: 61
    borderLeft: 0
    borderRight: 0
    borderTop: 0
    borderBottom: 0
    paddingLeft: 14
    paddingRight: 16
    paddingTop: 15
    paddingBottom: 24
  - name: 310002
    x: 72
    y: 443
    width: 70
    height: 72
    borderLeft: 0
    borderRight: 0
    borderTop: 0
    borderBottom: 0
    paddingLeft: 15
    paddingRight: 15
    paddingTop: 17
    paddingBottom: 11
  - name: 310003
    x: 667
    y: 523
    width: 64
    height: 73
    borderLeft: 0
    borderRight: 0
    borderTop: 0
    borderBottom: 0
    paddingLeft: 18
    paddingRight: 18
    paddingTop: 15
    paddingBottom: 12
  - name: 310004
    x: 317
    y: 527
    width: 71
    height: 72
    borderLeft: 0
    borderRight: 0
    borderTop: 0
    borderBottom: 0
    paddingLeft: 15
    paddingRight: 14
    paddingTop: 16
    paddingBottom: 12
  - name: 310005
    x: 724
    y: 440
    width: 56
    height: 82
    borderLeft: 0
    borderRight: 0
    borderTop: 0
    borderBottom: 0
    paddingLeft: 23
    paddingRight: 21
    paddingTop: 10
    paddingBottom: 8
  - name: 310006
    x: 0
    y: 345
    width: 62
    height: 81
    borderLeft: 0
    borderRight: 0
    borderTop: 0
    borderBottom: 0
    paddingLeft: 19
    paddingRight: 19
    paddingTop: 9
    paddingBottom: 10
  - name: 310007
    x: 548
    y: 598
    width: 72
    height: 84
    borderLeft: 0
    borderRight: 0
    borderTop: 0
    borderBottom: 0
    paddingLeft: 14
    paddingRight: 14
    paddingTop: 9
    paddingBottom: 7
  - name: 320001
    x: 603
    y: 386
    width: 70
    height: 62
    borderLeft: 0
    borderRight: 0
    borderTop: 0
    borderBottom: 0
    paddingLeft: 14
    paddingRight: 16
    paddingTop: 15
    paddingBottom: 23
  - name: 320002
    x: 317
    y: 453
    width: 70
    height: 73
    borderLeft: 0
    borderRight: 0
    borderTop: 0
    borderBottom: 0
    paddingLeft: 15
    paddingRight: 15
    paddingTop: 16
    paddingBottom: 11
  - name: 320003
    x: 732
    y: 523
    width: 64
    height: 73
    borderLeft: 0
    borderRight: 0
    borderTop: 0
    borderBottom: 0
    paddingLeft: 18
    paddingRight: 18
    paddingTop: 15
    paddingBottom: 12
  - name: 320004
    x: 951
    y: 512
    width: 71
    height: 73
    borderLeft: 0
    borderRight: 0
    borderTop: 0
    borderBottom: 0
    paddingLeft: 15
    paddingRight: 14
    paddingTop: 15
    paddingBottom: 12
  - name: 320005
    x: 65
    y: 203
    width: 56
    height: 83
    borderLeft: 0
    borderRight: 0
    borderTop: 0
    borderBottom: 0
    paddingLeft: 23
    paddingRight: 21
    paddingTop: 10
    paddingBottom: 7
  - name: 320006
    x: 70
    y: 361
    width: 62
    height: 81
    borderLeft: 0
    borderRight: 0
    borderTop: 0
    borderBottom: 0
    paddingLeft: 19
    paddingRight: 19
    paddingTop: 8
    paddingBottom: 11
  - name: 320007
    x: 814
    y: 663
    width: 72
    height: 84
    borderLeft: 0
    borderRight: 0
    borderTop: 0
    borderBottom: 0
    paddingLeft: 14
    paddingRight: 14
    paddingTop: 9
    paddingBottom: 7
  - name: 330001
    x: 603
    y: 324
    width: 70
    height: 61
    borderLeft: 0
    borderRight: 0
    borderTop: 0
    borderBottom: 0
    paddingLeft: 14
    paddingRight: 16
    paddingTop: 15
    paddingBottom: 24
  - name: 330002
    x: 149
    y: 449
    width: 70
    height: 72
    borderLeft: 0
    borderRight: 0
    borderTop: 0
    borderBottom: 0
    paddingLeft: 15
    paddingRight: 15
    paddingTop: 17
    paddingBottom: 11
  - name: 330003
    x: 481
    y: 376
    width: 64
    height: 73
    borderLeft: 0
    borderRight: 0
    borderTop: 0
    borderBottom: 0
    paddingLeft: 18
    paddingRight: 18
    paddingTop: 15
    paddingBottom: 12
  - name: 330004
    x: 389
    y: 526
    width: 71
    height: 72
    borderLeft: 0
    borderRight: 0
    borderTop: 0
    borderBottom: 0
    paddingLeft: 15
    paddingRight: 14
    paddingTop: 16
    paddingBottom: 12
  - name: 330005
    x: 781
    y: 422
    width: 56
    height: 82
    borderLeft: 0
    borderRight: 0
    borderTop: 0
    borderBottom: 0
    paddingLeft: 23
    paddingRight: 21
    paddingTop: 10
    paddingBottom: 8
  - name: 330006
    x: 220
    y: 371
    width: 62
    height: 81
    borderLeft: 0
    borderRight: 0
    borderTop: 0
    borderBottom: 0
    paddingLeft: 19
    paddingRight: 19
    paddingTop: 9
    paddingBottom: 10
  - name: 330007
    x: 801
    y: 579
    width: 72
    height: 83
    borderLeft: 0
    borderRight: 0
    borderTop: 0
    borderBottom: 0
    paddingLeft: 14
    paddingRight: 14
    paddingTop: 10
    paddingBottom: 7
  - name: 340001
    x: 479
    y: 304
    width: 70
    height: 61
    borderLeft: 0
    borderRight: 0
    borderTop: 0
    borderBottom: 0
    paddingLeft: 14
    paddingRight: 16
    paddingTop: 15
    paddingBottom: 24
  - name: 340002
    x: 233
    y: 453
    width: 70
    height: 72
    borderLeft: 0
    borderRight: 0
    borderTop: 0
    borderBottom: 0
    paddingLeft: 15
    paddingRight: 15
    paddingTop: 17
    paddingBottom: 11
  - name: 340003
    x: 659
    y: 449
    width: 64
    height: 73
    borderLeft: 0
    borderRight: 0
    borderTop: 0
    borderBottom: 0
    paddingLeft: 18
    paddingRight: 18
    paddingTop: 15
    paddingBottom: 12
  - name: 340004
    x: 951
    y: 586
    width: 71
    height: 73
    borderLeft: 0
    borderRight: 0
    borderTop: 0
    borderBottom: 0
    paddingLeft: 15
    paddingRight: 14
    paddingTop: 15
    paddingBottom: 12
  - name: 340005
    x: 546
    y: 366
    width: 56
    height: 82
    borderLeft: 0
    borderRight: 0
    borderTop: 0
    borderBottom: 0
    paddingLeft: 23
    paddingRight: 21
    paddingTop: 10
    paddingBottom: 8
  - name: 340006
    x: 143
    y: 367
    width: 62
    height: 81
    borderLeft: 0
    borderRight: 0
    borderTop: 0
    borderBottom: 0
    paddingLeft: 19
    paddingRight: 19
    paddingTop: 9
    paddingBottom: 10
  - name: 340007
    x: 728
    y: 597
    width: 72
    height: 84
    borderLeft: 0
    borderRight: 0
    borderTop: 0
    borderBottom: 0
    paddingLeft: 14
    paddingRight: 14
    paddingTop: 9
    paddingBottom: 7
  - name: 6101001
    x: 119
    y: 925
    width: 98
    height: 99
    borderLeft: 0
    borderRight: 0
    borderTop: 0
    borderBottom: 0
    paddingLeft: 1
    paddingRight: 1
    paddingTop: 1
    paddingBottom: 0
  - name: 6102001
    x: 907
    y: 931
    width: 100
    height: 93
    borderLeft: 0
    borderRight: 0
    borderTop: 0
    borderBottom: 0
    paddingLeft: 0
    paddingRight: 0
    paddingTop: 6
    paddingBottom: 1
  - name: 6103001
    x: 515
    y: 927
    width: 97
    height: 97
    borderLeft: 0
    borderRight: 0
    borderTop: 0
    borderBottom: 0
    paddingLeft: 2
    paddingRight: 1
    paddingTop: 2
    paddingBottom: 1
  - name: 6104001
    x: 515
    y: 836
    width: 94
    height: 90
    borderLeft: 0
    borderRight: 0
    borderTop: 0
    borderBottom: 0
    paddingLeft: 3
    paddingRight: 3
    paddingTop: 9
    paddingBottom: 1
  - name: 6201001
    x: 218
    y: 925
    width: 98
    height: 99
    borderLeft: 0
    borderRight: 0
    borderTop: 0
    borderBottom: 0
    paddingLeft: 1
    paddingRight: 1
    paddingTop: 1
    paddingBottom: 0
  - name: 6202001
    x: 613
    y: 836
    width: 100
    height: 91
    borderLeft: 0
    borderRight: 0
    borderTop: 0
    borderBottom: 0
    paddingLeft: 0
    paddingRight: 0
    paddingTop: 6
    paddingBottom: 3
  - name: 6203001
    x: 711
    y: 928
    width: 97
    height: 96
    borderLeft: 0
    borderRight: 0
    borderTop: 0
    borderBottom: 0
    paddingLeft: 2
    paddingRight: 1
    paddingTop: 2
    paddingBottom: 2
  - name: 6204001
    x: 910
    y: 749
    width: 94
    height: 88
    borderLeft: 0
    borderRight: 0
    borderTop: 0
    borderBottom: 0
    paddingLeft: 3
    paddingRight: 3
    paddingTop: 9
    paddingBottom: 3
  - name: 6301001
    x: 317
    y: 925
    width: 98
    height: 99
    borderLeft: 0
    borderRight: 0
    borderTop: 0
    borderBottom: 0
    paddingLeft: 1
    paddingRight: 1
    paddingTop: 1
    paddingBottom: 0
  - name: 6302001
    x: 714
    y: 836
    width: 100
    height: 91
    borderLeft: 0
    borderRight: 0
    borderTop: 0
    borderBottom: 0
    paddingLeft: 0
    paddingRight: 0
    paddingTop: 6
    paddingBottom: 3
  - name: 6303001
    x: 613
    y: 928
    width: 97
    height: 96
    borderLeft: 0
    borderRight: 0
    borderTop: 0
    borderBottom: 0
    paddingLeft: 2
    paddingRight: 1
    paddingTop: 2
    paddingBottom: 2
  - name: 6304001
    x: 910
    y: 660
    width: 94
    height: 88
    borderLeft: 0
    borderRight: 0
    borderTop: 0
    borderBottom: 0
    paddingLeft: 3
    paddingRight: 3
    paddingTop: 9
    paddingBottom: 3
  - name: 6401001
    x: 416
    y: 925
    width: 98
    height: 99
    borderLeft: 0
    borderRight: 0
    borderTop: 0
    borderBottom: 0
    paddingLeft: 1
    paddingRight: 1
    paddingTop: 1
    paddingBottom: 0
  - name: 6402001
    x: 907
    y: 838
    width: 100
    height: 92
    borderLeft: 0
    borderRight: 0
    borderTop: 0
    borderBottom: 0
    paddingLeft: 0
    paddingRight: 0
    paddingTop: 6
    paddingBottom: 2
  - name: 6403001
    x: 809
    y: 928
    width: 97
    height: 96
    borderLeft: 0
    borderRight: 0
    borderTop: 0
    borderBottom: 0
    paddingLeft: 2
    paddingRight: 1
    paddingTop: 2
    paddingBottom: 2
  - name: 6404001
    x: 815
    y: 748
    width: 94
    height: 89
    borderLeft: 0
    borderRight: 0
    borderTop: 0
    borderBottom: 0
    paddingLeft: 3
    paddingRight: 3
    paddingTop: 9
    paddingBottom: 2
  - name: pic_none
    x: 728
    y: 248
    width: 4
    height: 4
    borderLeft: 0
    borderRight: 0
    borderTop: 0
    borderBottom: 0
    paddingLeft: 0
    paddingRight: 0
    paddingTop: 0
    paddingBottom: 0
  mPixelSize: 1
  mReplacement: {fileID: 0}
  mCoordinates: 0
  sprites: []
