%YAML 1.1
%TAG !u! tag:unity3d.com,2011:
--- !u!21 &2100000
Material:
  serializedVersion: 6
  m_ObjectHideFlags: 0
  m_PrefabParentObject: {fileID: 0}
  m_PrefabInternal: {fileID: 0}
  m_Name: fazhen_135.
  m_Shader: {fileID: 203, guid: 0000000000000000f000000000000000, type: 0}
  m_ShaderKeywords: 
  m_LightmapFlags: 5
  m_CustomRenderQueue: -1
  stringTagMap: {}
  m_SavedProperties:
    serializedVersion: 2
    m_TexEnvs:
    - first:
        name: _MainTex
      second:
        m_Texture: {fileID: 2800000, guid: b84c192394d6ac144ae02eb26684f3e1, type: 3}
        m_Scale: {x: 1, y: 1}
        m_Offset: {x: 0, y: 0}
    - first:
        name: _Noise01
      second:
        m_Texture: {fileID: 2800000, guid: 9a3c093aa80a8c34ca15053ab7abda2c, type: 3}
        m_Scale: {x: 1, y: 1}
        m_Offset: {x: 0, y: 0}
    - first:
        name: _Noise02
      second:
        m_Texture: {fileID: 2800000, guid: 7acc33f24a06fcd46baa112415b42195, type: 3}
        m_Scale: {x: 1, y: 1}
        m_Offset: {x: 0, y: 0}
    m_Floats:
    - first:
        name: _Alpha
      second: 1.060438
    - first:
        name: _Cutoff
      second: 0.5
    - first:
        name: _Disturbance
      second: 0.4607778
    - first:
        name: _InvFade
      second: 1
    - first:
        name: _U_Speed
      second: -0.3
    - first:
        name: _U_Speed_copy
      second: -0.3
    - first:
        name: _V_Speed
      second: -0.2
    - first:
        name: _V_Speed_copy
      second: 0.2
    - first:
        name: _ZT
      second: 1
    m_Colors:
    - first:
        name: _TintColor
      second: {r: 0.46323532, g: 0.46323532, b: 0.46323532, a: 0.928}
