%YAML 1.1
%TAG !u! tag:unity3d.com,2011:
--- !u!21 &2100000
Material:
  serializedVersion: 6
  m_ObjectHideFlags: 0
  m_CorrespondingSourceObject: {fileID: 0}
  m_PrefabInstance: {fileID: 0}
  m_PrefabAsset: {fileID: 0}
  m_Name: FX_object_tietu_019_cq002
  m_Shader: {fileID: 200, guid: 0000000000000000f000000000000000, type: 0}
  m_ShaderKeywords: 
  m_LightmapFlags: 4
  m_EnableInstancingVariants: 1
  m_DoubleSidedGI: 0
  m_CustomRenderQueue: -1
  stringTagMap: {}
  disabledShaderPasses: []
  m_SavedProperties:
    serializedVersion: 3
    m_TexEnvs:
    - _Diffuse:
        m_Texture: {fileID: 2800000, guid: caebd43cb85ee034492f39e83ad3942b, type: 3}
        m_Scale: {x: 0.5, y: 0.5}
        m_Offset: {x: 0, y: 0.62}
    - _Dissolve01:
        m_Texture: {fileID: 0}
        m_Scale: {x: 1, y: 1}
        m_Offset: {x: 0, y: 0}
    - _MainTex:
        m_Texture: {fileID: 2800000, guid: eccf7b5a8ea2faa459d8feaeddf2cc55, type: 3}
        m_Scale: {x: 1, y: 1}
        m_Offset: {x: 0, y: 0}
    m_Floats:
    - _55: 1
    - _BumpScale: 1
    - _Cutoff: 0.5
    - _DetailNormalMapScale: 1
    - _Dissolveintensity: 0
    - _Distort: 0.5
    - _DstBlend: 0
    - _Gloss: 0
    - _GlossMapScale: 1
    - _Glossiness: 0.5
    - _GlossyReflections: 1
    - _InvFade: 1
    - _MainTexBrightness: 1
    - _MainTexContrast: 1
    - _MainTexPannerX: 0
    - _MainTexPannerY: 0
    - _MaskTexDynmatic: 0
    - _MaskTexPannerX: 0
    - _MaskTexPannerY: 0
    - _Metallic: 0
    - _Mode: 0
    - _NormalTexPannerX: 0
    - _NormalTexPannerY: 0
    - _OcclusionStrength: 1
    - _Opacity: 0
    - _Outline: 0
    - _Parallax: 0.02
    - _Rim: 0
    - _SmoothnessTextureChannel: 0
    - _Specular: 0
    - _SpecularHighlights: 1
    - _SrcBlend: 1
    - _UVEffectPower: 0
    - _UVSec: 0
    - _ZWrite: 1
    - _color: 0.5
    - _liangdu: 35
    - _zhaidu: 5
    m_Colors:
    - _Color: {r: 1, g: 1, b: 1, a: 1}
    - _ColorTop: {r: 0.495283, g: 0.9802073, b: 1, a: 1}
    - _Dissolve_color: {r: 0.5, g: 0.5, b: 0.5, a: 1}
    - _EmissionColor: {r: 0, g: 0, b: 0, a: 1}
    - _MainColor: {r: 1, g: 1, b: 1, a: 1}
    - _RimColor: {r: 0.5, g: 0.5, b: 0.5, a: 1}
    - _SpecColor: {r: 0.2, g: 0.2, b: 0.2, a: 1}
    - _TintColor: {r: 0.5, g: 0.5, b: 0.5, a: 0.5}
    - _node_4365: {r: 0, g: 0.1724138, b: 1, a: 1}
    - _node_5684: {r: 0.5, g: 0.5, b: 0.5, a: 1}
  m_BuildTextureStacks: []
