%YAML 1.1
%TAG !u! tag:unity3d.com,2011:
--- !u!21 &2100000
Material:
  serializedVersion: 6
  m_ObjectHideFlags: 0
  m_CorrespondingSourceObject: {fileID: 0}
  m_PrefabInstance: {fileID: 0}
  m_PrefabAsset: {fileID: 0}
  m_Name: M_ljf_DG_01_AB_gw
  m_Shader: {fileID: 202, guid: 0000000000000000f000000000000000, type: 0}
  m_ShaderKeywords: 
  m_LightmapFlags: 4
  m_EnableInstancingVariants: 1
  m_DoubleSidedGI: 0
  m_CustomRenderQueue: -1
  stringTagMap: {}
  disabledShaderPasses: []
  m_SavedProperties:
    serializedVersion: 3
    m_TexEnvs:
    - _MainTex:
        m_Texture: {fileID: 2800000, guid: 43cf6d47a00cdee44980d1fa1b582432, type: 3}
        m_Scale: {x: 0.8, y: 0.8}
        m_Offset: {x: 0, y: 0}
    - _MaskTex:
        m_Texture: {fileID: 2800000, guid: fe799b61797cc75439cefdef9b6a427c, type: 3}
        m_Scale: {x: 1, y: 1}
        m_Offset: {x: 0, y: 0}
    - _TurbulenceTex:
        m_Texture: {fileID: 2800000, guid: 6ce2d6beca3155845a0fadf43dc92f90, type: 3}
        m_Scale: {x: 0.5, y: 2}
        m_Offset: {x: 0, y: 0}
    m_Floats:
    - _Alpha_Intensity: 1
    - _Brightness: 1.15
    - _BumpScale: 1
    - _ColorMask: 15
    - _Conster: 1
    - _Cutoff: 0.5
    - _Depth: 0
    - _Desaturate: 0
    - _DetailNormalMapScale: 1
    - _Displacement_x_intensity: 0.2
    - _Displacement_y_intensity: 0.2
    - _Disslove: 0
    - _DstBlend: 0
    - _GlossMapScale: 1
    - _Glossiness: 0
    - _GlossyReflections: 1
    - _InvFade: 1
    - _MainTexBrightness: 3
    - _MainTexContrast: 1
    - _MainTexPannerX: -4
    - _MainTexPannerY: 0
    - _MaskTexDynmatic: 0
    - _MaskTexPannerX: 0
    - _MaskTexPannerY: 0
    - _Mesh_depth: 0
    - _Mesh_depth_Intensity: 0
    - _Metallic: 0
    - _Mode: 0
    - _N_BY_KD: 0.01
    - _N_BY_QD: 3
    - _N_mask: 0.3
    - _NormalTexPannerX: 3
    - _NormalTexPannerY: 0
    - _OcclusionStrength: 1
    - _Parallax: 0.02
    - _Particlesormesh: 0
    - _SmoothnessTextureChannel: 0
    - _SpecularHighlights: 1
    - _SrcBlend: 1
    - _Stencil: 0
    - _StencilComp: 8
    - _StencilOp: 0
    - _StencilReadMask: 255
    - _StencilWriteMask: 255
    - _UVEffectPower: 0.2
    - _UVSec: 0
    - _ZWrite: 1
    - _dis_x_time: 0
    - _dis_y_time: 0
    - _fororones: 0
    - _mask_x_speed: 0
    - _mask_y_speed: 0
    - _roralpha: 0
    m_Colors:
    - _C_BYcolor: {r: 1, g: 0, b: 0, a: 1}
    - _Color: {r: 1, g: 1, b: 1, a: 1}
    - _ColorAlpha: {r: 1, g: 1, b: 1, a: 1}
    - _EmissionColor: {r: 0, g: 0, b: 0, a: 1}
    - _MainColor: {r: 1, g: 1, b: 1, a: 1}
    - _TintColor: {r: 0.5, g: 0.5, b: 0.5, a: 1}
  m_BuildTextureStacks: []
