%YAML 1.1
%TAG !u! tag:unity3d.com,2011:
--- !u!21 &2100000
Material:
  serializedVersion: 6
  m_ObjectHideFlags: 0
  m_CorrespondingSourceObject: {fileID: 0}
  m_PrefabInstance: {fileID: 0}
  m_PrefabAsset: {fileID: 0}
  m_Name: FX_Ms_005jwlsw_attack_RightWeapon_sjw020
  m_Shader: {fileID: 200, guid: 0000000000000000f000000000000000, type: 0}
  m_ShaderKeywords: _TYPE_ORIGINAL
  m_LightmapFlags: 4
  m_EnableInstancingVariants: 1
  m_DoubleSidedGI: 0
  m_CustomRenderQueue: -1
  stringTagMap: {}
  disabledShaderPasses: []
  m_SavedProperties:
    serializedVersion: 3
    m_TexEnvs:
    - _MainTex:
        m_Texture: {fileID: 2800000, guid: 455083c08db0aaf4aa7cc3bb9bffecf9, type: 3}
        m_Scale: {x: 2, y: 1}
        m_Offset: {x: 0, y: 0}
    - _MaskTex:
        m_Texture: {fileID: 2800000, guid: 49af308f5a40b764ab95ca1337a62f36, type: 3}
        m_Scale: {x: 1, y: 1}
        m_Offset: {x: 0, y: 0}
    - _TurbulenceTex:
        m_Texture: {fileID: 0}
        m_Scale: {x: 0, y: 1}
        m_Offset: {x: 0, y: 0}
    m_Floats:
    - _BumpScale: 1
    - _ColorMask: 15
    - _Cutoff: 0.5
    - _DarkAlpha0: 0.8
    - _DetailNormalMapScale: 1
    - _DisPercentage: 0
    - _DstBlend: 0
    - _GlossMapScale: 1
    - _Glossiness: 0.5
    - _GlossyReflections: 1
    - _InvFade: 1
    - _LightRange: 0
    - _MainTexBrightness: 1.5
    - _MainTexContrast: 1.5
    - _MainTexPannerX: 0
    - _MainTexPannerY: -1
    - _MaskTexDynmatic: 0
    - _MaskTexPannerX: 0
    - _MaskTexPannerY: 0
    - _Metallic: 0
    - _Mode: 0
    - _MonoOutlineValue: 0
    - _NormalTexPannerX: 0
    - _NormalTexPannerY: 0
    - _OcclusionStrength: 1
    - _OutlineBrightness: 0.1
    - _OutlineWidth: 0.01
    - _Parallax: 0.02
    - _RimPower: 1
    - _SSSValue: 0
    - _Smoothness: 0.5
    - _SmoothnessTextureChannel: 0
    - _SpecColorForce: 0.9
    - _SpecValue: 1
    - _SpecularHighlights: 1
    - _SrcBlend: 1
    - _Stencil: 0
    - _StencilComp: 8
    - _StencilOp: 0
    - _StencilReadMask: 255
    - _StencilWriteMask: 255
    - _Type: 0
    - _UVEffectPower: 0
    - _UVSec: 0
    - _ZWrite: 1
    m_Colors:
    - _Color: {r: 1, g: 1, b: 1, a: 1}
    - _Color2: {r: 1, g: 1, b: 1, a: 1}
    - _DarkColorMapping: {r: 0.5, g: 0.5, b: 0.5, a: 1}
    - _DisColor: {r: 0, g: 1.819067, b: 2.118547, a: 1}
    - _EmissionColor: {r: 0, g: 0, b: 0, a: 1}
    - _EmissiveColor: {r: 1, g: 1, b: 1, a: 1}
    - _MainColor: {r: 1, g: 1, b: 1, a: 1}
    - _MonoOutlineColor: {r: 0, g: 0, b: 0, a: 1}
    - _RimShieldColor: {r: 1, g: 1, b: 1, a: 0}
    - _SkinDarkColorMapping: {r: 0.5, g: 0.5, b: 0.5, a: 1}
    - _TintColor: {r: 0.5, g: 0.5, b: 0.5, a: 0.5}
  m_BuildTextureStacks: []
