%YAML 1.1
%TAG !u! tag:unity3d.com,2011:
--- !u!114 &11400000
MonoBehaviour:
  m_ObjectHideFlags: 0
  m_PrefabParentObject: {fileID: 0}
  m_PrefabInternal: {fileID: 0}
  m_GameObject: {fileID: 0}
  m_Enabled: 1
  m_EditorHideFlags: 0
  m_Script: {fileID: 11500000, guid: a6b194f808b1af6499c93410e504af42, type: 3}
  m_Name: 315_Atlas
  m_EditorClassIdentifier: 
  atlasFile: {fileID: 4900000, guid: 59f104b4209e8ad43bb30a7e548268c7, type: 3}
  materials:
  - {fileID: 2100000, guid: 76f2528aeb64dc04398d32232cb9075a, type: 2}
  - {fileID: 2100000, guid: a2823fd3451d98d459ce593dfcea22bd, type: 2}
