%YAML 1.1
%TAG !u! tag:unity3d.com,2011:
--- !u!114 &11400000
MonoBehaviour:
  m_ObjectHideFlags: 0
  m_PrefabParentObject: {fileID: 0}
  m_PrefabInternal: {fileID: 0}
  m_GameObject: {fileID: 0}
  m_Enabled: 1
  m_EditorHideFlags: 0
  m_Script: {fileID: 11500000, guid: a6b194f808b1af6499c93410e504af42, type: 3}
  m_Name: 402_Atlas
  m_EditorClassIdentifier: 
  atlasFile: {fileID: 4900000, guid: 6fe156f1380761441ab535011e056183, type: 3}
  materials:
  - {fileID: 2100000, guid: ee9766abe14e800428f58187ef96a6a0, type: 2}
  - {fileID: 2100000, guid: e1d2de6ff48fb9941b2769a1bfba3024, type: 2}
  - {fileID: 2100000, guid: 01da63141a28c874eaf278a8c2611a86, type: 2}
