%YAML 1.1
%TAG !u! tag:unity3d.com,2011:
--- !u!74 &7400000
AnimationClip:
  m_ObjectHideFlags: 0
  m_PrefabParentObject: {fileID: 0}
  m_PrefabInternal: {fileID: 0}
  m_Name: Buff_eff_1054_kulou
  serializedVersion: 6
  m_Legacy: 0
  m_Compressed: 0
  m_UseHighQualityCurve: 1
  m_RotationCurves: []
  m_CompressedRotationCurves: []
  m_EulerCurves:
  - curve:
      serializedVersion: 2
      m_Curve:
      - time: 0
        value: {x: -46.033, y: 0, z: 0}
        inSlope: {x: -428.52005, y: 0, z: 0}
        outSlope: {x: -428.52005, y: 0, z: 0}
        tangentMode: 0
      - time: 0.06666667
        value: {x: -74.601006, y: 0, z: 0}
        inSlope: {x: 69.455, y: 0, z: 0}
        outSlope: {x: 69.455, y: 0, z: 0}
        tangentMode: 0
      - time: 0.16666667
        value: {x: -17.858002, y: 0, z: 0}
        inSlope: {x: -34.212982, y: 0, z: 0}
        outSlope: {x: -34.212982, y: 0, z: 0}
        tangentMode: 0
      - time: 0.25
        value: {x: -70.846, y: 0, z: 0}
        inSlope: {x: -383.472, y: -0.00004577637, z: -0.00004577637}
        outSlope: {x: -383.472, y: -0.00004577637, z: -0.00004577637}
        tangentMode: 0
      - time: 0.41666666
        value: {x: -92.69399, y: -0.000015258789, z: -0.000015258789}
        inSlope: {x: 43.10315, y: -0.000013078963, z: -0.000013078963}
        outSlope: {x: 43.10315, y: -0.000013078963, z: -0.000013078963}
        tangentMode: 0
      - time: 0.65
        value: {x: -41.992, y: 0, z: 0}
        inSlope: {x: -10.507858, y: 0.0025326968, z: -0.0024673021}
        outSlope: {x: -10.507858, y: 0.0025326968, z: -0.0024673021}
        tangentMode: 0
      - time: 0.85
        value: {x: -89.65401, y: 0.001, z: -0.001}
        inSlope: {x: 26.24839, y: -0.00083333463, z: 0.00083333463}
        outSlope: {x: 26.24839, y: -0.00083333463, z: 0.00083333463}
        tangentMode: 0
      - time: 1
        value: {x: -46.033, y: 0, z: 0}
        inSlope: {x: 290.80676, y: -0.006666668, z: 0.006666668}
        outSlope: {x: 290.80676, y: -0.006666668, z: 0.006666668}
        tangentMode: 0
      m_PreInfinity: 2
      m_PostInfinity: 2
      m_RotationOrder: 4
    path: magic_eff_511_kulou1_2
  - curve:
      serializedVersion: 2
      m_Curve:
      - time: 0
        value: {x: 0, y: 0, z: 0}
        inSlope: {x: -3.9272728, y: -2.007273, z: -5.5963635}
        outSlope: {x: -3.9272728, y: -2.007273, z: -5.5963635}
        tangentMode: 0
      - time: 0.18333334
        value: {x: -0.72, y: -0.36800003, z: -1.026}
        inSlope: {x: -1.2098864, y: -15.504888, z: 11.29807}
        outSlope: {x: -1.2098864, y: -15.504888, z: 11.29807}
        tangentMode: 0
      - time: 0.31666666
        value: {x: -0.51900005, y: -4.235, z: 2.733}
        inSlope: {x: -12.585002, y: 25.346252, z: 13.278751}
        outSlope: {x: -12.585002, y: 25.346252, z: 13.278751}
        tangentMode: 0
      - time: 0.45
        value: {x: -4.076, y: 6.3910003, z: 2.515}
        inSlope: {x: -9.705001, y: -4.994999, z: 1.8187506}
        outSlope: {x: -9.705001, y: -4.994999, z: 1.8187506}
        tangentMode: 0
      - time: 0.5833333
        value: {x: -3.107, y: -5.5670004, z: 3.2180002}
        inSlope: {x: -11.001247, y: 0.84249115, z: -0.44374847}
        outSlope: {x: -11.001247, y: 0.84249115, z: -0.44374847}
        tangentMode: 0
      - time: 0.68333334
        value: {x: -6.0340004, y: 3.5700002, z: 2.6020002}
        inSlope: {x: 14.063011, y: -27.755024, z: 4.378003}
        outSlope: {x: 14.063011, y: -27.755024, z: 4.378003}
        tangentMode: 0
      - time: 0.76666665
        value: {x: -1.251, y: -8.67, z: 3.8450003}
        inSlope: {x: 33.38926, y: -40.927517, z: -6.9607496}
        outSlope: {x: 33.38926, y: -40.927517, z: -6.9607496}
        tangentMode: 0
      - time: 0.9
        value: {x: 0, y: 0, z: 0}
        inSlope: {x: 4.6912503, y: 32.5125, z: -14.418752}
        outSlope: {x: 4.6912503, y: 32.5125, z: -14.418752}
        tangentMode: 0
      - time: 1
        value: {x: 0, y: 0, z: 0}
        inSlope: {x: 0, y: 0, z: 0}
        outSlope: {x: 0, y: 0, z: 0}
        tangentMode: 0
      m_PreInfinity: 2
      m_PostInfinity: 2
      m_RotationOrder: 4
    path: 
  m_PositionCurves:
  - curve:
      serializedVersion: 2
      m_Curve:
      - time: 0
        value: {x: 0, y: 0, z: 0}
        inSlope: {x: 0, y: 0.044999998, z: 0}
        outSlope: {x: 0, y: 0.044999998, z: 0}
        tangentMode: 0
      - time: 0.26666668
        value: {x: 0, y: 0.012, z: 0}
        inSlope: {x: 0, y: -0.077500015, z: 0}
        outSlope: {x: 0, y: -0.077500015, z: 0}
        tangentMode: 0
      - time: 0.41666666
        value: {x: 0, y: -0.018, z: 0}
        inSlope: {x: 0, y: 0.03499996, z: 0}
        outSlope: {x: 0, y: 0.03499996, z: 0}
        tangentMode: 0
      - time: 0.55
        value: {x: 0, y: 0.018, z: 0}
        inSlope: {x: 0, y: 0.026999958, z: 0}
        outSlope: {x: 0, y: 0.026999958, z: 0}
        tangentMode: 0
      - time: 0.71666664
        value: {x: 0, y: -0.018, z: 0}
        inSlope: {x: 0, y: 0.04628568, z: 0}
        outSlope: {x: 0, y: 0.04628568, z: 0}
        tangentMode: 0
      - time: 0.8333333
        value: {x: 0, y: 0.018, z: 0}
        inSlope: {x: 0, y: 0.10028571, z: 0}
        outSlope: {x: 0, y: 0.10028571, z: 0}
        tangentMode: 0
      - time: 1
        value: {x: 0, y: 0, z: 0}
        inSlope: {x: 0, y: -0.10799998, z: 0}
        outSlope: {x: 0, y: -0.10799998, z: 0}
        tangentMode: 0
      m_PreInfinity: 2
      m_PostInfinity: 2
      m_RotationOrder: 4
    path: 
  m_ScaleCurves: []
  m_FloatCurves: []
  m_PPtrCurves: []
  m_SampleRate: 60
  m_WrapMode: 0
  m_Bounds:
    m_Center: {x: 0, y: 0, z: 0}
    m_Extent: {x: 0, y: 0, z: 0}
  m_ClipBindingConstant:
    genericBindings:
    - path: 0
      attribute: 1
      script: {fileID: 0}
      classID: 4
      customType: 0
      isPPtrCurve: 0
    - path: 4079109998
      attribute: 4
      script: {fileID: 0}
      classID: 4
      customType: 14
      isPPtrCurve: 0
    - path: 0
      attribute: 4
      script: {fileID: 0}
      classID: 4
      customType: 14
      isPPtrCurve: 0
    pptrCurveMapping: []
  m_AnimationClipSettings:
    serializedVersion: 2
    m_AdditiveReferencePoseClip: {fileID: 0}
    m_AdditiveReferencePoseTime: 0
    m_StartTime: 0
    m_StopTime: 1
    m_OrientationOffsetY: 0
    m_Level: 0
    m_CycleOffset: 0
    m_HasAdditiveReferencePose: 0
    m_LoopTime: 1
    m_LoopBlend: 0
    m_LoopBlendOrientation: 0
    m_LoopBlendPositionY: 0
    m_LoopBlendPositionXZ: 0
    m_KeepOriginalOrientation: 0
    m_KeepOriginalPositionY: 1
    m_KeepOriginalPositionXZ: 0
    m_HeightFromFeet: 0
    m_Mirror: 0
  m_EditorCurves:
  - curve:
      serializedVersion: 2
      m_Curve:
      - time: 0
        value: -46.033
        inSlope: -428.52005
        outSlope: -428.52005
        tangentMode: 10
      - time: 0.06666667
        value: -74.601006
        inSlope: 69.455
        outSlope: 69.455
        tangentMode: 10
      - time: 0.16666667
        value: -17.858002
        inSlope: -34.212982
        outSlope: -34.212982
        tangentMode: 10
      - time: 0.25
        value: -70.846
        inSlope: -383.472
        outSlope: -383.472
        tangentMode: 10
      - time: 0.41666666
        value: -92.69399
        inSlope: 43.10315
        outSlope: 43.10315
        tangentMode: 10
      - time: 0.65
        value: -41.992
        inSlope: -10.507858
        outSlope: -10.507858
        tangentMode: 10
      - time: 0.85
        value: -89.65401
        inSlope: 26.24839
        outSlope: 26.24839
        tangentMode: 10
      - time: 1
        value: -46.033
        inSlope: 290.80676
        outSlope: 290.80676
        tangentMode: 10
      m_PreInfinity: 2
      m_PostInfinity: 2
      m_RotationOrder: 4
    attribute: localEulerAnglesRaw.x
    path: magic_eff_511_kulou1_2
    classID: 4
    script: {fileID: 0}
  - curve:
      serializedVersion: 2
      m_Curve:
      - time: 0
        value: 0
        inSlope: 0
        outSlope: 0
        tangentMode: 10
      - time: 0.06666667
        value: 0
        inSlope: 0
        outSlope: 0
        tangentMode: 10
      - time: 0.16666667
        value: 0
        inSlope: 0
        outSlope: 0
        tangentMode: 10
      - time: 0.25
        value: 0
        inSlope: -0.00004577637
        outSlope: -0.00004577637
        tangentMode: 10
      - time: 0.41666666
        value: -0.000015258789
        inSlope: -0.000013078963
        outSlope: -0.000013078963
        tangentMode: 10
      - time: 0.65
        value: 0
        inSlope: 0.0025326968
        outSlope: 0.0025326968
        tangentMode: 10
      - time: 0.85
        value: 0.001
        inSlope: -0.00083333463
        outSlope: -0.00083333463
        tangentMode: 10
      - time: 1
        value: 0
        inSlope: -0.006666668
        outSlope: -0.006666668
        tangentMode: 10
      m_PreInfinity: 2
      m_PostInfinity: 2
      m_RotationOrder: 4
    attribute: localEulerAnglesRaw.y
    path: magic_eff_511_kulou1_2
    classID: 4
    script: {fileID: 0}
  - curve:
      serializedVersion: 2
      m_Curve:
      - time: 0
        value: 0
        inSlope: 0
        outSlope: 0
        tangentMode: 10
      - time: 0.06666667
        value: 0
        inSlope: 0
        outSlope: 0
        tangentMode: 10
      - time: 0.16666667
        value: 0
        inSlope: 0
        outSlope: 0
        tangentMode: 10
      - time: 0.25
        value: 0
        inSlope: -0.00004577637
        outSlope: -0.00004577637
        tangentMode: 10
      - time: 0.41666666
        value: -0.000015258789
        inSlope: -0.000013078963
        outSlope: -0.000013078963
        tangentMode: 10
      - time: 0.65
        value: 0
        inSlope: -0.0024673021
        outSlope: -0.0024673021
        tangentMode: 10
      - time: 0.85
        value: -0.001
        inSlope: 0.00083333463
        outSlope: 0.00083333463
        tangentMode: 10
      - time: 1
        value: 0
        inSlope: 0.006666668
        outSlope: 0.006666668
        tangentMode: 10
      m_PreInfinity: 2
      m_PostInfinity: 2
      m_RotationOrder: 4
    attribute: localEulerAnglesRaw.z
    path: magic_eff_511_kulou1_2
    classID: 4
    script: {fileID: 0}
  - curve:
      serializedVersion: 2
      m_Curve:
      - time: 0
        value: 0
        inSlope: 0
        outSlope: 0
        tangentMode: 10
      - time: 0.26666668
        value: 0
        inSlope: 0
        outSlope: 0
        tangentMode: 10
      - time: 0.41666666
        value: 0
        inSlope: 0
        outSlope: 0
        tangentMode: 10
      - time: 0.55
        value: 0
        inSlope: 0
        outSlope: 0
        tangentMode: 10
      - time: 0.71666664
        value: 0
        inSlope: 0
        outSlope: 0
        tangentMode: 10
      - time: 0.8333333
        value: 0
        inSlope: 0
        outSlope: 0
        tangentMode: 10
      - time: 1
        value: 0
        inSlope: 0
        outSlope: 0
        tangentMode: 10
      m_PreInfinity: 2
      m_PostInfinity: 2
      m_RotationOrder: 4
    attribute: m_LocalPosition.x
    path: 
    classID: 4
    script: {fileID: 0}
  - curve:
      serializedVersion: 2
      m_Curve:
      - time: 0
        value: 0
        inSlope: 0.044999998
        outSlope: 0.044999998
        tangentMode: 10
      - time: 0.26666668
        value: 0.012
        inSlope: -0.077500015
        outSlope: -0.077500015
        tangentMode: 10
      - time: 0.41666666
        value: -0.018
        inSlope: 0.03499996
        outSlope: 0.03499996
        tangentMode: 10
      - time: 0.55
        value: 0.018
        inSlope: 0.026999958
        outSlope: 0.026999958
        tangentMode: 10
      - time: 0.71666664
        value: -0.018
        inSlope: 0.04628568
        outSlope: 0.04628568
        tangentMode: 10
      - time: 0.8333333
        value: 0.018
        inSlope: 0.10028571
        outSlope: 0.10028571
        tangentMode: 10
      - time: 1
        value: 0
        inSlope: -0.10799998
        outSlope: -0.10799998
        tangentMode: 10
      m_PreInfinity: 2
      m_PostInfinity: 2
      m_RotationOrder: 4
    attribute: m_LocalPosition.y
    path: 
    classID: 4
    script: {fileID: 0}
  - curve:
      serializedVersion: 2
      m_Curve:
      - time: 0
        value: 0
        inSlope: 0
        outSlope: 0
        tangentMode: 10
      - time: 0.26666668
        value: 0
        inSlope: 0
        outSlope: 0
        tangentMode: 10
      - time: 0.41666666
        value: 0
        inSlope: 0
        outSlope: 0
        tangentMode: 10
      - time: 0.55
        value: 0
        inSlope: 0
        outSlope: 0
        tangentMode: 10
      - time: 0.71666664
        value: 0
        inSlope: 0
        outSlope: 0
        tangentMode: 10
      - time: 0.8333333
        value: 0
        inSlope: 0
        outSlope: 0
        tangentMode: 10
      - time: 1
        value: 0
        inSlope: 0
        outSlope: 0
        tangentMode: 10
      m_PreInfinity: 2
      m_PostInfinity: 2
      m_RotationOrder: 4
    attribute: m_LocalPosition.z
    path: 
    classID: 4
    script: {fileID: 0}
  - curve:
      serializedVersion: 2
      m_Curve:
      - time: 0
        value: 0
        inSlope: -3.9272728
        outSlope: -3.9272728
        tangentMode: 10
      - time: 0.18333334
        value: -0.72
        inSlope: -1.2098864
        outSlope: -1.2098864
        tangentMode: 10
      - time: 0.31666666
        value: -0.51900005
        inSlope: -12.585002
        outSlope: -12.585002
        tangentMode: 10
      - time: 0.45
        value: -4.076
        inSlope: -9.705001
        outSlope: -9.705001
        tangentMode: 10
      - time: 0.5833333
        value: -3.107
        inSlope: -11.001247
        outSlope: -11.001247
        tangentMode: 10
      - time: 0.68333334
        value: -6.0340004
        inSlope: 14.063011
        outSlope: 14.063011
        tangentMode: 10
      - time: 0.76666665
        value: -1.251
        inSlope: 33.38926
        outSlope: 33.38926
        tangentMode: 10
      - time: 0.9
        value: 0
        inSlope: 4.6912503
        outSlope: 4.6912503
        tangentMode: 10
      - time: 1
        value: 0
        inSlope: 0
        outSlope: 0
        tangentMode: 10
      m_PreInfinity: 2
      m_PostInfinity: 2
      m_RotationOrder: 4
    attribute: localEulerAnglesRaw.x
    path: 
    classID: 4
    script: {fileID: 0}
  - curve:
      serializedVersion: 2
      m_Curve:
      - time: 0
        value: 0
        inSlope: -2.007273
        outSlope: -2.007273
        tangentMode: 10
      - time: 0.18333334
        value: -0.36800003
        inSlope: -15.504888
        outSlope: -15.504888
        tangentMode: 10
      - time: 0.31666666
        value: -4.235
        inSlope: 25.346252
        outSlope: 25.346252
        tangentMode: 10
      - time: 0.45
        value: 6.3910003
        inSlope: -4.994999
        outSlope: -4.994999
        tangentMode: 10
      - time: 0.5833333
        value: -5.5670004
        inSlope: 0.84249115
        outSlope: 0.84249115
        tangentMode: 10
      - time: 0.68333334
        value: 3.5700002
        inSlope: -27.755024
        outSlope: -27.755024
        tangentMode: 10
      - time: 0.76666665
        value: -8.67
        inSlope: -40.927517
        outSlope: -40.927517
        tangentMode: 10
      - time: 0.9
        value: 0
        inSlope: 32.5125
        outSlope: 32.5125
        tangentMode: 10
      - time: 1
        value: 0
        inSlope: 0
        outSlope: 0
        tangentMode: 10
      m_PreInfinity: 2
      m_PostInfinity: 2
      m_RotationOrder: 4
    attribute: localEulerAnglesRaw.y
    path: 
    classID: 4
    script: {fileID: 0}
  - curve:
      serializedVersion: 2
      m_Curve:
      - time: 0
        value: 0
        inSlope: -5.5963635
        outSlope: -5.5963635
        tangentMode: 10
      - time: 0.18333334
        value: -1.026
        inSlope: 11.29807
        outSlope: 11.29807
        tangentMode: 10
      - time: 0.31666666
        value: 2.733
        inSlope: 13.278751
        outSlope: 13.278751
        tangentMode: 10
      - time: 0.45
        value: 2.515
        inSlope: 1.8187506
        outSlope: 1.8187506
        tangentMode: 10
      - time: 0.5833333
        value: 3.2180002
        inSlope: -0.44374847
        outSlope: -0.44374847
        tangentMode: 10
      - time: 0.68333334
        value: 2.6020002
        inSlope: 4.378003
        outSlope: 4.378003
        tangentMode: 10
      - time: 0.76666665
        value: 3.8450003
        inSlope: -6.9607496
        outSlope: -6.9607496
        tangentMode: 10
      - time: 0.9
        value: 0
        inSlope: -14.418752
        outSlope: -14.418752
        tangentMode: 10
      - time: 1
        value: 0
        inSlope: 0
        outSlope: 0
        tangentMode: 10
      m_PreInfinity: 2
      m_PostInfinity: 2
      m_RotationOrder: 4
    attribute: localEulerAnglesRaw.z
    path: 
    classID: 4
    script: {fileID: 0}
  m_EulerEditorCurves:
  - curve:
      serializedVersion: 2
      m_Curve: []
      m_PreInfinity: 2
      m_PostInfinity: 2
      m_RotationOrder: 4
    attribute: m_LocalEulerAngles.z
    path: 
    classID: 4
    script: {fileID: 0}
  - curve:
      serializedVersion: 2
      m_Curve: []
      m_PreInfinity: 2
      m_PostInfinity: 2
      m_RotationOrder: 4
    attribute: m_LocalEulerAngles.y
    path: 
    classID: 4
    script: {fileID: 0}
  - curve:
      serializedVersion: 2
      m_Curve: []
      m_PreInfinity: 2
      m_PostInfinity: 2
      m_RotationOrder: 4
    attribute: m_LocalEulerAngles.x
    path: 
    classID: 4
    script: {fileID: 0}
  - curve:
      serializedVersion: 2
      m_Curve: []
      m_PreInfinity: 2
      m_PostInfinity: 2
      m_RotationOrder: 4
    attribute: m_LocalEulerAngles.x
    path: magic_eff_511_kulou1_2
    classID: 4
    script: {fileID: 0}
  - curve:
      serializedVersion: 2
      m_Curve: []
      m_PreInfinity: 2
      m_PostInfinity: 2
      m_RotationOrder: 4
    attribute: m_LocalEulerAngles.y
    path: magic_eff_511_kulou1_2
    classID: 4
    script: {fileID: 0}
  - curve:
      serializedVersion: 2
      m_Curve: []
      m_PreInfinity: 2
      m_PostInfinity: 2
      m_RotationOrder: 4
    attribute: m_LocalEulerAngles.z
    path: magic_eff_511_kulou1_2
    classID: 4
    script: {fileID: 0}
  m_HasGenericRootTransform: 1
  m_HasMotionFloatCurves: 0
  m_GenerateMotionCurves: 0
  m_Events: []
