%YAML 1.1
%TAG !u! tag:unity3d.com,2011:
--- !u!21 &2100000
Material:
  serializedVersion: 6
  m_ObjectHideFlags: 0
  m_PrefabParentObject: {fileID: 0}
  m_PrefabInternal: {fileID: 0}
  m_Name: daoguang_105_ble02
  m_Shader: {fileID: 4800000, guid: 1f7e247671bff644992230748634170a, type: 3}
  m_ShaderKeywords: _POSTERIZE_SWITCH_ON
  m_LightmapFlags: 5
  m_CustomRenderQueue: -1
  stringTagMap: {}
  m_SavedProperties:
    serializedVersion: 2
    m_TexEnvs:
    - first:
        name: _Liuguang01
      second:
        m_Texture: {fileID: 2800000, guid: 6475569e57de23843b4c52854998a6af, type: 3}
        m_Scale: {x: 1, y: 1}
        m_Offset: {x: 0, y: 0}
    - first:
        name: _Liuguang02
      second:
        m_Texture: {fileID: 2800000, guid: 6475569e57de23843b4c52854998a6af, type: 3}
        m_Scale: {x: 1, y: 1}
        m_Offset: {x: 0, y: 0}
    - first:
        name: _MASK
      second:
        m_Texture: {fileID: 2800000, guid: ef38b713110e3b346bc25e147c1669f7, type: 3}
        m_Scale: {x: 1, y: 1}
        m_Offset: {x: 0, y: 0}
    - first:
        name: _MainTex
      second:
        m_Texture: {fileID: 2800000, guid: ef38b713110e3b346bc25e147c1669f7, type: 3}
        m_Scale: {x: 1, y: 1}
        m_Offset: {x: 0, y: 0}
    - first:
        name: _Noise01
      second:
        m_Texture: {fileID: 2800000, guid: 6475569e57de23843b4c52854998a6af, type: 3}
        m_Scale: {x: 0.5, y: 1.5}
        m_Offset: {x: 0, y: 0}
    - first:
        name: _Noise02
      second:
        m_Texture: {fileID: 2800000, guid: 6475569e57de23843b4c52854998a6af, type: 3}
        m_Scale: {x: 0.5, y: 2}
        m_Offset: {x: 0, y: 0}
    - first:
        name: _Tex_Dis
      second:
        m_Texture: {fileID: 2800000, guid: 6475569e57de23843b4c52854998a6af, type: 3}
        m_Scale: {x: 1, y: 1}
        m_Offset: {x: 0, y: 0}
    m_Floats:
    - first:
        name: _Alpha
      second: 2
    - first:
        name: _Color_Sweitch
      second: 0
    - first:
        name: _Cutoff
      second: 0.5
    - first:
        name: _Dis_U_Speed
      second: -40
    - first:
        name: _Dis_V_Speed
      second: 0
    - first:
        name: _Disturbance
      second: 1
    - first:
        name: _InvFade
      second: 1
    - first:
        name: _Liuguang_ZT
      second: 5
    - first:
        name: _Liuguang_power
      second: 1
    - first:
        name: _Posterize
      second: 5
    - first:
        name: _Posterize_Switch
      second: 1
    - first:
        name: _Power
      second: 1
    - first:
        name: _U_Sapeed
      second: -30
    - first:
        name: _U_Speed
      second: 2
    - first:
        name: _U_Speed01
      second: -40
    - first:
        name: _U_Speed02
      second: -25
    - first:
        name: _U_Speed_copy
      second: 2
    - first:
        name: _V_Speed
      second: 0
    - first:
        name: _V_Speed01
      second: 0
    - first:
        name: _V_Speed02
      second: 0
    - first:
        name: _V_Speed_copy
      second: 0
    - first:
        name: _ZT
      second: 1
    m_Colors:
    - first:
        name: _TintColor
      second: {r: 1, g: 0.6631846, b: 0.4044118, a: 1}
