%YAML 1.1
%TAG !u! tag:unity3d.com,2011:
--- !u!221 &22100000
AnimatorOverrideController:
  m_ObjectHideFlags: 0
  m_CorrespondingSourceObject: {fileID: 0}
  m_PrefabInstance: {fileID: 0}
  m_PrefabAsset: {fileID: 0}
  m_Name: Animator130
  m_Controller: {fileID: 9100000, guid: 217e3c3e719851a47b0ee794c54d3908, type: 2}
  m_Clips:
  - m_OriginalClip: {fileID: 7400000, guid: f2154b87d6362214d937b82910d5725a, type: 2}
    m_OverrideClip: {fileID: 7400000, guid: 7a97d2d7899738043a3aec251de05e22, type: 2}
  - m_OriginalClip: {fileID: 7400000, guid: e1ae3f505a5dbf145ace35bd10537c0d, type: 2}
    m_OverrideClip: {fileID: 7400000, guid: a277fbb8a0ee1564c9ab75a78d25651b, type: 2}
  - m_OriginalClip: {fileID: 7400000, guid: 9c1cc5ed1a2078941b1fdbf3d30db798, type: 2}
    m_OverrideClip: {fileID: 7400000, guid: 0a207da2d5f16724d822a69b3f6a795c, type: 2}
  - m_OriginalClip: {fileID: 7400000, guid: 5ef5d11e3bb950b409644ee7db5d1971, type: 2}
    m_OverrideClip: {fileID: 7400000, guid: 0977b46fcee4de14baaef94bfd2815dc, type: 2}
  - m_OriginalClip: {fileID: 7400000, guid: e8ec6e8376b586740bd5608e2a8e0475, type: 2}
    m_OverrideClip: {fileID: 7400000, guid: 3f469dacd5286ed4c84176cefcf1218f, type: 2}
  - m_OriginalClip: {fileID: 7400000, guid: 73458c8b2c4c8be47a56ef5d4081b283, type: 2}
    m_OverrideClip: {fileID: 7400000, guid: 3dd8398d7a2bf824b801a63d52f394fa, type: 2}
  - m_OriginalClip: {fileID: 7400000, guid: 975546f4fa5f811408bbbb9ad7ae1f26, type: 2}
    m_OverrideClip: {fileID: 7400000, guid: 7098aa0b98bc3cf40815fb9228c29f9a, type: 2}
  - m_OriginalClip: {fileID: 7400000, guid: 1f7eba713d48b7a47bc0d403b1609ed0, type: 2}
    m_OverrideClip: {fileID: 7400000, guid: 20a91941bc5e45d45bac80e6d36f4919, type: 2}
  - m_OriginalClip: {fileID: 7400000, guid: 02c8698732fc07143b677466bbf0cc14, type: 2}
    m_OverrideClip: {fileID: 7400000, guid: d21d29cc60c5e5845b180def9fef5809, type: 2}
  - m_OriginalClip: {fileID: 7400000, guid: eab1c68c98c7a9147be3e794acaa2b6e, type: 2}
    m_OverrideClip: {fileID: 7400000, guid: 20a91941bc5e45d45bac80e6d36f4919, type: 2}
  - m_OriginalClip: {fileID: 7400000, guid: 1d215c006ac5838478f72f045707175c, type: 2}
    m_OverrideClip: {fileID: 7400000, guid: 152ab12da99f069459685a2c5e413a57, type: 2}
  - m_OriginalClip: {fileID: 7400000, guid: c599e063fc13b024daa36b49b8f466ef, type: 2}
    m_OverrideClip: {fileID: 7400000, guid: 7c0223a996f17be41a6ccac1d0ced5d5, type: 2}
  - m_OriginalClip: {fileID: 7400000, guid: c49b092e9c3e0d142aa49fe6862e8351, type: 2}
    m_OverrideClip: {fileID: 7400000, guid: a42db737a670c4c498b51d6044f8afd4, type: 2}
  - m_OriginalClip: {fileID: 7400000, guid: d51e0dda713b96044adc09e480e2beed, type: 2}
    m_OverrideClip: {fileID: 7400000, guid: 74ff2420b54058e4abae415ef71d0163, type: 2}
  - m_OriginalClip: {fileID: 7400000, guid: 2ac17f9a6e4453f409641044fb2bf046, type: 2}
    m_OverrideClip: {fileID: 7400000, guid: 14c55a25aa2648548b6b461a763c4d3e, type: 2}
  - m_OriginalClip: {fileID: 7400000, guid: d62a7e87a06fa474996b573c4f98377f, type: 2}
    m_OverrideClip: {fileID: 7400000, guid: 14c55a25aa2648548b6b461a763c4d3e, type: 2}
  - m_OriginalClip: {fileID: 7400000, guid: e93e49eabe566be4c9741c1fc4f5c874, type: 2}
    m_OverrideClip: {fileID: 7400000, guid: 5a6be89a13c24884e9b0d8b580154428, type: 2}
  - m_OriginalClip: {fileID: 7400000, guid: 46e87f9258f22f74eab998f8f1ab1364, type: 2}
    m_OverrideClip: {fileID: 7400000, guid: 291800a4f2e728849bfe2f2dc2df0fd1, type: 2}
