%YAML 1.1
%TAG !u! tag:unity3d.com,2011:
--- !u!114 &11400000
MonoBehaviour:
  m_ObjectHideFlags: 0
  m_PrefabParentObject: {fileID: 0}
  m_PrefabInternal: {fileID: 0}
  m_GameObject: {fileID: 0}
  m_Enabled: 1
  m_EditorHideFlags: 0
  m_Script: {fileID: 11500000, guid: a6b194f808b1af6499c93410e504af42, type: 3}
  m_Name: 1011_Atlas
  m_EditorClassIdentifier: 
  atlasFile: {fileID: 4900000, guid: 0a4217c6f5a9f3d49af233e061dbb8c5, type: 3}
  materials:
  - {fileID: 2100000, guid: 22ff9346be767c947a69eba0a5de002e, type: 2}
