%YAML 1.1
%TAG !u! tag:unity3d.com,2011:
--- !u!1 &1000010518855584
GameObject:
  m_ObjectHideFlags: 0
  m_CorrespondingSourceObject: {fileID: 0}
  m_PrefabInstance: {fileID: 0}
  m_PrefabAsset: {fileID: 0}
  serializedVersion: 6
  m_Component:
  - component: {fileID: 4000012564185920}
  - component: {fileID: 114000012984428446}
  - component: {fileID: 95000014102611906}
  m_Layer: 0
  m_Name: model1521
  m_TagString: Untagged
  m_Icon: {fileID: 0}
  m_NavMeshLayer: 0
  m_StaticEditorFlags: 0
  m_IsActive: 1
--- !u!4 &4000012564185920
Transform:
  m_ObjectHideFlags: 0
  m_CorrespondingSourceObject: {fileID: 0}
  m_PrefabInstance: {fileID: 0}
  m_PrefabAsset: {fileID: 0}
  m_GameObject: {fileID: 1000010518855584}
  m_LocalRotation: {x: 0, y: 0, z: 0, w: 1}
  m_LocalPosition: {x: 0, y: 0, z: 0}
  m_LocalScale: {x: 1, y: 1, z: 1}
  m_Children:
  - {fileID: 1841536841271190460}
  m_Father: {fileID: 0}
  m_RootOrder: 0
  m_LocalEulerAnglesHint: {x: 0, y: 0, z: 0}
--- !u!114 &114000012984428446
MonoBehaviour:
  m_ObjectHideFlags: 0
  m_CorrespondingSourceObject: {fileID: 0}
  m_PrefabInstance: {fileID: 0}
  m_PrefabAsset: {fileID: 0}
  m_GameObject: {fileID: 1000010518855584}
  m_Enabled: 1
  m_EditorHideFlags: 0
  m_Script: {fileID: 11500000, guid: 44b1de6d3147d0e4ea18abd3c3b1bc52, type: 3}
  m_Name: 
  m_EditorClassIdentifier: 
  setflag: 0
  matList: []
  _shadowHeight: 0
  _matColor: {r: 0, g: 0, b: 0, a: 0}
  _outline: 0
  isIndependentUpdate: 0
--- !u!95 &95000014102611906
Animator:
  serializedVersion: 3
  m_ObjectHideFlags: 0
  m_CorrespondingSourceObject: {fileID: 0}
  m_PrefabInstance: {fileID: 0}
  m_PrefabAsset: {fileID: 0}
  m_GameObject: {fileID: 1000010518855584}
  m_Enabled: 1
  m_Avatar: {fileID: 0}
  m_Controller: {fileID: 22100000, guid: decbd83e5671ef04599ce348ec6314d8, type: 2}
  m_CullingMode: 0
  m_UpdateMode: 0
  m_ApplyRootMotion: 0
  m_LinearVelocityBlending: 0
  m_WarningMessage: 
  m_HasTransformHierarchy: 1
  m_AllowConstantClipSamplingOptimization: 1
  m_KeepAnimatorControllerStateOnDisable: 0
--- !u!1001 &2163079659653088343
PrefabInstance:
  m_ObjectHideFlags: 0
  serializedVersion: 2
  m_Modification:
    m_TransformParent: {fileID: 4000012564185920}
    m_Modifications:
    - target: {fileID: -8679921383154817045, guid: be78eb301fd3a50429ec96a6a0775d5f,
        type: 3}
      propertyPath: m_RootOrder
      value: 0
      objectReference: {fileID: 0}
    - target: {fileID: -8679921383154817045, guid: be78eb301fd3a50429ec96a6a0775d5f,
        type: 3}
      propertyPath: m_LocalScale.x
      value: 70
      objectReference: {fileID: 0}
    - target: {fileID: -8679921383154817045, guid: be78eb301fd3a50429ec96a6a0775d5f,
        type: 3}
      propertyPath: m_LocalScale.y
      value: 90
      objectReference: {fileID: 0}
    - target: {fileID: -8679921383154817045, guid: be78eb301fd3a50429ec96a6a0775d5f,
        type: 3}
      propertyPath: m_LocalScale.z
      value: 70
      objectReference: {fileID: 0}
    - target: {fileID: -8679921383154817045, guid: be78eb301fd3a50429ec96a6a0775d5f,
        type: 3}
      propertyPath: m_LocalPosition.x
      value: 0
      objectReference: {fileID: 0}
    - target: {fileID: -8679921383154817045, guid: be78eb301fd3a50429ec96a6a0775d5f,
        type: 3}
      propertyPath: m_LocalPosition.y
      value: 0
      objectReference: {fileID: 0}
    - target: {fileID: -8679921383154817045, guid: be78eb301fd3a50429ec96a6a0775d5f,
        type: 3}
      propertyPath: m_LocalPosition.z
      value: 0
      objectReference: {fileID: 0}
    - target: {fileID: -8679921383154817045, guid: be78eb301fd3a50429ec96a6a0775d5f,
        type: 3}
      propertyPath: m_LocalRotation.w
      value: 1
      objectReference: {fileID: 0}
    - target: {fileID: -8679921383154817045, guid: be78eb301fd3a50429ec96a6a0775d5f,
        type: 3}
      propertyPath: m_LocalRotation.x
      value: 0.000000081460335
      objectReference: {fileID: 0}
    - target: {fileID: -8679921383154817045, guid: be78eb301fd3a50429ec96a6a0775d5f,
        type: 3}
      propertyPath: m_LocalRotation.y
      value: -0
      objectReference: {fileID: 0}
    - target: {fileID: -8679921383154817045, guid: be78eb301fd3a50429ec96a6a0775d5f,
        type: 3}
      propertyPath: m_LocalRotation.z
      value: -0
      objectReference: {fileID: 0}
    - target: {fileID: -8679921383154817045, guid: be78eb301fd3a50429ec96a6a0775d5f,
        type: 3}
      propertyPath: m_LocalEulerAnglesHint.x
      value: 0
      objectReference: {fileID: 0}
    - target: {fileID: -8679921383154817045, guid: be78eb301fd3a50429ec96a6a0775d5f,
        type: 3}
      propertyPath: m_LocalEulerAnglesHint.y
      value: 0
      objectReference: {fileID: 0}
    - target: {fileID: -8679921383154817045, guid: be78eb301fd3a50429ec96a6a0775d5f,
        type: 3}
      propertyPath: m_LocalEulerAnglesHint.z
      value: 0
      objectReference: {fileID: 0}
    - target: {fileID: -7511558181221131132, guid: be78eb301fd3a50429ec96a6a0775d5f,
        type: 3}
      propertyPath: m_Materials.Array.data[0]
      value: 
      objectReference: {fileID: 2100000, guid: 1066968c8a46cd749b8847959277eccc, type: 2}
    - target: {fileID: 919132149155446097, guid: be78eb301fd3a50429ec96a6a0775d5f,
        type: 3}
      propertyPath: m_Name
      value: untitled
      objectReference: {fileID: 0}
    m_RemovedComponents: []
  m_SourcePrefab: {fileID: 100100000, guid: be78eb301fd3a50429ec96a6a0775d5f, type: 3}
--- !u!4 &1841536841271190460 stripped
Transform:
  m_CorrespondingSourceObject: {fileID: -8679921383154817045, guid: be78eb301fd3a50429ec96a6a0775d5f,
    type: 3}
  m_PrefabInstance: {fileID: 2163079659653088343}
  m_PrefabAsset: {fileID: 0}
