%YAML 1.1
%TAG !u! tag:unity3d.com,2011:
--- !u!21 &2100000
Material:
  serializedVersion: 6
  m_ObjectHideFlags: 0
  m_PrefabParentObject: {fileID: 0}
  m_PrefabInternal: {fileID: 0}
  m_Name: ui_eff_1171_star
  m_Shader: {fileID: 4800000, guid: 7ea7cd9c067b8bd4093e8ba578619739, type: 3}
  m_ShaderKeywords: _PARTICLE_CONTROLA_ON
  m_LightmapFlags: 5
  m_CustomRenderQueue: 3030
  stringTagMap: {}
  m_SavedProperties:
    serializedVersion: 2
    m_TexEnvs:
    - first:
        name: _MainTex
      second:
        m_Texture: {fileID: 2800000, guid: eec20f1204997b84e9775ea471d9b42d, type: 3}
        m_Scale: {x: 1, y: 1}
        m_Offset: {x: 0, y: 0}
    m_Floats:
    - first:
        name: _Cutoff
      second: 0.5
    - first:
        name: _InvFade
      second: 1
    - first:
        name: _MainTex_Power
      second: 3
    - first:
        name: _diss_amount
      second: -0.01
    - first:
        name: _particle_controlA
      second: 1
    m_Colors:
    - first:
        name: _MainColor
      second: {r: 1, g: 1, b: 1, a: 1}
    - first:
        name: _TintColor
      second: {r: 1, g: 1, b: 1, a: 1}
