%YAML 1.1
%TAG !u! tag:unity3d.com,2011:
--- !u!74 &7400000
AnimationClip:
  m_ObjectHideFlags: 0
  m_PrefabParentObject: {fileID: 0}
  m_PrefabInternal: {fileID: 0}
  m_Name: magic_eff_51001_fly_ani
  serializedVersion: 6
  m_Legacy: 0
  m_Compressed: 0
  m_UseHighQualityCurve: 1
  m_RotationCurves: []
  m_CompressedRotationCurves: []
  m_EulerCurves: []
  m_PositionCurves:
  - curve:
      serializedVersion: 2
      m_Curve:
      - time: 0
        value: {x: 0, y: -0.06, z: -1.11}
        inSlope: {x: 0, y: 24.199999, z: 22.2}
        outSlope: {x: 0, y: 24.199999, z: 22.2}
        tangentMode: 0
      - time: 0.05
        value: {x: 0, y: 1.15, z: 0}
        inSlope: {x: -10.759999, y: 12.41, z: 11.1}
        outSlope: {x: -10.759999, y: 12.41, z: 11.1}
        tangentMode: 0
      - time: 0.1
        value: {x: -1.076, y: 1.181, z: -0}
        inSlope: {x: 1.6960001, y: -5.0360003, z: -0.78}
        outSlope: {x: 1.6960001, y: -5.0360003, z: -0.78}
        tangentMode: 0
      - time: 0.18333334
        value: {x: 1, y: 0.29, z: -0.13}
        inSlope: {x: 1.855999, y: 10.854, z: 3.72}
        outSlope: {x: 1.855999, y: 10.854, z: 3.72}
        tangentMode: 0
      - time: 0.23333333
        value: {x: -0.06, y: 1.91, z: 0.32}
        inSlope: {x: 5.299999, y: 14.800001, z: 4.5}
        outSlope: {x: 5.299999, y: 14.800001, z: 4.5}
        tangentMode: 0
      - time: 0.28333333
        value: {x: 1.53, y: 1.77, z: 0.32}
        inSlope: {x: -12.690001, y: -10.895, z: -3.015}
        outSlope: {x: -12.690001, y: -10.895, z: -3.015}
        tangentMode: 0
      - time: 0.31666666
        value: {x: -0.376, y: 1.137, z: 0.119}
        inSlope: {x: -26.710001, y: -23.530003, z: -3.6100001}
        outSlope: {x: -26.710001, y: -23.530003, z: -3.6100001}
        tangentMode: 0
      - time: 0.41666666
        value: {x: 0, y: -1.67, z: 0}
        inSlope: {x: 3.76, y: -28.070002, z: -1.19}
        outSlope: {x: 3.76, y: -28.070002, z: -1.19}
        tangentMode: 0
      m_PreInfinity: 2
      m_PostInfinity: 2
      m_RotationOrder: 4
    path: magic_eff_51001_fly_trail
  m_ScaleCurves: []
  m_FloatCurves: []
  m_PPtrCurves: []
  m_SampleRate: 60
  m_WrapMode: 0
  m_Bounds:
    m_Center: {x: 0, y: 0, z: 0}
    m_Extent: {x: 0, y: 0, z: 0}
  m_ClipBindingConstant:
    genericBindings:
    - path: 3904505897
      attribute: 1
      script: {fileID: 0}
      classID: 4
      customType: 0
      isPPtrCurve: 0
    pptrCurveMapping: []
  m_AnimationClipSettings:
    serializedVersion: 2
    m_AdditiveReferencePoseClip: {fileID: 0}
    m_AdditiveReferencePoseTime: 0
    m_StartTime: 0
    m_StopTime: 0.41666666
    m_OrientationOffsetY: 0
    m_Level: 0
    m_CycleOffset: 0
    m_HasAdditiveReferencePose: 0
    m_LoopTime: 0
    m_LoopBlend: 0
    m_LoopBlendOrientation: 0
    m_LoopBlendPositionY: 0
    m_LoopBlendPositionXZ: 0
    m_KeepOriginalOrientation: 0
    m_KeepOriginalPositionY: 1
    m_KeepOriginalPositionXZ: 0
    m_HeightFromFeet: 0
    m_Mirror: 0
  m_EditorCurves:
  - curve:
      serializedVersion: 2
      m_Curve:
      - time: 0
        value: 0
        inSlope: 0
        outSlope: 0
        tangentMode: 10
      - time: 0.05
        value: 0
        inSlope: -10.759999
        outSlope: -10.759999
        tangentMode: 10
      - time: 0.1
        value: -1.076
        inSlope: 1.6960001
        outSlope: 1.6960001
        tangentMode: 10
      - time: 0.18333334
        value: 1
        inSlope: 1.855999
        outSlope: 1.855999
        tangentMode: 10
      - time: 0.23333333
        value: -0.06
        inSlope: 5.299999
        outSlope: 5.299999
        tangentMode: 10
      - time: 0.28333333
        value: 1.53
        inSlope: -12.690001
        outSlope: -12.690001
        tangentMode: 10
      - time: 0.31666666
        value: -0.376
        inSlope: -26.710001
        outSlope: -26.710001
        tangentMode: 10
      - time: 0.41666666
        value: 0
        inSlope: 3.76
        outSlope: 3.76
        tangentMode: 10
      m_PreInfinity: 2
      m_PostInfinity: 2
      m_RotationOrder: 4
    attribute: m_LocalPosition.x
    path: magic_eff_51001_fly_trail
    classID: 4
    script: {fileID: 0}
  - curve:
      serializedVersion: 2
      m_Curve:
      - time: 0
        value: -0.06
        inSlope: 24.199999
        outSlope: 24.199999
        tangentMode: 10
      - time: 0.05
        value: 1.15
        inSlope: 12.41
        outSlope: 12.41
        tangentMode: 10
      - time: 0.1
        value: 1.181
        inSlope: -5.0360003
        outSlope: -5.0360003
        tangentMode: 10
      - time: 0.18333334
        value: 0.29
        inSlope: 10.854
        outSlope: 10.854
        tangentMode: 10
      - time: 0.23333333
        value: 1.91
        inSlope: 14.800001
        outSlope: 14.800001
        tangentMode: 10
      - time: 0.28333333
        value: 1.77
        inSlope: -10.895
        outSlope: -10.895
        tangentMode: 10
      - time: 0.31666666
        value: 1.137
        inSlope: -23.530003
        outSlope: -23.530003
        tangentMode: 10
      - time: 0.41666666
        value: -1.67
        inSlope: -28.070002
        outSlope: -28.070002
        tangentMode: 10
      m_PreInfinity: 2
      m_PostInfinity: 2
      m_RotationOrder: 4
    attribute: m_LocalPosition.y
    path: magic_eff_51001_fly_trail
    classID: 4
    script: {fileID: 0}
  - curve:
      serializedVersion: 2
      m_Curve:
      - time: 0
        value: -1.11
        inSlope: 22.2
        outSlope: 22.2
        tangentMode: 10
      - time: 0.05
        value: 0
        inSlope: 11.1
        outSlope: 11.1
        tangentMode: 10
      - time: 0.1
        value: -0
        inSlope: -0.78
        outSlope: -0.78
        tangentMode: 10
      - time: 0.18333334
        value: -0.13
        inSlope: 3.72
        outSlope: 3.72
        tangentMode: 10
      - time: 0.23333333
        value: 0.32
        inSlope: 4.5
        outSlope: 4.5
        tangentMode: 10
      - time: 0.28333333
        value: 0.32
        inSlope: -3.015
        outSlope: -3.015
        tangentMode: 10
      - time: 0.31666666
        value: 0.119
        inSlope: -3.6100001
        outSlope: -3.6100001
        tangentMode: 10
      - time: 0.41666666
        value: 0
        inSlope: -1.19
        outSlope: -1.19
        tangentMode: 10
      m_PreInfinity: 2
      m_PostInfinity: 2
      m_RotationOrder: 4
    attribute: m_LocalPosition.z
    path: magic_eff_51001_fly_trail
    classID: 4
    script: {fileID: 0}
  m_EulerEditorCurves: []
  m_HasGenericRootTransform: 0
  m_HasMotionFloatCurves: 0
  m_GenerateMotionCurves: 0
  m_Events: []
