%YAML 1.1
%TAG !u! tag:unity3d.com,2011:
--- !u!21 &2100000
Material:
  serializedVersion: 6
  m_ObjectHideFlags: 0
  m_PrefabParentObject: {fileID: 0}
  m_PrefabInternal: {fileID: 0}
  m_Name: word_101
  m_Shader: {fileID: 4800000, guid: cf359da86b8cfad42bded56dd52a62e3, type: 3}
  m_ShaderKeywords: 
  m_LightmapFlags: 5
  m_CustomRenderQueue: -1
  stringTagMap: {}
  m_SavedProperties:
    serializedVersion: 2
    m_TexEnvs:
    - first:
        name: _Diss_Tex
      second:
        m_Texture: {fileID: 2800000, guid: 6475569e57de23843b4c52854998a6af, type: 3}
        m_Scale: {x: 1, y: 1}
        m_Offset: {x: 0, y: 0}
    - first:
        name: _MainTex
      second:
        m_Texture: {fileID: 2800000, guid: cb408cdd5f2ada841a6557a61017d926, type: 3}
        m_Scale: {x: 1, y: 1}
        m_Offset: {x: 0, y: 0}
    m_Floats:
    - first:
        name: _Alpha
      second: 1
    - first:
        name: _Color_Swith
      second: 0
    - first:
        name: _Cutoff
      second: 0.5
    - first:
        name: _Diss
      second: 0
    - first:
        name: _Diss_Swith
      second: 0
    - first:
        name: _InvFade
      second: 1
    - first:
        name: _ZT
      second: 1.2
    m_Colors:
    - first:
        name: _TintColor
      second: {r: 1, g: 1, b: 1, a: 1}
