%YAML 1.1
%TAG !u! tag:unity3d.com,2011:
--- !u!21 &2100000
Material:
  serializedVersion: 6
  m_ObjectHideFlags: 0
  m_CorrespondingSourceObject: {fileID: 0}
  m_PrefabInstance: {fileID: 0}
  m_PrefabAsset: {fileID: 0}
  m_Name: Ms_010hsw_z
  m_Shader: {fileID: 4800000, guid: 11c3ef15b99017a42843980ca9ed079c, type: 3}
  m_ShaderKeywords: _FRESNELONLIGHT_ON _LIGHTTYPE_PLAYER _SHOWSHADOWTONLIGHT_ON _SWITCHGLOSSTEXTURE_ON
  m_LightmapFlags: 4
  m_EnableInstancingVariants: 0
  m_DoubleSidedGI: 0
  m_CustomRenderQueue: -1
  stringTagMap: {}
  disabledShaderPasses: []
  m_SavedProperties:
    serializedVersion: 3
    m_TexEnvs:
    - _AlbedoInfoTex:
        m_Texture: {fileID: 2800000, guid: a2ab38f130155594582803453f4a66cf, type: 3}
        m_Scale: {x: 1, y: 1}
        m_Offset: {x: 0, y: 0}
    - _FlowTex:
        m_Texture: {fileID: 0}
        m_Scale: {x: 1, y: 1}
        m_Offset: {x: 0, y: 0}
    - _GlossMaskTexture:
        m_Texture: {fileID: 2800000, guid: 07c498f98bc776748bfd53f8d5b2a567, type: 3}
        m_Scale: {x: 1, y: 1}
        m_Offset: {x: 0, y: 0}
    - _GlossTexture:
        m_Texture: {fileID: 2800000, guid: c41dc0849e392ab49a66c2a9dccbd392, type: 3}
        m_Scale: {x: 1.5, y: 1.5}
        m_Offset: {x: 0, y: 0}
    - _LightInfoTex:
        m_Texture: {fileID: 2800000, guid: 70d3958f7d434dd4bb61cf474659075b, type: 3}
        m_Scale: {x: 1, y: 1}
        m_Offset: {x: 0, y: 0}
    - _MainTex:
        m_Texture: {fileID: 2800000, guid: 09d9ce4cb43efa54193cb55701fbbeeb, type: 3}
        m_Scale: {x: 1, y: 1}
        m_Offset: {x: 0, y: 0}
    - _MaskControlTex:
        m_Texture: {fileID: 0}
        m_Scale: {x: 1, y: 1}
        m_Offset: {x: 0, y: 0}
    - _NormalTex:
        m_Texture: {fileID: 2800000, guid: 70d3958f7d434dd4bb61cf474659075b, type: 3}
        m_Scale: {x: 1, y: 1}
        m_Offset: {x: 0, y: 0}
    - _ShadowColorTex:
        m_Texture: {fileID: 2800000, guid: 09d9ce4cb43efa54193cb55701fbbeeb, type: 3}
        m_Scale: {x: 1, y: 1}
        m_Offset: {x: 0, y: 0}
    m_Floats:
    - _AOIntensity: 0.5
    - _AdjustLightDirectionalLight: 1
    - _BumpScale: 1
    - _CullMode: 2
    - _Cutoff: 0.5
    - _DetailNormalMapScale: 1
    - _DstBlend: 0
    - _EmissionIntensity: 0.7
    - _FresnelFill: 0.85
    - _FresnelIntensity: 0.101
    - _FresnelOnLight: 1
    - _FresnelOnShadowDark: 0
    - _GlossIntensity: 0
    - _GlossMapScale: 1
    - _GlossTextureHorizontalMoveSpeed: 0
    - _GlossTextureHorizontalOffset: 0
    - _GlossTextureHorizontaloffset: 0
    - _GlossTextureMoveSpeed: 1
    - _GlossTextureOffset: 2.2
    - _GlossTextureVerticalMoveSpeed: 1.6
    - _GlossTextureVerticalOffset: 6.75
    - _GlossTextureVerticaloffset: 0
    - _Glossiness: 0.5
    - _GlossyReflections: 1
    - _HardEdgeFresnel: 0
    - _LightFalloffAffectShadowT: 0
    - _LightType: 0
    - _MainTextureColorGloss: 0
    - _Metallic: 0
    - _Mode: 0
    - _OccludePower: 1
    - _OcclusionStrength: 1
    - _OutlineBlendToMainTexture: 0
    - _OutlineBlendTomainTexture: 0
    - _OutlineWidth: 1.13
    - _Parallax: 0.02
    - _ReflectionBlendToMainTexture: 0
    - _ReflectionFresnel: 1
    - _ReflectionIntensity: 0
    - _ReflectionMetallic: 0
    - _ReflectionOpacity: 1
    - _RenderingMode: 0
    - _RimDensity: 0.613
    - _RimFresnel: 1
    - _RimInDark: 0.691
    - _RimIntensity: 0.3
    - _RimLightFresnel: 1
    - _RimLightIntensity: 1
    - _RimLightThreshold: 0.158
    - _Saturation: 1
    - _SelfLitHighContrast: 0
    - _SelfLitIntensity: 1.5
    - _SelfLitPower: 10
    - _SelfShadowHardness: 1
    - _SelfShadowIntensity: 1
    - _SelfShadowSize: 0.56
    - _ShadowAddLight: 1
    - _ShadowColorTextureIntensity: 0
    - _ShadowColorTexturePower: 0
    - _ShadowIntensity: 0.47
    - _ShadowMapToggle: 0
    - _ShadowTIntensity: 0
    - _ShadowTLightSize: 0.5
    - _ShadowTShadowSize: 0
    - _ShadowThreshold: 0.46
    - _ShowFresnel: 0
    - _ShowGlossTexture: 0
    - _ShowRim: 0
    - _ShowShadowTOnLight: 1
    - _ShowShadowTOnSelfShadow: 0
    - _SmoothnessTextureChannel: 0
    - _SpecularHighlights: 1
    - _SpecularInShadow: 0.618
    - _SpecularIntensity: 0.68
    - _SpecularLightPercent: 0.95
    - _SpecularPower: 74
    - _SpecularThreshold: 0.47
    - _SrcBlend: 1
    - _Stencil: 0
    - _StencilComp: 8
    - _SwitchGlossTexture: 1
    - _UVSec: 0
    - _UseSceneLight: 0
    - _ZWrite: 1
    m_Colors:
    - _Ambient: {r: 0.8584906, g: 0.8584906, b: 0.8584906, a: 1}
    - _Color: {r: 1, g: 1, b: 1, a: 1}
    - _EmissionColor: {r: 0, g: 0, b: 0, a: 1}
    - _FlowColor: {r: 1, g: 1, b: 1, a: 1}
    - _FlowSpeed: {r: 1, g: 1, b: 1, a: 1}
    - _FresnelColor: {r: 0.06530787, g: 0.05437878, b: 0.245283, a: 1}
    - _LightColor: {r: 0.9433962, g: 0.9433962, b: 0.9433962, a: 1}
    - _MainCol: {r: 1.547405, g: 1.51091, b: 1.51091, a: 1}
    - _MainColor: {r: 1, g: 1, b: 1, a: 1}
    - _ModelAxis: {r: 0, g: 1, b: 0, a: 0}
    - _OccludeColor: {r: 0, g: 0, b: 1, a: 1}
    - _OutlineColor: {r: 0, g: 0, b: 0, a: 1}
    - _Outlinecolor: {r: 1, g: 1, b: 1, a: 1}
    - _RimColor: {r: 0.3964934, g: 0.4606278, b: 0.509434, a: 1}
    - _RimLightColor: {r: 1, g: 1, b: 1, a: 1}
    - _SelfLitColor: {r: 1, g: 1, b: 1, a: 1}
    - _SelfShadowColor: {r: 0, g: 0, b: 0, a: 1}
    - _ShadowColorAdjustment: {r: 0.7501974, g: 0.743859, b: 0.7924528, a: 1}
    - _ShadowOverrideColor: {r: 1, g: 1, b: 1, a: 1}
    - _SpecularColor: {r: 1, g: 1, b: 1, a: 1}
  m_BuildTextureStacks: []
