%YAML 1.1
%TAG !u! tag:unity3d.com,2011:
--- !u!21 &2100000
Material:
  serializedVersion: 6
  m_ObjectHideFlags: 0
  m_CorrespondingSourceObject: {fileID: 0}
  m_PrefabInstance: {fileID: 0}
  m_PrefabAsset: {fileID: 0}
  m_Name: Fx_blade_024_sjw_cq003
  m_Shader: {fileID: 202, guid: 0000000000000000f000000000000000, type: 0}
  m_ShaderKeywords: _DISSOLVEMODE_PARTICALDISSOLVE
  m_LightmapFlags: 4
  m_EnableInstancingVariants: 1
  m_DoubleSidedGI: 0
  m_CustomRenderQueue: -1
  stringTagMap: {}
  disabledShaderPasses: []
  m_SavedProperties:
    serializedVersion: 3
    m_TexEnvs:
    - _MainT:
        m_Texture: {fileID: 2800000, guid: 02963511d448be240a239006fe11dc55, type: 3}
        m_Scale: {x: -2.29, y: 1}
        m_Offset: {x: 1.73, y: 0}
    - _MainTex:
        m_Texture: {fileID: 2800000, guid: dcda6abdf999786478bb83d08a4bd8c9, type: 3}
        m_Scale: {x: 1, y: 1}
        m_Offset: {x: 0, y: 0}
    - _Noise_T:
        m_Texture: {fileID: 2800000, guid: 3ee44245938675845bda698f99372551, type: 3}
        m_Scale: {x: 1, y: 1}
        m_Offset: {x: 0, y: 0}
    m_Floats:
    - _BlendMode: 10
    - _Brightness: 1
    - _BumpScale: 1
    - _Contrast: 1
    - _Cutoff: 0.5
    - _DetailNormalMapScale: 1
    - _Dissolve: 0
    - _DissolveMode: 1
    - _DstBlend: 0
    - _EdgeWidth: 0
    - _FrenselValue: 1
    - _FresnelBrightness: 1
    - _FresnelMultiplyAlpha: 0
    - _GlossMapScale: 1
    - _Glossiness: 0.5
    - _GlossyReflections: 1
    - _Hardness: 0.21
    - _InvFade: 1
    - _MainTexPannerX: 0
    - _MainTexPannerY: 0
    - _Main_T_Offset_U: 0
    - _Main_T_Offset_V: 0
    - _Metallic: 0
    - _Mode: 0
    - _N_Power: 0
    - _Noise_T_Offset_U: 0
    - _Noise_T_Offset_V: 0
    - _OcclusionStrength: 1
    - _Offset_Z: 0
    - _Parallax: 0.02
    - _SmoothnessTextureChannel: 0
    - _SpecularHighlights: 1
    - _SrcBlend: 1
    - _TurbulencePower: 0
    - _TurbulenceTexPannerX: 0
    - _TurbulenceTexPannerY: 0
    - _UVSec: 0
    - _ZWrite: 1
    m_Colors:
    - _Color: {r: 1, g: 1, b: 1, a: 1}
    - _EdgeColor: {r: 0.07903168, g: 0.08007395, b: 0.4528302, a: 1}
    - _EmissionColor: {r: 0, g: 0, b: 0, a: 1}
    - _FrenselColor: {r: 1, g: 1, b: 1, a: 1}
    - _MainColor: {r: 2.519392, g: 2.519392, b: 2.519392, a: 1}
    - _TintColor: {r: 0.5, g: 0.5, b: 0.5, a: 0.5}
  m_BuildTextureStacks: []
