%YAML 1.1
%TAG !u! tag:unity3d.com,2011:
--- !u!21 &2100000
Material:
  serializedVersion: 6
  m_ObjectHideFlags: 0
  m_CorrespondingSourceObject: {fileID: 0}
  m_PrefabInstance: {fileID: 0}
  m_PrefabAsset: {fileID: 0}
  m_Name: Ms_048gddw_z1
  m_Shader: {fileID: 4800000, guid: 11c3ef15b99017a42843980ca9ed079c, type: 3}
  m_ShaderKeywords: _FRESNELONLIGHT_ON _LIGHTTYPE_ENEMY _REFLECTIONBLENDTOMAINTEXTURE_ON
    _SHOWSHADOWTONLIGHT_ON _SWITCHGLOSSTEXTURE_ON
  m_LightmapFlags: 4
  m_EnableInstancingVariants: 0
  m_DoubleSidedGI: 0
  m_CustomRenderQueue: -1
  stringTagMap: {}
  disabledShaderPasses: []
  m_SavedProperties:
    serializedVersion: 3
    m_TexEnvs:
    - _AlbedoInfoTex:
        m_Texture: {fileID: 2800000, guid: dd9588725a9824f42b1928f068a4667b, type: 3}
        m_Scale: {x: 1, y: 1}
        m_Offset: {x: 0, y: 0}
    - _FlowTex:
        m_Texture: {fileID: 0}
        m_Scale: {x: 1, y: 1}
        m_Offset: {x: 0, y: 0}
    - _GlossMaskTexture:
        m_Texture: {fileID: 0}
        m_Scale: {x: 1, y: 1}
        m_Offset: {x: 0, y: 0}
    - _GlossTexture:
        m_Texture: {fileID: 0}
        m_Scale: {x: 2, y: 2}
        m_Offset: {x: 1, y: 1}
    - _LightInfoTex:
        m_Texture: {fileID: 2800000, guid: 16f086f1d4e14c94ca4953357b29eea9, type: 3}
        m_Scale: {x: 1, y: 1}
        m_Offset: {x: 0, y: 0}
    - _MainTex:
        m_Texture: {fileID: 2800000, guid: 4742143a3ee32104fb2bafe18d98c03b, type: 3}
        m_Scale: {x: 1, y: 1}
        m_Offset: {x: 0, y: 0}
    - _MaskControlTex:
        m_Texture: {fileID: 0}
        m_Scale: {x: 1, y: 1}
        m_Offset: {x: 0, y: 0}
    - _NormalTex:
        m_Texture: {fileID: 2800000, guid: b96a9edc7fd005a4f97185dadb79eabd, type: 3}
        m_Scale: {x: 1, y: 1}
        m_Offset: {x: 0, y: 0}
    - _ShadowColorTex:
        m_Texture: {fileID: 2800000, guid: 9a108b715f1b4064f9c3c23a3da072a9, type: 3}
        m_Scale: {x: 1, y: 1}
        m_Offset: {x: 0, y: 0}
    m_Floats:
    - _AOIntensity: 0.5
    - _AdjustLightDirectionalLight: 1
    - _AdjustLightPointSpotlight: 1
    - _BumpScale: 1
    - _CullMode: 2
    - _Cutoff: 0.5
    - _DetailNormalMapScale: 1
    - _DstBlend: 0
    - _EmissionIntensity: 4
    - _FresnelFill: 0.85
    - _FresnelIntensity: 0.101
    - _FresnelOnLight: 1
    - _FresnelOnShadowDark: 0
    - _GlossIntensity: 2
    - _GlossMapScale: 1
    - _GlossTextureFollowLight: 1
    - _GlossTextureFollowObjectRotation: 0
    - _GlossTextureHorizontalMoveSpeed: 2
    - _GlossTextureHorizontalOffset: 0.45
    - _GlossTextureIntensity: 1
    - _GlossTextureRotate: 0
    - _GlossTextureVerticalMoveSpeed: 0
    - _GlossTextureVerticalOffset: 0.3
    - _Glossiness: 0.666
    - _GlossyReflections: 1
    - _HardEdgeFresnel: 0
    - _LightFalloffAffectShadowT: 0
    - _LightType: 1
    - _MainTextureColorGloss: 0
    - _Metallic: 0
    - _Mode: 0
    - _OccludePower: 1
    - _OcclusionStrength: 1
    - _OutlineBlendToMainTexture: 0
    - _OutlineWidth: 1.13
    - _Parallax: 0.02
    - _ReflectionBlendToMainTexture: 1
    - _ReflectionFresnel: 1
    - _ReflectionIntensity: 0.5
    - _ReflectionMetallic: 0
    - _ReflectionOpacity: 1
    - _RenderingMode: 0
    - _RimDensity: 0.4
    - _RimFresnel: 1
    - _RimInDark: 0.438
    - _RimIntensity: 0.4
    - _RimLightFresnel: 1
    - _RimLightIntensity: 1
    - _RimLightThreshold: 0.3
    - _Saturation: 1
    - _SaturationPointSpotlight: 0
    - _SelfLitHighContrast: 0
    - _SelfLitIntensity: 1.5
    - _SelfLitPower: 10
    - _SelfShadowHardness: 1
    - _SelfShadowIntensity: 1
    - _SelfShadowSize: 0.56
    - _SelfShadowatViewDirection: 0
    - _ShadowAddLight: 1
    - _ShadowColorTextureIntensity: 0
    - _ShadowColorTexturePower: 0
    - _ShadowIntensity: 0.5
    - _ShadowMapToggle: 0
    - _ShadowMaskGlossTexture: 1
    - _ShadowTIntensity: 0
    - _ShadowTLightSize: 0.5
    - _ShadowTShadowSize: 0
    - _ShadowThreshold: 0.5
    - _ShowColorTexture: 1
    - _ShowFresnel: 0
    - _ShowGlossTexture: 0
    - _ShowRim: 0
    - _ShowShadowTOnLight: 1
    - _ShowShadowTOnSelfShadow: 0
    - _SmoothnessTextureChannel: 0
    - _SoftGloss: 0
    - _SpecularHighlights: 1
    - _SpecularInShadow: 0.5
    - _SpecularIntensity: 0.6
    - _SpecularLightPercent: 0.8
    - _SpecularPower: 67
    - _SpecularThreshold: 0.51
    - _SrcBlend: 1
    - _Stencil: 0
    - _StencilComp: 8
    - _SwitchGlossTexture: 1
    - _UVSec: 0
    - _UseSceneLight: 0
    - _ZWrite: 1
    m_Colors:
    - _Ambient: {r: 0.8584906, g: 0.8584906, b: 0.8584906, a: 1}
    - _Color: {r: 1, g: 1, b: 1, a: 1}
    - _EmissionColor: {r: 0, g: 0, b: 0, a: 1}
    - _FlowColor: {r: 1, g: 1, b: 1, a: 1}
    - _FlowSpeed: {r: 1, g: 1, b: 1, a: 1}
    - _FresnelColor: {r: 0.1534895, g: 0.05490196, b: 0.2627451, a: 1}
    - _GlossColor: {r: 1, g: 1, b: 1, a: 1}
    - _LightColor: {r: 1, g: 1, b: 1, a: 1}
    - _MainCol: {r: 1.547405, g: 1.51091, b: 1.51091, a: 1}
    - _MainColor: {r: 1, g: 1, b: 1, a: 1}
    - _ModelAxis: {r: 0, g: 1, b: 0, a: 0}
    - _OccludeColor: {r: 0, g: 0, b: 1, a: 1}
    - _OutlineColor: {r: 0, g: 0, b: 0, a: 1}
    - _RimColor: {r: 0.3964934, g: 0.4606278, b: 0.509434, a: 1}
    - _RimLightColor: {r: 1, g: 1, b: 1, a: 1}
    - _SelfLitColor: {r: 1, g: 1, b: 1, a: 1}
    - _SelfShadowColor: {r: 0, g: 0, b: 0, a: 1}
    - _ShadowColorAdjustment: {r: 0.7328231, g: 0.7898439, b: 0.8679245, a: 1}
    - _ShadowOverrideColor: {r: 1, g: 1, b: 1, a: 1}
    - _SpecColor: {r: 0.2, g: 0.2, b: 0.2, a: 1}
    - _SpecularColor: {r: 1, g: 1, b: 1, a: 1}
  m_BuildTextureStacks: []
