%YAML 1.1
%TAG !u! tag:unity3d.com,2011:
--- !u!21 &2100000
Material:
  serializedVersion: 6
  m_ObjectHideFlags: 0
  m_CorrespondingSourceObject: {fileID: 0}
  m_PrefabInstance: {fileID: 0}
  m_PrefabAsset: {fileID: 0}
  m_Name: 849_add_ky
  m_Shader: {fileID: 202, guid: 0000000000000000f000000000000000, type: 0}
  m_ShaderKeywords: 
  m_LightmapFlags: 4
  m_EnableInstancingVariants: 1
  m_DoubleSidedGI: 0
  m_CustomRenderQueue: -1
  stringTagMap: {}
  disabledShaderPasses: []
  m_SavedProperties:
    serializedVersion: 3
    m_TexEnvs:
    - _MainTex:
        m_Texture: {fileID: 2800000, guid: 46565c517a3fe164395fe9d1a370af9c, type: 3}
        m_Scale: {x: 1, y: 1}
        m_Offset: {x: 0, y: 0}
    m_Floats:
    - _InvFade: 0.46
    - _MainTexBrightness: 2
    - _MainTexContrast: 2
    - _MainTexPannerX: 0
    - _MainTexPannerY: 0
    - _MaskTexDynmatic: 0
    - _MaskTexPannerX: 0
    - _MaskTexPannerY: 0
    - _NormalTexPannerX: 0
    - _NormalTexPannerY: 0
    - _UVEffectPower: 0
    m_Colors:
    - _MainColor: {r: 1, g: 0.5103444, b: 0.1179245, a: 0.5019608}
    - _TintColor: {r: 1, g: 0.4205002, b: 0, a: 0.5}
  m_BuildTextureStacks: []
