%YAML 1.1
%TAG !u! tag:unity3d.com,2011:
--- !u!21 &2100000
Material:
  serializedVersion: 6
  m_ObjectHideFlags: 0
  m_PrefabParentObject: {fileID: 0}
  m_PrefabInternal: {fileID: 0}
  m_Name: trail_007
  m_Shader: {fileID: 200, guid: 0000000000000000f000000000000000, type: 0}
  m_ShaderKeywords: 
  m_LightmapFlags: 5
  m_CustomRenderQueue: -1
  stringTagMap: {}
  m_SavedProperties:
    serializedVersion: 2
    m_TexEnvs:
    - first:
        name: _MASK
      second:
        m_Texture: {fileID: 0}
        m_Scale: {x: 1, y: 1}
        m_Offset: {x: 0, y: 0}
    - first:
        name: _MainTex
      second:
        m_Texture: {fileID: 2800000, guid: 5dd2fdc55ddf3ad43894f9710d5a6b2e, type: 3}
        m_Scale: {x: 2, y: 1}
        m_Offset: {x: 0, y: -0.15}
    - first:
        name: _Tex_Dis
      second:
        m_Texture: {fileID: 2800000, guid: 887d45145f23c924a94ff8fca910e1ad, type: 3}
        m_Scale: {x: 2, y: 1}
        m_Offset: {x: 0, y: 0}
    m_Floats:
    - first:
        name: _Color_Sweitch
      second: 0
    - first:
        name: _Dis_U_Speed
      second: -10
    - first:
        name: _Dis_V_Speed
      second: -5
    - first:
        name: _Disturbance
      second: 2
    - first:
        name: _InvFade
      second: 1
    - first:
        name: _Power
      second: 1
    - first:
        name: _U_Sapeed
      second: 0
    - first:
        name: _V_Speed
      second: 0
    - first:
        name: _ZT
      second: 1
    m_Colors:
    - first:
        name: _TintColor
      second: {r: 0.58823526, g: 0.58823526, b: 0.58823526, a: 0.5}
