%YAML 1.1
%TAG !u! tag:unity3d.com,2011:
--- !u!21 &2100000
Material:
  serializedVersion: 6
  m_ObjectHideFlags: 0
  m_PrefabParentObject: {fileID: 0}
  m_PrefabInternal: {fileID: 0}
  m_Name: magic_eff_508
  m_Shader: {fileID: 4800000, guid: 26008f7e78c01a84bb856aae49df31b0, type: 3}
  m_ShaderKeywords: 
  m_LightmapFlags: 5
  m_CustomRenderQueue: 3002
  stringTagMap: {}
  m_SavedProperties:
    serializedVersion: 2
    m_TexEnvs:
    - first:
        name: _MASK
      second:
        m_Texture: {fileID: 2800000, guid: 073825c498db0dd4794e52b1fb4771a6, type: 3}
        m_Scale: {x: 1, y: 1}
        m_Offset: {x: 0, y: 0}
    - first:
        name: _MainTex
      second:
        m_Texture: {fileID: 2800000, guid: 073825c498db0dd4794e52b1fb4771a6, type: 3}
        m_Scale: {x: 1, y: 1}
        m_Offset: {x: 0, y: 0}
    - first:
        name: _TEX
      second:
        m_Texture: {fileID: 2800000, guid: 073825c498db0dd4794e52b1fb4771a6, type: 3}
        m_Scale: {x: 1, y: 1}
        m_Offset: {x: 0, y: 0}
    - first:
        name: _Tex
      second:
        m_Texture: {fileID: 2800000, guid: 073825c498db0dd4794e52b1fb4771a6, type: 3}
        m_Scale: {x: 1, y: 1}
        m_Offset: {x: 0, y: 0}
    - first:
        name: _liuguang
      second:
        m_Texture: {fileID: 2800000, guid: 6475569e57de23843b4c52854998a6af, type: 3}
        m_Scale: {x: 1, y: 1}
        m_Offset: {x: 0, y: 0}
    - first:
        name: _word
      second:
        m_Texture: {fileID: 2800000, guid: 073825c498db0dd4794e52b1fb4771a6, type: 3}
        m_Scale: {x: 1, y: 1}
        m_Offset: {x: 0, y: 0}
    m_Floats:
    - first:
        name: _Alpha
      second: 1
    - first:
        name: _Cutoff
      second: 0.5
    - first:
        name: _FresnelBright
      second: 3
    - first:
        name: _FresnelEXP
      second: 3
    - first:
        name: _Fresnel_Exp
      second: 18.11
    - first:
        name: _Fresnel_ZT
      second: 5.96
    - first:
        name: _InvFade
      second: 1
    - first:
        name: _TexBright
      second: 1
    - first:
        name: _TexPower
      second: 1
    - first:
        name: _TexSpeed
      second: 1
    - first:
        name: _UorV
      second: 0
    - first:
        name: _Word
      second: 0
    - first:
        name: _WordBright
      second: 2
    - first:
        name: _ZT
      second: 1.5
    - first:
        name: _liuguang_sudu
      second: 2
    - first:
        name: _mask
      second: 2
    m_Colors:
    - first:
        name: _Color
      second: {r: 0, g: 1, b: 0.83448267, a: 1}
    - first:
        name: _FresnelColor
      second: {r: 0.5, g: 0.3, b: 1, a: 1}
    - first:
        name: _Fresnel_Color
      second: {r: 0, g: 0.42068958, b: 1, a: 1}
    - first:
        name: _TintColor
      second: {r: 1, g: 1, b: 1, a: 1}
    - first:
        name: _WordColor
      second: {r: 0.5, g: 0.5, b: 0.5, a: 1}
