{
  "en": {
    "greeting": "Hello",
    "message": "Welcome to our application!",
    "button": "Click Me",
    "error": "An error occurred",
    "success": "Operation successful"
    // Add more key-value pairs as needed
  },
  "fr": {
    "greeting": "Bonjour",
    "message": "Bienvenue dans notre application !",
    "button": "Cliquez ici",
    "error": "Une erreur est survenue",
    "success": "Opération réussie"
    // Add more key-value pairs as needed
  },
  "es": {
    "greeting": "Hola",
    "message": "¡Bienvenido a nuestra aplicación!",
    "button": "Haz clic aquí",
    "error": "Se ha producido un error",
    "success": "Operación exitosa"
    // Add more key-value pairs as needed
  }
  // Add more language translations as needed
}
