62171 497128 449
224973 307971 443
400197 586849 470
916488 803053 525
607145 489814 470
863593 746495 525
833601 197428 509
344564 681255 509
178739 836812 509
20173 892341 525
471124 859504 525
255035 137163 443
802446 420939 509
714503 129804 509
889916 612813 525
231621 454334 449
827022 675634 504
600585 698293 509
640324 339629 509
923432 593024 525
249063 161744 443
182062 344555 443
431835 749640 509
722550 575403 509
804561 317481 509
81824 755395 509
952377 908725 507
117175 170407 383
324187 312743 371
246447 622538 470
523884 916984 525
238473 934838 525
591587 950117 525
595104 668142 509
9633 573279 470
190313 46757 383
695885 476763 509
612957 157273 470
160097 424999 449
779456 266535 509
395021 613819 470
138960 926758 525
331430 668250 509
63718 85388 351
888604 259811 525
296062 125648 443
208316 655471 509
659888 361553 509
82160 320914 443
24529 217097 386
181154 712288 509
922132 76433 525
951963 712149 525
838532 390592 525
138978 608361 470
129135 379524 443
808538 375345 509
559581 231053 470
159124 917638 525
200966 507783 449
986184 129063 525
667292 623551 509
833292 728807 468
262472 437064 449
88603 942276 525
315728 32366 443
964856 478401 525
879006 368162 525
203713 248515 443
602898 986693 525
125903 475883 449
990016 177792 525
47539 391615 443
594424 850482 525
883252 319823 525
692488 355527 509
889376 925357 476
237824 435077 449
807590 655880 504
406943 409481 312
640948 850889 525
137859 369712 443
498666 437919 444
374678 327843 441
784971 42900 509
201359 325193 443
756482 156295 509
832494 514150 509
159799 896454 525
404581 674712 509
600965 57562 470
986124 635802 525
5077 659023 509
662257 299157 509
895506 642176 525
690364 465063 509
7009 260919 443
456829 723385 509
238146 30430 443
161287 222195 386
255143 908352 525
824000 528932 509
237351 37327 443
350272 425713 449
692136 116251 509
571707 847671 525
520881 223791 470
775101 164522 509
389730 407900 405
438692 126480 449
714542 620124 509
560797 253381 470
589860 301563 470
342070 901560 525
984189 1060 525
643406 157249 509
523467 799386 509
277155 460431 449
100802 575301 470
445106 630354 509
551901 244458 470
330147 970040 525
550044 907327 525
273591 501198 449
946762 328324 525
488619 275172 449
578959 316831 470
296675 698051 509
256280 439557 449
411763 490911 444
682959 796625 504
48327 271543 443
16742 241773 443
770765 915231 525
264997 424374 449
362056 695755 509
502508 984266 525
589910 842819 525
183508 392483 443
607886 39844 470
28933 675228 509
741903 545961 509
896857 9774 525
451490 315736 449
29857 587133 470
514420 211993 470
509589 437874 444
503027 708475 509
677021 786204 504
934472 562570 525
521619 441574 470
233533 904368 525
337328 568477 470
330918 734545 509
584287 66456 470
809549 549260 509
77978 353769 443
956898 254140 525
713825 500232 509
883899 86811 525
702368 150790 509
354513 43103 443
637755 486420 509
165765 637875 509
323164 883785 525
327228 71985 443
627315 807330 504
93476 404364 443
376842 211015 443
666843 895129 525
970660 105864 525
637852 410966 509
534624 535881 315
885304 803687 525
530732 976133 525
431041 8285 449
776347 838630 525
615174 798955 509
868845 636355 525
592330 135504 470
825214 255827 509
107334 521401 470
923093 1265 525
980673 468847 525
738661 582591 509
549592 897572 525
836236 39064 509
198537 30318 383
980058 715489 525
45813 824848 509
371488 928912 525
228406 738509 509
145146 775952 509
128011 631507 509
255877 818867 509
458989 512724 470
529465 456236 470
965101 320429 525
379891 216713 443
867910 369940 525
288333 893311 525
150348 579046 470
395891 881288 525
669511 646192 442
633145 957859 525
881932 674413 525
465087 440229 444
677620 787597 504
33401 729599 509
367247 455945 449
607697 388815 470
290953 12438 443
917921 767528 525
633235 747900 504
263380 448151 449
87698 990312 525
291111 952504 525
7525 645871 509
875940 573062 525
456121 900483 525
644408 426217 509
399974 678488 509
869658 144429 525
