756 512
243 687
920 197
134 845
632 426
513 295
981 799
417 724
961 44
219 375
904 534
192 645
438 828
142 703
560 489
609 768
697 878
294 660
984 314
252 312
707 718
329 530
555 843
758 825
119 706
992 843
748 262
403 602
769 720
366 570
307 169
752 679
950 175
546 137
772 765
108 18
820 223
474 753
802 421
552 10
87 378
888 121
628 200
1000 585
991 355
34 951
612 442
553 292
663 718
657 562
758 99
149 82
739 98
531 738
327 510
131 830
234 358
341 977
321 496
493 858
998 777
525 816
321 390
640 264
985 791
617 594
891 156
348 204
886 122
563 348
740 168
573 465
720 184
660 309
719 518
799 378
220 98
944 498
330 573
736 11
309 682
108 596
411 870
378 159
948 581
625 674
999 843
352 971
471 183
979 777
512 952
512 267
996 718
289 567
472 511
682 820
361 137
774 490
908 982
799 19
674 981
809 498
429 797
887 113
36 314
603 296
305 417
596 141
239 332
828 94
532 875
671 76
721 769
888 345
199 197
536 723
793 700
876 527
400 858
80 651
873 553
229 331
390 935
619 507
940 917
798 496
559 392
666 321
140 290
816 359
616 355
137 902
98 197
971 617
848 71
852 303
346 376
688 374
951 329
722 865
665 109
113 546
859 439
586 429
460 191
387 92
674 284
893 176
994 694
908 247
572 140
618 990
812 148
366 303
43 610
227 733
486 974
319 133
794 861
579 642
370 183
678 762
836 267
108 816
22 956
267 500
109 982
726 289
656 992
553 158
527 690
735 497
864 124
42 137
238 447
549 209
732 960
116 874
225 706
388 965
367 717
272 562
110 454
776 30
539 680
481 732
442 317
862 925
711 936
214 15
696 651
390 82
227 930
178 636
177 782
355 284
730 211
737 704
909 816
44 583
973 383
135 666
159 944
762 712
952 709
496 673
272 289
700 153
946 91
856 608
1000 608
783 970
330 692
772 471
970 630
559 97
11 937
205 105
164 499
371 497
273 44
655 484
279 301
437 341
454 739
160 998
523 456
472 361
496 380
16 147
742 907
982 916
463 76
834 955
128 634
116 739
272 740
542 787
472 388
735 259
592 122
812 452
140 821
841 34
952 642
997 196
41 684
161 845
333 178
869 979
337 105
238 285
267 423
916 150
216 86
742 640
197 112
848 422
551 283
200 746
511 424
689 16
262 398
16 10
541 784
282 365
512 169
654 372
982 785
1000 220
800 896
243 250
343 985
556 263
91 146
871 870
255 527
258 198
21 676
787 190
568 136
840 100
974 581
911 236
752 489
780 383
551 73
920 696
227 259
923 777
998 721
936 562
931 852
239 774
548 618
137 109
598 966
991 631
470 145
49 98
908 10
437 758
898 439
728 676
469 773
758 380
882 738
