443474 663270 509
130721 883195 525
9755 356742 443
790623 787326 406
9715 684937 509
850817 859717 419
115548 292730 443
38756 478647 449
658263 134031 509
269161 852882 525
156435 451120 449
749949 619457 509
330287 35879 443
742319 281133 509
10845 421332 449
553454 141333 470
829264 497854 509
192238 221799 386
258715 411573 449
646260 100659 509
82814 154567 375
699142 697409 367
751917 548866 509
891014 27522 525
185529 164415 365
118530 844373 525
574873 725816 509
680229 765856 504
239715 292320 407
729541 25385 509
204960 194115 360
415859 887803 525
729259 124689 509
583552 250782 470
277064 353500 441
185602 852294 525
879916 879535 357
740169 444791 509
571440 606066 434
832810 879624 525
357353 725314 509
548030 603038 434
475187 787290 509
801844 241137 509
324794 270676 389
326844 546598 470
75641 297345 443
739477 177924 509
276812 536816 470
826555 523317 509
401692 160674 443
702477 38376 509
859846 321082 525
448266 384915 449
40262 771869 509
713746 2418 509
265609 71593 443
662301 317728 509
639449 593739 509
636296 861286 525
703971 565091 509
60933 518594 470
29942 849926 525
284335 317478 389
30968 74085 340
214185 661982 509
89512 641305 509
742939 287666 509
150295 433915 449
613483 99276 470
553422 571794 421
82528 343453 443
281443 475014 449
201668 652232 509
187497 860949 525
168931 152683 383
640214 125976 509
436687 581934 470
220709 47816 386
31330 777231 509
281377 238791 407
873572 833749 525
884128 298192 525
195177 742940 509
92622 599418 470
568329 672226 509
243473 876037 525
306678 601161 470
372025 468912 449
266781 464782 449
149180 61784 375
749162 16930 509
338927 889831 525
504076 563139 470
867167 507634 525
713770 514190 509
113445 294953 443
498506 196462 449
843412 481788 525
333451 325657 353
64296 403932 443
866538 714734 525
217910 267506 443
399240 746065 509
478643 476769 382
291610 229102 443
198041 138844 383
492831 254213 449
571987 73695 470
22588 479920 449
50097 445470 449
762823 105087 509
794827 120228 509
527517 660189 509
882430 426640 525
280932 409223 441
463886 95749 449
14506 346957 443
247136 694265 509
783294 840718 525
122636 697983 509
622984 706954 509
161666 235372 443
851062 872838 432
257013 763057 509
556153 854511 525
86303 645844 509
481881 242741 449
62049 831043 509
690336 683723 398
790705 569269 509
273446 608871 470
761615 515271 509
857029 431535 525
436222 141870 449
136187 624867 470
230395 454116 449
810118 462056 509
881484 51885 525
723499 839294 525
322443 600789 470
844644 789667 525
383996 769854 509
755956 847095 525
632488 876321 525
781371 341426 509
755845 311918 509
421190 407089 449
82647 738946 509
892220 376079 525
55943 556821 470
851617 496954 525
147980 698135 509
621457 532166 452
487590 800312 509
324691 583261 470
743318 582400 509
93286 761129 509
267714 596491 470
53502 710697 509
134405 894455 525
369373 184046 443
498505 673062 509
49774 129508 354
658441 525150 509
321948 624898 470
840328 170872 525
492445 139360 449
860854 838309 419
245989 780812 509
297735 229626 443
510095 166904 449
328341 879827 525
128481 49977 354
483615 837985 525
18350 726813 509
480125 32530 449
388554 239582 441
714959 407429 509
497174 188659 449
784159 639668 504
150027 105118 375
4630 724677 509
842726 607483 525
157448 102256 383
285163 360292 441
765074 26761 509
733855 698429 504
213279 434712 449
201042 380028 443
549565 742926 509
127783 219870 386
417727 264044 449
60865 707911 509
660319 868735 525
390456 296170 441
722647 196301 509
337510 719072 509
731411 185640 509
44362 715224 509
307875 339267 384
217036 618841 470
884211 894762 445
884168 283096 525
399172 443143 449
11001 71574 340
250700 573562 470
667724 852277 525
54779 426833 449
99776 662625 509
67799 841146 525
118153 731917 509
769527 308165 509
460073 561325 470
739105 768701 468
365150 266281 441
31685 306102 443
647570 30805 509
200647 186091 360
420156 672696 509
730443 736483 424
751184 785082 468
842819 241677 525
7126 511385 449
859683 396432 525
666766 636824 442
84008 342699 443
335020 329089 353
618353 339568 470
305632 406419 441
544107 146827 470
410196 558612 470
133258 386788 443
349390 23764 443
623956 518833 452
643922 410091 509
497940 820815 509
229025 770010 509
729813 730379 380
683855 424860 509
438696 727121 509
258732 50261 443
826399 513720 509
234808 535821 470
896277 152412 525
576849 887888 525
92439 348723 443
804032 355144 509
516428 495032 470
604821 399411 470
809286 594501 509
665460 833019 504
342387 877460 525
871929 456683 525
623254 509559 470
106723 374776 443
451433 797783 509
719713 109360 509
276738 698944 509
254836 514050 470
275878 170376 443
348552 755383 509
521842 47548 470
793181 553983 509
817265 787667 468
792910 241294 509
443209 828061 509
154573 818342 509
282507 483517 449
344913 236815 407
90751 182557 383
896732 637526 525
445359 118298 449
518606 475872 470
461754 663022 509
104834 581755 470
400249 161318 443
802776 526600 509
589318 798638 509
226814 146224 386
447887 419213 418
695945 685848 442
666562 891960 525
46821 117651 354
421522 209320 449
243495 153826 443
553340 427749 470
16000 111287 354
33911 393366 443
223698 838254 525
342351 43231 443
501728 149852 449
541912 130220 470
447362 574364 470
127101 888236 525
845229 276950 525
865627 508220 525
560627 235688 470
570072 240908 470
740815 343147 509
