[
  {
    "idAttributeConfiguration": 70,
    "codeAttributeContext": "ME",
    "codeAttributeSecurityContext": "MELANOMA",
    "extensionDescription": "Medical Event Extension",
    "idFilter1": 23,
    "filter1Display": "Lymphatic Surgery",
    "requireFilter1": "Y",
    "requireFilter2": "N"
  },
  {
    "idAttributeConfiguration": 88,
    "codeAttributeContext": "ME",
    "codeAttributeSecurityContext": "BMT",
    "extensionDescription": "Medical Event Extension",
    "idFilter1": 34,
    "filter1Display": "Transplant",
    "requireFilter1": "Y",
    "requireFilter2": "N"
  }
]
