<?xml version="1.0" encoding="utf-8"?>
<svg version="1.1" id="Layer_1" xmlns="http://www.w3.org/2000/svg" xmlns:xlink="http://www.w3.org/1999/xlink" x="0px" y="0px"
	 viewBox="0 0 512 256" style="enable-background:new 0 0 512 256;" xml:space="preserve">
<g>
	<path d="M344.6,93.9c2.4,5.6,3.6,12.7,3.6,21.2c0,15.1-5.5,27-16.6,35.6c-11.1,8.6-27.8,12.9-50,12.9c-10.3,0-20.7-1.1-31.2-3.2
		c-10.5-2.1-19-4.9-25.6-8.5v-46.2c8.4,4.8,17.2,8.4,26.6,10.8c9.3,2.4,18,3.6,25.9,3.6c4.5,0,7.7-0.4,9.6-1.3
		c1.9-0.9,2.9-2.3,2.9-4.3c0-2.7-1.5-5-4.5-6.8c-3-1.9-9.3-5-19.1-9.3C251.9,92,241.5,85,235,77.3c-6.5-7.7-9.8-17.1-9.8-28.2
		c0-9.6,2.7-18.1,8-25.5c5.3-7.4,12.8-13.2,22.4-17.4c9.6-4.2,20.7-6.3,33.1-6.3c10.2,0,19.2,0.8,27.2,2.5
		c7.9,1.7,15.5,4.2,22.7,7.6v44.6c-13.5-7.5-26.8-11.2-39.9-11.2c-10.6,0-15.9,2.3-15.9,7c0,2.2,1.2,4.1,3.7,5.6
		c2.5,1.5,6.9,3.5,13.3,6.1l8.3,3.4c10.6,4.5,18.8,8.9,24.5,13.3C338.1,83.3,342.2,88.3,344.6,93.9z M118.3,108.9l31,51.2H90.4v0
		l-18.9-40.8H52.1V160H0V2.7h76.1c21.4,0,37.9,4.9,49.6,14.7s17.5,23.7,17.5,41.6c0,11.4-2.1,21.3-6.4,29.7
		C132.5,97.2,126.3,103.9,118.3,108.9z M93.8,60.6c0-5.8-1.5-10.4-4.6-13.6c-3.1-3.2-7.4-4.8-13.1-4.8h-24v37.5h24
		c5.7,0,10.1-1.7,13.1-5C92.3,71.3,93.8,66.6,93.8,60.6z M158.1,160h52.1V2.7h-52.1V160z M512,160h-58.8l-18.9-40.8h-19.5V160h-52.1
		V2.7h76.1c21.4,0,37.9,4.9,49.6,14.7c11.7,9.8,17.5,23.7,17.5,41.6c0,11.4-2.1,21.3-6.4,29.7c-4.3,8.5-10.4,15.2-18.5,20.1L512,160
		z M456.6,60.6c0-5.8-1.5-10.4-4.6-13.6c-3.1-3.2-7.4-4.8-13.1-4.8h-24v37.5h24c5.7,0,10.1-1.7,13.1-5
		C455,71.3,456.6,66.6,456.6,60.6z"/>
	<path d="M19.1,201.7c2.4-0.8,4.2-2.2,5.4-4c1.3-1.9,1.9-4.1,1.9-6.8c0-3.6-1.2-6.4-3.5-8.3c-2.3-2-5.6-2.9-9.8-2.9H0V213h4.6v-10.4
		h8.5c0.5,0,1.1,0,1.9-0.1l6.7,10.5v0h5.3L19.1,201.7z M13.1,198.4H4.6v-14.7h8.5c2.9,0,5.1,0.6,6.6,1.8s2.3,3,2.3,5.4
		c0,2.4-0.8,4.3-2.3,5.6S16,198.4,13.1,198.4z"/>
	<path d="M57.3,200.7c0-4.1-1-7.3-3-9.6c-2-2.3-5-3.5-8.9-3.5c-2.5,0-4.6,0.6-6.6,1.7c-1.9,1.1-3.4,2.6-4.5,4.5
		c-1.1,1.9-1.6,4.1-1.6,6.6c0,2.5,0.5,4.7,1.6,6.7c1.1,1.9,2.6,3.4,4.5,4.5s4.1,1.6,6.6,1.6c2.1,0,4.1-0.4,5.8-1.1
		c1.7-0.7,3.2-1.8,4.5-3.1l-2.4-2.5c-1,1-2.1,1.8-3.4,2.3c-1.3,0.5-2.7,0.8-4.2,0.8c-2.3,0-4.2-0.7-5.7-2c-1.6-1.3-2.5-3.1-2.9-5.4
		h20C57.2,201.8,57.3,201.3,57.3,200.7z M53.2,198.7H37.2c0.3-2.3,1.2-4.1,2.7-5.4c1.5-1.3,3.3-2,5.6-2c2.3,0,4.1,0.7,5.5,2
		C52.3,194.5,53.1,196.4,53.2,198.7L53.2,198.7z"/>
	<path d="M78.2,193.3l1.6-3.4c-1.1-0.7-2.4-1.3-3.9-1.7s-3-0.6-4.5-0.6c-2.6,0-4.7,0.6-6.5,1.8c-1.7,1.2-2.6,3-2.6,5.3
		c0,1.5,0.4,2.8,1.1,3.7c0.8,1,1.7,1.7,2.7,2.2c1.1,0.5,2.4,1,4.1,1.5c1.9,0.6,3.3,1.1,4.3,1.7c0.9,0.6,1.4,1.4,1.4,2.6
		c0,1.1-0.4,1.9-1.3,2.5c-0.9,0.5-2.1,0.8-3.5,0.8s-3-0.3-4.5-0.9c-1.5-0.6-2.8-1.3-3.9-2.3l-1.7,3.3c1.2,1.1,2.7,2,4.5,2.6
		c1.8,0.6,3.6,0.9,5.5,0.9c2.7,0,4.9-0.6,6.7-1.9c1.8-1.2,2.7-3.1,2.7-5.4c0-1.6-0.4-2.9-1.2-3.9c-0.8-1-1.7-1.7-2.9-2.3
		c-1.1-0.5-2.5-1-4.3-1.5c-1.8-0.5-3.2-1.1-4.1-1.6s-1.4-1.3-1.4-2.3s0.4-1.8,1.2-2.3c0.8-0.5,1.9-0.7,3.2-0.7
		c1.2,0,2.4,0.2,3.6,0.6C76,192.2,77.1,192.7,78.2,193.3z"/>
	<path d="M109.5,200.7c0-4.1-1-7.3-3-9.6c-2-2.3-5-3.5-8.9-3.5c-2.5,0-4.6,0.6-6.6,1.7c-1.9,1.1-3.4,2.6-4.5,4.5
		c-1.1,1.9-1.6,4.1-1.6,6.6c0,2.5,0.5,4.7,1.6,6.7c1.1,1.9,2.6,3.4,4.5,4.5s4.1,1.6,6.6,1.6c2.1,0,4.1-0.4,5.8-1.1
		c1.7-0.7,3.2-1.8,4.5-3.1l-2.4-2.5c-1,1-2.1,1.8-3.4,2.3c-1.3,0.5-2.7,0.8-4.2,0.8c-2.3,0-4.2-0.7-5.7-2c-1.6-1.3-2.5-3.1-2.9-5.4
		h20C109.5,201.8,109.5,201.3,109.5,200.7z M105.5,198.7H89.4c0.3-2.3,1.2-4.1,2.7-5.4c1.5-1.3,3.3-2,5.6-2c2.3,0,4.1,0.7,5.5,2
		C104.6,194.5,105.3,196.4,105.5,198.7L105.5,198.7z"/>
	<path d="M132.1,213h4.4l-0.1-16.6c0-2.8-0.9-4.9-2.6-6.5c-1.7-1.6-4.2-2.3-7.3-2.3c-2.2,0-4,0.3-5.5,0.8c-1.6,0.5-3.2,1.4-5.1,2.6
		l1.9,3.1c2.6-1.8,5.3-2.7,7.8-2.7c2.1,0,3.7,0.5,4.8,1.5c1.1,1,1.7,2.3,1.7,4.1v1.2h-8c-3,0-5.3,0.7-7,2c-1.7,1.3-2.5,3.1-2.5,5.4
		c0,1.5,0.4,2.8,1.1,4c0.7,1.2,1.7,2.1,3.1,2.8c1.3,0.7,2.9,1,4.6,1c4,0,7-1.2,8.8-3.7V213L132.1,213z M132,204
		c-0.3,1.7-1.2,3-2.6,4c-1.5,1-3.2,1.5-5.3,1.5c-1.7,0-3-0.4-4-1.1s-1.5-1.8-1.5-3.1c0-1.3,0.5-2.3,1.5-2.9c1-0.6,2.5-0.9,4.5-0.9
		h7.4V204z"/>
	<path d="M149.9,193.2v-5.4h-4.5V213h4.5v-13.3c0.2-2.4,1.1-4.4,2.7-5.8c1.6-1.4,3.7-2.1,6.3-2v-4.3c-2.1,0-3.9,0.5-5.4,1.5
		C151.9,190,150.7,191.4,149.9,193.2z"/>
	<path d="M182.6,194.4l2.4-3.1c-1.1-1.2-2.6-2.2-4.3-2.9c-1.7-0.6-3.6-1-5.8-1c-2.5,0-4.6,0.5-6.6,1.6c-1.9,1.1-3.4,2.6-4.5,4.5
		c-1.1,1.9-1.6,4.2-1.6,6.7c0,2.5,0.5,4.7,1.6,6.6s2.6,3.4,4.5,4.5s4.1,1.6,6.6,1.6c2.2,0,4.2-0.4,6-1.1c1.8-0.8,3.2-1.9,4.4-3.3
		l-2.5-2.6c-0.9,1-1.9,1.8-3.3,2.3c-1.3,0.5-2.8,0.8-4.4,0.8c-1.6,0-3.1-0.4-4.3-1.1c-1.3-0.8-2.3-1.8-3-3.1
		c-0.7-1.3-1.1-2.9-1.1-4.6c0-1.8,0.4-3.3,1.1-4.6c0.7-1.3,1.7-2.4,3-3.1c1.3-0.7,2.8-1.1,4.4-1.1
		C178.1,191.5,180.5,192.5,182.6,194.4z"/>
	<path d="M207.1,187.6c-4.7,0.1-8,1.9-9.7,5.6v-15.6h-4.5V213h4.5v-12.4c0-2.6,0.7-4.7,2.2-6.3c1.4-1.6,3.4-2.5,5.8-2.5
		c2.1,0,3.8,0.6,4.9,1.8c1.2,1.2,1.8,2.9,1.8,5V213h4.5v-15.6c0-3.1-0.9-5.5-2.5-7.2C212.3,188.4,210,187.6,207.1,187.6z"/>
	<rect x="239.6" y="179.5" width="4.6" height="33.5"/>
	<path d="M268.4,187.6c-4.7,0.1-7.9,1.9-9.6,5.5v-5.4h-4.5V213h4.5v-13.5c0.2-2.3,1-4.1,2.4-5.5c1.4-1.4,3.3-2.2,5.5-2.2
		c2.1,0,3.8,0.6,4.9,1.8c1.2,1.2,1.8,2.9,1.8,5V213h4.5v-15.6c0-3.1-0.9-5.5-2.5-7.2C273.7,188.4,271.4,187.6,268.4,187.6z"/>
	<path d="M296.2,181.2c1,0,2.1,0.3,3.3,0.8l1.1-3.6c-1.5-0.8-3-1.1-4.4-1.1c-1.5,0-2.8,0.3-4.1,1c-1.3,0.6-2.3,1.6-3.1,2.9
		c-0.8,1.3-1.2,2.9-1.2,4.7v2.7h-3.3v3.4h3.3v21h4.5v-21h7v-3.4h-7v-3.3c0-1.3,0.4-2.3,1.1-3C294.1,181.6,295.1,181.2,296.2,181.2z"
		/>
	<path d="M325.7,193.7c-1.1-1.9-2.6-3.4-4.6-4.5c-2-1.1-4.2-1.6-6.7-1.6c-2.6,0-4.8,0.5-6.8,1.6c-2,1.1-3.5,2.6-4.6,4.5
		c-1.1,1.9-1.7,4.1-1.7,6.6c0,2.5,0.6,4.7,1.7,6.7s2.6,3.4,4.6,4.5c2,1.1,4.2,1.6,6.8,1.6c2.5,0,4.8-0.5,6.7-1.6
		c2-1.1,3.5-2.6,4.6-4.5c1.1-1.9,1.7-4.2,1.7-6.7C327.3,197.8,326.8,195.6,325.7,193.7z M321.8,205.1c-0.7,1.4-1.7,2.4-3,3.2
		c-1.3,0.8-2.7,1.1-4.4,1.1c-1.7,0-3.1-0.4-4.4-1.1c-1.3-0.8-2.3-1.8-3-3.2c-0.7-1.4-1.1-2.9-1.1-4.7c0-1.7,0.4-3.3,1.1-4.6
		s1.7-2.4,3-3.2c1.3-0.8,2.8-1.1,4.4-1.1c1.6,0,3.1,0.4,4.4,1.1c1.3,0.8,2.3,1.8,3,3.2s1.1,2.9,1.1,4.6
		C322.8,202.1,322.5,203.7,321.8,205.1z"/>
	<path d="M339,193.2v-5.4h-4.5V213h4.5v-13.3c0.2-2.4,1.1-4.4,2.7-5.8c1.6-1.4,3.7-2.1,6.3-2v-4.3c-2.1,0-3.9,0.5-5.4,1.5
		C341.1,190,339.9,191.4,339,193.2z"/>
	<path d="M386.6,187.6c-5,0.1-8.3,2.2-9.8,6.4c-0.5-2-1.6-3.6-3.1-4.7c-1.6-1.1-3.5-1.7-5.8-1.7c-4.6,0.1-7.8,1.9-9.4,5.4v-5.3h-4.5
		V213h4.5v-12.5c0-2.5,0.7-4.6,2.1-6.3c1.4-1.6,3.3-2.5,5.7-2.5c2.1,0,3.7,0.6,4.8,1.8c1.1,1.2,1.7,2.9,1.7,5V213h4.5v-12.5
		c0-2.5,0.7-4.6,2.1-6.3c1.4-1.6,3.3-2.5,5.6-2.5c2,0,3.7,0.6,4.8,1.8c1.2,1.2,1.7,2.9,1.7,5V213h4.5v-15.6c0-3-0.8-5.4-2.5-7.2
		C391.8,188.5,389.5,187.6,386.6,187.6z"/>
	<path d="M420.4,213h4.4l-0.1-16.6c0-2.8-0.9-4.9-2.6-6.5c-1.7-1.6-4.2-2.3-7.3-2.3c-2.2,0-4,0.3-5.5,0.8s-3.2,1.4-5.1,2.6l1.9,3.1
		c2.6-1.8,5.3-2.7,7.8-2.7c2.1,0,3.7,0.5,4.8,1.5c1.1,1,1.7,2.3,1.7,4.1v1.2h-8c-3,0-5.3,0.7-7,2c-1.7,1.3-2.5,3.1-2.5,5.4
		c0,1.5,0.4,2.8,1.1,4c0.7,1.2,1.7,2.1,3.1,2.8c1.3,0.7,2.9,1,4.6,1c4,0,7-1.2,8.8-3.7V213L420.4,213z M420.3,204
		c-0.3,1.7-1.2,3-2.6,4c-1.5,1-3.2,1.5-5.3,1.5c-1.7,0-3-0.4-4-1.1s-1.5-1.8-1.5-3.1c0-1.3,0.5-2.3,1.5-2.9c1-0.6,2.5-0.9,4.5-0.9
		h7.4V204z"/>
	<path d="M446.1,207.9c-1.4,0.8-2.7,1.2-3.9,1.2c-1,0-1.8-0.3-2.3-0.9c-0.5-0.6-0.8-1.6-0.8-3V192h7.7v-3.4h-7.7v-6.8h-4.5v6.8h-3.6
		v3.4h3.6v14c0,2.4,0.6,4.2,1.9,5.4c1.2,1.2,2.9,1.8,4.9,1.8c2,0,4-0.6,5.9-1.9L446.1,207.9z"/>
	<path d="M456,177.6c-0.8,0-1.5,0.3-2,0.8s-0.8,1.2-0.8,2.1s0.3,1.5,0.8,2.1c0.5,0.5,1.2,0.8,2,0.8c0.8,0,1.5-0.3,2-0.8
		s0.8-1.2,0.8-2.1s-0.3-1.5-0.8-2.1S456.8,177.6,456,177.6z"/>
	<rect x="453.8" y="187.7" width="4.5" height="25.3"/>
	<path d="M485.7,194.4l2.4-3.1c-1.1-1.2-2.6-2.2-4.3-2.9c-1.7-0.6-3.6-1-5.8-1c-2.5,0-4.6,0.5-6.6,1.6c-1.9,1.1-3.4,2.6-4.5,4.5
		c-1.1,1.9-1.6,4.2-1.6,6.7c0,2.5,0.5,4.7,1.6,6.6s2.6,3.4,4.5,4.5c1.9,1.1,4.1,1.6,6.6,1.6c2.2,0,4.2-0.4,6-1.1
		c1.8-0.8,3.2-1.9,4.4-3.3l-2.5-2.6c-0.9,1-1.9,1.8-3.3,2.3c-1.3,0.5-2.8,0.8-4.4,0.8c-1.6,0-3.1-0.4-4.3-1.1
		c-1.3-0.8-2.3-1.8-3-3.1c-0.7-1.3-1.1-2.9-1.1-4.6c0-1.8,0.4-3.3,1.1-4.6c0.7-1.3,1.7-2.4,3-3.1c1.3-0.7,2.8-1.1,4.4-1.1
		C481.3,191.5,483.7,192.5,485.7,194.4z"/>
	<path d="M509.7,193.3l1.6-3.4c-1.1-0.7-2.4-1.3-3.9-1.7c-1.5-0.4-3-0.6-4.5-0.6c-2.6,0-4.7,0.6-6.5,1.8c-1.7,1.2-2.6,3-2.6,5.3
		c0,1.5,0.4,2.8,1.1,3.7c0.8,1,1.7,1.7,2.7,2.2c1.1,0.5,2.4,1,4.1,1.5c1.9,0.6,3.3,1.1,4.3,1.7c0.9,0.6,1.4,1.4,1.4,2.6
		c0,1.1-0.4,1.9-1.3,2.5c-0.9,0.5-2.1,0.8-3.5,0.8s-3-0.3-4.5-0.9c-1.5-0.6-2.8-1.3-3.9-2.3l-1.7,3.3c1.2,1.1,2.7,2,4.5,2.6
		c1.8,0.6,3.6,0.9,5.5,0.9c2.7,0,4.9-0.6,6.7-1.9c1.8-1.2,2.7-3.1,2.7-5.4c0-1.6-0.4-2.9-1.2-3.9c-0.8-1-1.7-1.7-2.9-2.3
		c-1.1-0.5-2.5-1-4.3-1.5c-1.8-0.5-3.2-1.1-4.1-1.6s-1.4-1.3-1.4-2.3s0.4-1.8,1.2-2.3c0.8-0.5,1.9-0.7,3.2-0.7
		c1.2,0,2.4,0.2,3.6,0.6C507.5,192.2,508.7,192.7,509.7,193.3z"/>
	<path d="M22.3,227.9l1.8-4.3c-1.6-1-3.3-1.9-5.3-2.5c-2-0.6-4-0.9-6-0.9c-2.4,0-4.5,0.4-6.2,1.2c-1.8,0.8-3.1,1.9-4.1,3.3
		c-0.9,1.4-1.4,3.1-1.3,5c0.1,2.2,0.6,3.9,1.7,5.2c1,1.3,2.3,2.3,3.7,3c1.4,0.7,3.3,1.4,5.6,2.1c1.9,0.6,3.3,1.1,4.4,1.6
		c1.1,0.5,2,1.1,2.7,1.9c0.7,0.8,1.1,1.8,1.2,3.1c0.1,1.6-0.5,2.8-1.8,3.7c-1.3,0.9-3,1.4-5.3,1.4c-1.9,0-3.9-0.4-5.9-1.3
		c-2-0.9-3.9-2.2-5.6-3.8L0,250.5c1.8,1.7,3.9,3,6.2,4c2.4,1,4.8,1.5,7.3,1.5c2.5,0,4.6-0.4,6.5-1.2c1.8-0.8,3.3-2,4.2-3.5
		c1-1.5,1.5-3.3,1.4-5.3c-0.1-2.2-0.6-3.9-1.7-5.2c-1-1.3-2.3-2.3-3.7-3c-1.4-0.7-3.3-1.4-5.6-2.1c-1.9-0.6-3.3-1.1-4.4-1.6
		c-1-0.5-1.9-1.1-2.7-1.9c-0.7-0.8-1.1-1.8-1.2-3c-0.1-1.4,0.5-2.5,1.6-3.2s2.7-1.2,4.7-1.2c1.4,0,3,0.3,4.7,0.8
		C19,226.1,20.7,226.9,22.3,227.9z"/>
	<path d="M56.2,230.4c-4.7,0.1-7.9,1.9-9.6,5.6v-15.6h-4.4v35.3h4.4v-12.4c0-2.6,0.7-4.7,2.1-6.3c1.4-1.6,3.4-2.4,5.8-2.5
		c2.1,0,3.7,0.6,4.9,1.8c1.2,1.2,1.8,2.9,1.8,5v14.4h4.4v-15.6c0-3.1-0.9-5.4-2.5-7.2C61.5,231.3,59.2,230.4,56.2,230.4z"/>
	<path d="M102.8,255.7l-0.1-16.6c0-2.8-0.9-4.9-2.6-6.5c-1.7-1.5-4.1-2.3-7.3-2.3c-2.1,0-4,0.3-5.5,0.8s-3.2,1.4-5,2.5l1.9,3
		c2.6-1.8,5.2-2.7,7.7-2.7c2.1,0,3.7,0.5,4.8,1.5c1.1,1,1.6,2.3,1.6,4.1v1.2h-8c-3,0-5.3,0.7-7,2c-1.7,1.3-2.5,3.1-2.5,5.4
		c0,1.5,0.4,2.8,1.1,3.9c0.7,1.2,1.7,2.1,3,2.8c1.3,0.7,2.9,1,4.6,1c4,0,6.9-1.2,8.8-3.7v3.5H102.8z M98.4,246.8
		c-0.3,1.7-1.1,3-2.6,4c-1.5,1-3.2,1.5-5.3,1.5c-1.6,0-3-0.4-3.9-1.1c-1-0.8-1.5-1.8-1.5-3.1s0.5-2.3,1.5-2.8c1-0.6,2.5-0.9,4.5-0.9
		h7.4V246.8z"/>
	<path d="M124.7,236v-5.4h-4.4v25.2h4.4v-13.3c0.2-2.4,1.1-4.3,2.7-5.8c1.6-1.4,3.7-2.1,6.2-2v-4.3c-2.1,0-3.9,0.5-5.4,1.5
		C126.7,232.8,125.5,234.2,124.7,236z"/>
	<path d="M169.9,243.4c0-4.1-1-7.3-3-9.6c-2-2.3-4.9-3.4-8.8-3.4c-2.4,0-4.6,0.5-6.5,1.6c-1.9,1.1-3.4,2.6-4.5,4.5
		c-1.1,1.9-1.6,4.1-1.6,6.6c0,2.5,0.5,4.7,1.6,6.6s2.6,3.4,4.5,4.5c1.9,1.1,4.1,1.6,6.6,1.6c2.1,0,4.1-0.4,5.8-1.1s3.2-1.8,4.5-3.1
		l-2.4-2.5c-1,1-2.1,1.7-3.4,2.3c-1.3,0.5-2.7,0.8-4.2,0.8c-2.3,0-4.1-0.7-5.7-2s-2.5-3.1-2.8-5.4h19.9
		C169.9,244.5,169.9,244.1,169.9,243.4z M149.9,241.4c0.3-2.3,1.2-4,2.6-5.4c1.5-1.3,3.3-2,5.5-2c2.3,0,4.1,0.7,5.5,2
		s2.2,3.1,2.3,5.4H149.9z"/>
	<path d="M204.5,220.4v15.1c-0.9-1.7-2.2-3-3.8-3.9s-3.5-1.3-5.7-1.3c-2.4,0-4.4,0.5-6.3,1.6c-1.8,1.1-3.2,2.6-4.2,4.5
		c-1,1.9-1.5,4.1-1.5,6.6c0,2.5,0.5,4.7,1.5,6.7c1,2,2.4,3.5,4.2,4.6c1.8,1.1,3.9,1.6,6.3,1.6c2.1,0,4-0.4,5.6-1.3
		c1.6-0.9,2.9-2.2,3.8-3.9v5h4.4v-35.3v0H204.5z M203.4,247.8c-0.7,1.4-1.7,2.4-3,3.2c-1.3,0.8-2.7,1.1-4.4,1.1
		c-1.7,0-3.1-0.4-4.4-1.1c-1.3-0.8-2.3-1.8-3-3.2c-0.7-1.3-1.1-2.9-1.1-4.6s0.4-3.2,1.1-4.6c0.7-1.4,1.7-2.4,3-3.2
		c1.3-0.8,2.7-1.2,4.4-1.2c1.7,0,3.1,0.4,4.4,1.1s2.3,1.8,3,3.2c0.7,1.4,1.1,2.9,1.1,4.7C204.5,244.9,204.1,246.4,203.4,247.8z"/>
	<path d="M262.2,255.7l-7.7-11.3c2.3-0.8,4.1-2.2,5.4-4s1.9-4.1,1.9-6.8c0-3.6-1.1-6.3-3.4-8.3c-2.3-1.9-5.6-2.9-9.8-2.9h-13v33.3
		h4.6v-10.4h8.5c0.5,0,1.1,0,1.9-0.1l6.6,10.5v0H262.2z M248.4,241.2L248.4,241.2l-8.5,0v-14.7h8.5c2.9,0,5.1,0.6,6.6,1.8
		c1.5,1.2,2.3,3,2.3,5.4c0,2.4-0.8,4.3-2.3,5.5C253.5,240.6,251.3,241.2,248.4,241.2z"/>
	<path d="M300.8,243.4c0-4.1-1-7.3-3-9.6c-2-2.3-4.9-3.4-8.8-3.4c-2.4,0-4.6,0.5-6.5,1.6c-1.9,1.1-3.4,2.6-4.5,4.5
		c-1.1,1.9-1.6,4.1-1.6,6.6c0,2.5,0.5,4.7,1.6,6.6c1.1,1.9,2.6,3.4,4.5,4.5c1.9,1.1,4.1,1.6,6.6,1.6c2.1,0,4.1-0.4,5.8-1.1
		s3.2-1.8,4.5-3.1l-2.4-2.5c-1,1-2.1,1.7-3.4,2.3c-1.3,0.5-2.7,0.8-4.2,0.8c-2.3,0-4.1-0.7-5.7-2s-2.5-3.1-2.8-5.4h19.9
		C300.8,244.5,300.8,244.1,300.8,243.4z M280.8,241.4c0.3-2.3,1.2-4,2.6-5.4c1.5-1.3,3.3-2,5.5-2c2.3,0,4.1,0.7,5.5,2
		s2.2,3.1,2.3,5.4H280.8z"/>
	<path d="M330.1,236.1l1.6-3.4c-1.1-0.7-2.4-1.3-3.8-1.7c-1.5-0.4-3-0.6-4.5-0.6c-2.6,0-4.7,0.6-6.4,1.8c-1.7,1.2-2.6,2.9-2.6,5.3
		c0,1.5,0.4,2.7,1.1,3.7c0.8,1,1.7,1.7,2.7,2.2c1.1,0.5,2.4,1,4.1,1.5c1.9,0.6,3.3,1.1,4.2,1.7c0.9,0.6,1.4,1.4,1.4,2.6
		c0,1.1-0.4,1.9-1.3,2.5c-0.9,0.5-2.1,0.8-3.5,0.8s-3-0.3-4.5-0.9c-1.5-0.6-2.8-1.3-3.9-2.3l-1.7,3.2c1.2,1.1,2.7,2,4.5,2.6
		c1.8,0.6,3.6,0.9,5.4,0.9c2.7,0,4.9-0.6,6.7-1.9c1.8-1.2,2.7-3.1,2.7-5.4c0-1.6-0.4-2.9-1.2-3.9c-0.8-1-1.7-1.7-2.8-2.2
		c-1.1-0.5-2.5-1-4.3-1.5c-1.8-0.5-3.2-1.1-4.1-1.6c-0.9-0.5-1.3-1.3-1.3-2.3c0-1,0.4-1.8,1.2-2.3c0.8-0.5,1.9-0.7,3.2-0.7
		c1.1,0,2.3,0.2,3.6,0.6C327.9,235,329.1,235.5,330.1,236.1z"/>
	<path d="M369.5,236.5c-1.1-1.9-2.6-3.4-4.6-4.5c-2-1.1-4.2-1.6-6.7-1.6c-2.5,0-4.8,0.5-6.7,1.6c-2,1.1-3.5,2.6-4.6,4.5
		s-1.6,4.1-1.6,6.6c0,2.5,0.5,4.7,1.6,6.6c1.1,1.9,2.6,3.4,4.6,4.5c1.9,1.1,4.2,1.6,6.7,1.6c2.5,0,4.7-0.5,6.7-1.6
		c2-1.1,3.5-2.6,4.6-4.5c1.1-1.9,1.6-4.1,1.6-6.6C371.2,240.6,370.6,238.4,369.5,236.5z M365.6,247.8c-0.7,1.4-1.7,2.4-3,3.2
		c-1.3,0.8-2.7,1.1-4.4,1.1c-1.7,0-3.1-0.4-4.4-1.1c-1.3-0.7-2.3-1.8-3-3.2c-0.7-1.4-1.1-2.9-1.1-4.7c0-1.7,0.4-3.2,1.1-4.6
		c0.7-1.3,1.7-2.4,3-3.2c1.3-0.8,2.7-1.1,4.4-1.1c1.6,0,3.1,0.4,4.4,1.1c1.3,0.8,2.3,1.8,3,3.2c0.7,1.3,1.1,2.9,1.1,4.6
		C366.7,244.9,366.3,246.4,365.6,247.8z"/>
	<path d="M409.1,230.6h-4.5v12.4c0,2.5-0.7,4.6-2.1,6.3c-1.4,1.6-3.3,2.5-5.6,2.5c-2,0-3.6-0.6-4.8-1.8c-1.2-1.2-1.7-2.8-1.7-5
		v-14.4H386v15.6c0,3.1,0.8,5.4,2.5,7.2c1.6,1.7,3.9,2.6,6.8,2.6c4.6-0.1,7.7-1.9,9.3-5.5v5.3h4.5V230.6L409.1,230.6z"/>
	<path d="M431.7,236v-5.4h-4.4v25.2h4.4v-13.3c0.2-2.4,1.1-4.3,2.7-5.8c1.6-1.4,3.7-2.1,6.2-2v-4.3c-2.1,0-3.9,0.5-5.4,1.5
		C433.6,232.8,432.5,234.2,431.7,236z"/>
	<path d="M472.6,237.3l2.4-3c-1.1-1.2-2.6-2.2-4.2-2.8c-1.7-0.6-3.6-1-5.7-1c-2.4,0-4.6,0.5-6.5,1.6c-1.9,1.1-3.4,2.6-4.5,4.5
		c-1.1,1.9-1.6,4.1-1.6,6.6c0,2.5,0.5,4.7,1.6,6.6c1.1,1.9,2.5,3.4,4.5,4.5c1.9,1.1,4.1,1.6,6.5,1.6c2.2,0,4.2-0.4,6-1.1
		c1.8-0.8,3.2-1.8,4.4-3.3l-2.5-2.6c-0.9,1-1.9,1.8-3.2,2.3c-1.3,0.5-2.7,0.8-4.4,0.8c-1.6,0-3.1-0.4-4.3-1.1
		c-1.3-0.8-2.2-1.8-3-3.1s-1.1-2.9-1.1-4.6c0-1.7,0.4-3.3,1.1-4.6c0.7-1.3,1.7-2.4,3-3.1c1.3-0.7,2.7-1.1,4.4-1.1
		C468.2,234.4,470.6,235.3,472.6,237.3z"/>
	<path d="M512,243.4c0-4.1-1-7.3-3-9.6c-2-2.3-4.9-3.4-8.8-3.4c-2.4,0-4.6,0.5-6.5,1.6c-1.9,1.1-3.4,2.6-4.5,4.5
		c-1.1,1.9-1.6,4.1-1.6,6.6c0,2.5,0.5,4.7,1.6,6.6s2.6,3.4,4.5,4.5c1.9,1.1,4.1,1.6,6.6,1.6c2.1,0,4.1-0.4,5.8-1.1s3.2-1.8,4.5-3.1
		l-2.4-2.5c-1,1-2.1,1.7-3.4,2.3c-1.3,0.5-2.7,0.8-4.2,0.8c-2.3,0-4.1-0.7-5.7-2s-2.5-3.1-2.8-5.4h19.9
		C512,244.5,512,244.1,512,243.4z M492,241.4c0.3-2.3,1.2-4,2.6-5.4c1.5-1.3,3.3-2,5.5-2c2.3,0,4.1,0.7,5.5,2s2.2,3.1,2.3,5.4H492z"
		/>
</g>
</svg>
