{
  "idAttributeValueSet": 536753,
  "createDateTime": "2017-09-05 15:39:28.617",
  "attributeValues": [{
    "idAttributeValue": 11007378,
    "codeAttributeDataType": "S",
    "idAttributeValueSet": 536753,
    "idAttribute": 653,
    "valueString": "A"
  }, {
    "idAttributeValue": 11007379,
    "codeAttributeDataType": "D",
    "idAttributeValueSet": 536753,
    "idAttribute": 659,
    "valueDateTime": "2018-09-05 00:00:00.000"
  }, {
    "idAttributeValue": 11007380,
    "codeAttributeDataType": "I",
    "idAttributeValueSet": 536753,
    "idAttribute": 651,
    "valueInteger": 1
  }, {
    "idAttributeValue": 12113755,
    "codeAttributeDataType": "AC",
    "idAttributeValueSet": 536753,
    "idAttribute": 674,
    "valueIdAttributeChoice": 904,
    "idGroupAttribute": 673,
    "groupAttributeRowId": 1
  }, {
    "idAttributeValue": 12113756,
    "codeAttributeDataType": "D",
    "idAttributeValueSet": 536753,
    "idAttribute": 676,
    "valueDateTime": "2018-12-06 00:00:00.000",
    "idGroupAttribute": 673,
    "groupAttributeRowId": 1
  }, {
    "idAttributeValue": 12113757,
    "codeAttributeDataType": "AC",
    "idAttributeValueSet": 536753,
    "idAttribute": 703,
    "valueIdAttributeChoice": 1523,
    "idGroupAttribute": 673,
    "groupAttributeRowId": 1
  }, {
    "idAttributeValue": 12113758,
    "codeAttributeDataType": "AC",
    "idAttributeValueSet": 536753,
    "idAttribute": 675,
    "valueIdAttributeChoice": 1456,
    "idGroupAttribute": 673,
    "groupAttributeRowId": 1
  }, {
    "idAttributeValue": 12113759,
    "codeAttributeDataType": "AC",
    "idAttributeValueSet": 536753,
    "idAttribute": 1571,
    "valueIdAttributeChoice": 4120,
    "idGroupAttribute": 673,
    "groupAttributeRowId": 1
  }, {
    "idAttributeValue": 12113760,
    "codeAttributeDataType": "AC",
    "idAttributeValueSet": 536753,
    "idAttribute": 1571,
    "valueIdAttributeChoice": 4123,
    "idGroupAttribute": 673,
    "groupAttributeRowId": 1
  }, {
    "idAttributeValue": 12113761,
    "codeAttributeDataType": "AC",
    "idAttributeValueSet": 536753,
    "idAttribute": 1571,
    "valueIdAttributeChoice": 4124,
    "idGroupAttribute": 673,
    "groupAttributeRowId": 1
  }, {
    "idAttributeValue": 12113762,
    "codeAttributeDataType": "AC",
    "idAttributeValueSet": 536753,
    "idAttribute": 1570,
    "valueIdAttributeChoice": 4115,
    "idGroupAttribute": 673,
    "groupAttributeRowId": 1
  }, {
    "idAttributeValue": 12113763,
    "codeAttributeDataType": "TXT",
    "idAttributeValueSet": 536753,
    "idAttribute": 677,
    "valueLongText": {
      "idLongText": 85067,
      "textData": "Test"
    },
    "idGroupAttribute": 673,
    "groupAttributeRowId": 1
  }
  ]
}
