[
  {
    "id": "Melanoma",
    "values": [
      {"date": 1451631600000, "money": 500},
      {"date": 1454310000000, "money": 550},
      {"date": 1456815600000, "money": 600},
      {"date": 1459490400000, "money": 700},
      {"date": 1462082400000, "money": 600},
      {"date": 1464760800000, "money": 700},
      {"date": 1467352800000, "money": 600},
      {"date": 1470031200000, "money": 600},
      {"date": 1472709600000, "money": 650},
      {"date": 1475301600000, "money": 800},
      {"date": 1477980000000, "money": 750},
      {"date": 1480575600000, "money": 900}
    ]
  },
  {
    "id": "Breast",
    "values": [
      {"date": 1451631600000, "money": 300},
      {"date": 1454310000000, "money": 350},
      {"date": 1456815600000, "money": 400},
      {"date": 1459490400000, "money": 400},
      {"date": 1462082400000, "money": 300},
      {"date": 1464760800000, "money": 400},
      {"date": 1467352800000, "money": 500},
      {"date": 1470031200000, "money": 600},
      {"date": 1472709600000, "money": 750},
      {"date": 1475301600000, "money": 900},
      {"date": 1477980000000, "money": 700},
      {"date": 1480575600000, "money": 500}
    ]
  }
]
