[{
  "idAttributeChoice": 248,
  "idAttribute": 305,
  "choice": "Agree",
  "description": "Agree",
  "sortOrder": 1,
  "isActive": "Y",
  "isAjcc": "N",
  "isCap": "N"
}, {
  "idAttributeChoice": 249,
  "idAttribute": 305,
  "choice": "Disagree",
  "description": "Disagree",
  "sortOrder": 2,
  "isActive": "Y",
  "isAjcc": "N",
  "isCap": "N"
}, {
  "idAttributeChoice": 8038,
  "idAttribute": 2581,
  "choice": "All Negative",
  "description": "All Negative",
  "sortOrder": 1,
  "isActive": "Y",
  "isAjcc": "N",
  "isCap": "N"
}, {
  "idAttributeChoice": 8039,
  "idAttribute": 2581,
  "choice": "Macroscopic (apparent)",
  "description": "Macroscopic (apparent)",
  "sortOrder": 2,
  "isActive": "Y",
  "isAjcc": "N",
  "isCap": "N"
}, {
  "idAttributeChoice": 8040,
  "idAttribute": 2581,
  "choice": "Microscopic only (occult)",
  "description": "Microscopic only (occult)",
  "sortOrder": 3,
  "isActive": "Y",
  "isAjcc": "N",
  "isCap": "N"
}, {
  "idAttributeChoice": 8041,
  "idAttribute": 2582,
  "choice": "Left",
  "description": "Left",
  "sortOrder": 1,
  "isActive": "Y",
  "isAjcc": "N",
  "isCap": "N"
}, {
  "idAttributeChoice": 8042,
  "idAttribute": 2582,
  "choice": "Right",
  "description": "Right",
  "sortOrder": 2,
  "isActive": "Y",
  "isAjcc": "N",
  "isCap": "N"
}, {
  "idAttributeChoice": 8043,
  "idAttribute": 2582,
  "choice": "Bilateral",
  "description": "Bilateral",
  "sortOrder": 3,
  "isActive": "Y",
  "isAjcc": "N",
  "isCap": "N"
}, {
  "idAttributeChoice": 8044,
  "idAttribute": 2583,
  "choice": "Axillary",
  "description": "Axillary",
  "sortOrder": 1,
  "isActive": "Y",
  "isAjcc": "N",
  "isCap": "N"
}, {
  "idAttributeChoice": 8045,
  "idAttribute": 2583,
  "choice": "Groin Deep",
  "description": "Groin Deep",
  "sortOrder": 2,
  "isActive": "Y",
  "isAjcc": "N",
  "isCap": "N"
}, {
  "idAttributeChoice": 8046,
  "idAttribute": 2583,
  "choice": "Groin Superficial",
  "description": "Groin Superficial",
  "sortOrder": 3,
  "isActive": "Y",
  "isAjcc": "N",
  "isCap": "N"
}, {
  "idAttributeChoice": 8047,
  "idAttribute": 2583,
  "choice": "Cervical (Neck)",
  "description": "Cervical (Neck)",
  "sortOrder": 4,
  "isActive": "Y",
  "isAjcc": "N",
  "isCap": "N"
}, {
  "idAttributeChoice": 8048,
  "idAttribute": 2583,
  "choice": "Parotid",
  "description": "Parotid",
  "sortOrder": 5,
  "isActive": "Y",
  "isAjcc": "N",
  "isCap": "N"
}, {
  "idAttributeChoice": 8049,
  "idAttribute": 2583,
  "choice": "Other",
  "description": "Other",
  "sortOrder": 6,
  "isActive": "Y",
  "isAjcc": "N",
  "isCap": "N"
}, {
  "idAttributeChoice": 8050,
  "idAttribute": 2585,
  "choice": "Negative",
  "description": "Negative",
  "sortOrder": 1,
  "isActive": "Y",
  "isAjcc": "N",
  "isCap": "N"
}, {
  "idAttributeChoice": 8051,
  "idAttribute": 2585,
  "choice": "Positive",
  "description": "Positive",
  "sortOrder": 2,
  "isActive": "Y",
  "isAjcc": "N",
  "isCap": "N"
}, {
  "idAttributeChoice": 8052,
  "idAttribute": 2588,
  "choice": "Absent",
  "description": "Absent",
  "sortOrder": 1,
  "isActive": "Y",
  "isAjcc": "N",
  "isCap": "N"
}, {
  "idAttributeChoice": 8053,
  "idAttribute": 2588,
  "choice": "Present",
  "description": "Present",
  "sortOrder": 2,
  "isActive": "Y",
  "isAjcc": "N",
  "isCap": "N"
}, {
  "idAttributeChoice": 8074,
  "idAttribute": 2637,
  "choice": "Negative",
  "description": "Negative",
  "sortOrder": 1,
  "isActive": "Y",
  "isAjcc": "N",
  "isCap": "N",
  "researchCode": 0
}, {
  "idAttributeChoice": 8075,
  "idAttribute": 2637,
  "choice": "Positive",
  "description": "Positive",
  "sortOrder": 2,
  "isActive": "Y",
  "isAjcc": "N",
  "isCap": "N",
  "researchCode": 1
}, {
  "idAttributeChoice": 8087,
  "idAttribute": 2644,
  "choice": "Subcapsular",
  "description": "Subcapsular",
  "sortOrder": 1,
  "isActive": "Y",
  "isAjcc": "N",
  "isCap": "N"
}, {
  "idAttributeChoice": 8088,
  "idAttribute": 2644,
  "choice": "Intramedullary",
  "description": "Intramedullary",
  "sortOrder": 2,
  "isActive": "Y",
  "isAjcc": "N",
  "isCap": "N"
}, {
  "idAttributeChoice": 8089,
  "idAttribute": 2644,
  "choice": "Both",
  "description": "Both",
  "sortOrder": 3,
  "isActive": "Y",
  "isAjcc": "N",
  "isCap": "N"
}, {
  "idAttributeChoice": 8334,
  "idAttribute": 2850,
  "choice": "ELND (Elective)",
  "description": "ELND (Elective)",
  "sortOrder": 1,
  "isActive": "Y",
  "isAjcc": "N",
  "isCap": "N",
  "researchCode": "ELND"
}, {
  "idAttributeChoice": 8335,
  "idAttribute": 2850,
  "choice": "CLND (Completion)",
  "description": "CLND (Completion)",
  "sortOrder": 2,
  "isActive": "Y",
  "isAjcc": "N",
  "isCap": "N",
  "researchCode": "CLND"
}, {
  "idAttributeChoice": 8336,
  "idAttribute": 2856,
  "choice": "All Negative",
  "description": "All Negative",
  "sortOrder": 1,
  "isActive": "Y",
  "isAjcc": "N",
  "isCap": "N"
}, {
  "idAttributeChoice": 8337,
  "idAttribute": 2856,
  "choice": "Macroscopic (apparent)",
  "description": "Macroscopic (apparent)",
  "sortOrder": 2,
  "isActive": "Y",
  "isAjcc": "N",
  "isCap": "N"
}, {
  "idAttributeChoice": 8338,
  "idAttribute": 2856,
  "choice": "Microscopic only (occult)",
  "description": "Microscopic only (occult)",
  "sortOrder": 3,
  "isActive": "Y",
  "isAjcc": "N",
  "isCap": "N"
}, {
  "idAttributeChoice": 8339,
  "idAttribute": 2857,
  "choice": "Left",
  "description": "Left",
  "sortOrder": 1,
  "isActive": "Y",
  "isAjcc": "N",
  "isCap": "N"
}, {
  "idAttributeChoice": 8340,
  "idAttribute": 2857,
  "choice": "Right",
  "description": "Right",
  "sortOrder": 2,
  "isActive": "Y",
  "isAjcc": "N",
  "isCap": "N"
}, {
  "idAttributeChoice": 8341,
  "idAttribute": 2857,
  "choice": "Bilateral",
  "description": "Bilateral",
  "sortOrder": 3,
  "isActive": "Y",
  "isAjcc": "N",
  "isCap": "N"
}, {
  "idAttributeChoice": 8342,
  "idAttribute": 2858,
  "choice": "Axillary",
  "description": "Axillary",
  "sortOrder": 1,
  "isActive": "Y",
  "isAjcc": "N",
  "isCap": "N"
}, {
  "idAttributeChoice": 8343,
  "idAttribute": 2858,
  "choice": "Groin Deep",
  "description": "Groin Deep",
  "sortOrder": 2,
  "isActive": "Y",
  "isAjcc": "N",
  "isCap": "N"
}, {
  "idAttributeChoice": 8344,
  "idAttribute": 2858,
  "choice": "Groin Superficial",
  "description": "Groin Superficial",
  "sortOrder": 3,
  "isActive": "Y",
  "isAjcc": "N",
  "isCap": "N"
}, {
  "idAttributeChoice": 8345,
  "idAttribute": 2858,
  "choice": "Cervical (Neck)",
  "description": "Cervical (Neck)",
  "sortOrder": 4,
  "isActive": "Y",
  "isAjcc": "N",
  "isCap": "N"
}, {
  "idAttributeChoice": 8346,
  "idAttribute": 2858,
  "choice": "Parotid",
  "description": "Parotid",
  "sortOrder": 5,
  "isActive": "Y",
  "isAjcc": "N",
  "isCap": "N"
}, {
  "idAttributeChoice": 8347,
  "idAttribute": 2858,
  "choice": "Other",
  "description": "Other",
  "sortOrder": 6,
  "isActive": "Y",
  "isAjcc": "N",
  "isCap": "N"
}, {
  "idAttributeChoice": 8348,
  "idAttribute": 2860,
  "choice": "Absent",
  "description": "Absent",
  "sortOrder": 1,
  "isActive": "Y",
  "isAjcc": "N",
  "isCap": "N"
}, {
  "idAttributeChoice": 8349,
  "idAttribute": 2860,
  "choice": "Present",
  "description": "Present",
  "sortOrder": 2,
  "isActive": "Y",
  "isAjcc": "N",
  "isCap": "N"
}, {
  "idAttributeChoice": 8350,
  "idAttribute": 2866,
  "choice": "Bleeding",
  "description": "Bleeding",
  "sortOrder": 1,
  "isActive": "Y",
  "isAjcc": "N",
  "isCap": "N"
}, {
  "idAttributeChoice": 8351,
  "idAttribute": 2866,
  "choice": "Infection",
  "description": "Infection",
  "sortOrder": 2,
  "isActive": "Y",
  "isAjcc": "N",
  "isCap": "N"
}, {
  "idAttributeChoice": 8352,
  "idAttribute": 2866,
  "choice": "Other (specify)",
  "description": "Other",
  "sortOrder": 3,
  "isActive": "Y",
  "isAjcc": "N",
  "isCap": "N"
}, {
  "idAttributeChoice": 10519,
  "idAttribute": 2850,
  "choice": "TLND (Therapeutic)",
  "description": "TLND (Therapeutic)",
  "sortOrder": 3,
  "isActive": "Y",
  "isAjcc": "N",
  "isCap": "N",
  "researchCode": "TLND"
}, {
  "idAttributeChoice": 17485,
  "idAttribute": 10248,
  "choice": "Bleeding",
  "description": "Bleeding",
  "sortOrder": 1,
  "isActive": "Y",
  "isAjcc": "N",
  "isCap": "N"
}, {
  "idAttributeChoice": 17486,
  "idAttribute": 10248,
  "choice": "Infection",
  "description": "Infection",
  "sortOrder": 2,
  "isActive": "Y",
  "isAjcc": "N",
  "isCap": "N"
}, {
  "idAttributeChoice": 17487,
  "idAttribute": 10248,
  "choice": "Other (specify)",
  "description": "Other",
  "sortOrder": 3,
  "isActive": "Y",
  "isAjcc": "N",
  "isCap": "N"
}, {
  "idAttributeChoice": 17488,
  "idAttribute": 10250,
  "choice": "Axilla - Level 1",
  "sortOrder": 1,
  "isActive": "Y",
  "isAjcc": "N",
  "isCap": "N"
}, {
  "idAttributeChoice": 17489,
  "idAttribute": 10250,
  "choice": "Axilla - Level 2",
  "sortOrder": 2,
  "isActive": "Y",
  "isAjcc": "N",
  "isCap": "N"
}, {
  "idAttributeChoice": 17490,
  "idAttribute": 10250,
  "choice": "Axilla - Level 3",
  "sortOrder": 3,
  "isActive": "Y",
  "isAjcc": "N",
  "isCap": "N"
}, {
  "idAttributeChoice": 17491,
  "idAttribute": 10250,
  "choice": "Neck - Level I (incl Submental)",
  "sortOrder": 4,
  "isActive": "Y",
  "isAjcc": "N",
  "isCap": "N"
}, {
  "idAttributeChoice": 17492,
  "idAttribute": 10250,
  "choice": "Neck - Level II (incl Jugular Digastic)",
  "sortOrder": 5,
  "isActive": "Y",
  "isAjcc": "N",
  "isCap": "N"
}, {
  "idAttributeChoice": 17493,
  "idAttribute": 10250,
  "choice": "Neck - Level III",
  "sortOrder": 6,
  "isActive": "Y",
  "isAjcc": "N",
  "isCap": "N"
}, {
  "idAttributeChoice": 17494,
  "idAttribute": 10250,
  "choice": "Neck - Level IV",
  "sortOrder": 7,
  "isActive": "Y",
  "isAjcc": "N",
  "isCap": "N"
}, {
  "idAttributeChoice": 17495,
  "idAttribute": 10250,
  "choice": "Neck - Level V (incl Posterior Triangle)",
  "sortOrder": 8,
  "isActive": "Y",
  "isAjcc": "N",
  "isCap": "N"
}, {
  "idAttributeChoice": 17496,
  "idAttribute": 10251,
  "choice": "Absent",
  "description": "Absent",
  "sortOrder": 1,
  "isActive": "Y",
  "isAjcc": "N",
  "isCap": "N"
}, {
  "idAttributeChoice": 17497,
  "idAttribute": 10251,
  "choice": "Present",
  "description": "Present",
  "sortOrder": 2,
  "isActive": "Y",
  "isAjcc": "N",
  "isCap": "N"
}, {
  "idAttributeChoice": 17498,
  "idAttribute": 10259,
  "choice": "Lymphazurin (1% isosulfan blue)",
  "sortOrder": 1,
  "isActive": "Y",
  "isAjcc": "N",
  "isCap": "N"
}, {
  "idAttributeChoice": 17499,
  "idAttribute": 10259,
  "choice": "Methylene Blue (1%)",
  "sortOrder": 2,
  "isActive": "Y",
  "isAjcc": "N",
  "isCap": "N"
}, {
  "idAttributeChoice": 17500,
  "idAttribute": 10259,
  "choice": "Fluorescein",
  "sortOrder": 3,
  "isActive": "Y",
  "isAjcc": "N",
  "isCap": "N"
}, {
  "idAttributeChoice": 17501,
  "idAttribute": 10259,
  "choice": "Other",
  "sortOrder": 4,
  "isActive": "Y",
  "isAjcc": "N",
  "isCap": "N"
}, {
  "idAttributeChoice": 17502,
  "idAttribute": 10259,
  "choice": "None",
  "sortOrder": 5,
  "isActive": "Y",
  "isAjcc": "N",
  "isCap": "N"
}, {
  "idAttributeChoice": 17503,
  "idAttribute": 10263,
  "choice": "Axilla - Level 1",
  "sortOrder": 1,
  "isActive": "Y",
  "isAjcc": "N",
  "isCap": "N"
}, {
  "idAttributeChoice": 17504,
  "idAttribute": 10263,
  "choice": "Axilla - Level 2",
  "sortOrder": 2,
  "isActive": "Y",
  "isAjcc": "N",
  "isCap": "N"
}, {
  "idAttributeChoice": 17505,
  "idAttribute": 10263,
  "choice": "Axilla - Level 3",
  "sortOrder": 3,
  "isActive": "Y",
  "isAjcc": "N",
  "isCap": "N"
}, {
  "idAttributeChoice": 17506,
  "idAttribute": 10263,
  "choice": "Neck - Level I (incl Submental)",
  "sortOrder": 4,
  "isActive": "Y",
  "isAjcc": "N",
  "isCap": "N"
}, {
  "idAttributeChoice": 17507,
  "idAttribute": 10263,
  "choice": "Neck - Level II (incl Jugular Digastic)",
  "sortOrder": 5,
  "isActive": "Y",
  "isAjcc": "N",
  "isCap": "N"
}, {
  "idAttributeChoice": 17508,
  "idAttribute": 10263,
  "choice": "Neck - Level III",
  "sortOrder": 6,
  "isActive": "Y",
  "isAjcc": "N",
  "isCap": "N"
}, {
  "idAttributeChoice": 17509,
  "idAttribute": 10263,
  "choice": "Neck - Level IV",
  "sortOrder": 7,
  "isActive": "Y",
  "isAjcc": "N",
  "isCap": "N"
}, {
  "idAttributeChoice": 17510,
  "idAttribute": 10263,
  "choice": "Neck - Level V (incl Posterior Triangle)",
  "sortOrder": 8,
  "isActive": "Y",
  "isAjcc": "N",
  "isCap": "N"
}, {
  "idAttributeChoice": 17511,
  "idAttribute": 10282,
  "choice": "Negative",
  "sortOrder": 1,
  "isActive": "Y",
  "isAjcc": "N",
  "isCap": "N"
}, {
  "idAttributeChoice": 17512,
  "idAttribute": 10282,
  "choice": "Macroscopic (apparent)",
  "sortOrder": 2,
  "isActive": "Y",
  "isAjcc": "N",
  "isCap": "N"
}, {
  "idAttributeChoice": 17513,
  "idAttribute": 10282,
  "choice": "Microscopic only (occult)",
  "sortOrder": 3,
  "isActive": "Y",
  "isAjcc": "N",
  "isCap": "N"
}, {
  "idAttributeChoice": 17514,
  "idAttribute": 10284,
  "choice": "Negative",
  "sortOrder": 1,
  "isActive": "Y",
  "isAjcc": "N",
  "isCap": "N"
}, {
  "idAttributeChoice": 17515,
  "idAttribute": 10284,
  "choice": "Positive",
  "sortOrder": 2,
  "isActive": "Y",
  "isAjcc": "N",
  "isCap": "N"
}, {
  "idAttributeChoice": 17516,
  "idAttribute": 10287,
  "choice": "Absent",
  "sortOrder": 1,
  "isActive": "Y",
  "isAjcc": "N",
  "isCap": "N"
}, {
  "idAttributeChoice": 17517,
  "idAttribute": 10287,
  "choice": "Present",
  "sortOrder": 2,
  "isActive": "Y",
  "isAjcc": "N",
  "isCap": "N"
}, {
  "idAttributeChoice": 17518,
  "idAttribute": 10293,
  "choice": "Positive",
  "sortOrder": 1,
  "isActive": "Y",
  "isAjcc": "N",
  "isCap": "N"
}, {
  "idAttributeChoice": 17519,
  "idAttribute": 10293,
  "choice": "Negative",
  "sortOrder": 2,
  "isActive": "Y",
  "isAjcc": "N",
  "isCap": "N"
}, {
  "idAttributeChoice": 17520,
  "idAttribute": 10293,
  "choice": "Unknown",
  "sortOrder": 3,
  "isActive": "Y",
  "isAjcc": "N",
  "isCap": "N"
}, {
  "idAttributeChoice": 17521,
  "idAttribute": 10294,
  "choice": "Positive (any)",
  "sortOrder": 1,
  "isActive": "Y",
  "isAjcc": "N",
  "isCap": "N"
}, {
  "idAttributeChoice": 17522,
  "idAttribute": 10294,
  "choice": "Negative (all)",
  "sortOrder": 2,
  "isActive": "Y",
  "isAjcc": "N",
  "isCap": "N"
}, {
  "idAttributeChoice": 17523,
  "idAttribute": 10294,
  "choice": "Unknown",
  "sortOrder": 3,
  "isActive": "Y",
  "isAjcc": "N",
  "isCap": "N"
}, {
  "idAttributeChoice": 17524,
  "idAttribute": 10294,
  "choice": "Not tested",
  "sortOrder": 4,
  "isActive": "Y",
  "isAjcc": "N",
  "isCap": "N"
}, {
  "idAttributeChoice": 17525,
  "idAttribute": 10295,
  "choice": "Positive",
  "sortOrder": 1,
  "isActive": "Y",
  "isAjcc": "N",
  "isCap": "N"
}, {
  "idAttributeChoice": 17526,
  "idAttribute": 10295,
  "choice": "Negative",
  "sortOrder": 2,
  "isActive": "Y",
  "isAjcc": "N",
  "isCap": "N"
}, {
  "idAttributeChoice": 17527,
  "idAttribute": 10295,
  "choice": "Unknown",
  "sortOrder": 3,
  "isActive": "Y",
  "isAjcc": "N",
  "isCap": "N"
}, {
  "idAttributeChoice": 17528,
  "idAttribute": 10295,
  "choice": "Not tested",
  "sortOrder": 4,
  "isActive": "Y",
  "isAjcc": "N",
  "isCap": "N"
}, {
  "idAttributeChoice": 17529,
  "idAttribute": 10296,
  "choice": "Positive",
  "sortOrder": 1,
  "isActive": "Y",
  "isAjcc": "N",
  "isCap": "N"
}, {
  "idAttributeChoice": 17530,
  "idAttribute": 10296,
  "choice": "Negative",
  "sortOrder": 2,
  "isActive": "Y",
  "isAjcc": "N",
  "isCap": "N"
}, {
  "idAttributeChoice": 17531,
  "idAttribute": 10296,
  "choice": "Unknown",
  "sortOrder": 3,
  "isActive": "Y",
  "isAjcc": "N",
  "isCap": "N"
}, {
  "idAttributeChoice": 17532,
  "idAttribute": 10296,
  "choice": "Not tested",
  "sortOrder": 4,
  "isActive": "Y",
  "isAjcc": "N",
  "isCap": "N"
}, {
  "idAttributeChoice": 17533,
  "idAttribute": 10297,
  "choice": "Positive",
  "sortOrder": 1,
  "isActive": "Y",
  "isAjcc": "N",
  "isCap": "N"
}, {
  "idAttributeChoice": 17534,
  "idAttribute": 10297,
  "choice": "Negative",
  "sortOrder": 2,
  "isActive": "Y",
  "isAjcc": "N",
  "isCap": "N"
}, {
  "idAttributeChoice": 17535,
  "idAttribute": 10297,
  "choice": "Unknown",
  "sortOrder": 3,
  "isActive": "Y",
  "isAjcc": "N",
  "isCap": "N"
}, {
  "idAttributeChoice": 17536,
  "idAttribute": 10297,
  "choice": "Not tested",
  "sortOrder": 4,
  "isActive": "Y",
  "isAjcc": "N",
  "isCap": "N"
}, {
  "idAttributeChoice": 17537,
  "idAttribute": 10298,
  "choice": "Positive",
  "sortOrder": 1,
  "isActive": "Y",
  "isAjcc": "N",
  "isCap": "N"
}, {
  "idAttributeChoice": 17538,
  "idAttribute": 10298,
  "choice": "Negative",
  "sortOrder": 2,
  "isActive": "Y",
  "isAjcc": "N",
  "isCap": "N"
}, {
  "idAttributeChoice": 17539,
  "idAttribute": 10298,
  "choice": "Unknown",
  "sortOrder": 3,
  "isActive": "Y",
  "isAjcc": "N",
  "isCap": "N"
}, {
  "idAttributeChoice": 17540,
  "idAttribute": 10298,
  "choice": "Not tested",
  "sortOrder": 4,
  "isActive": "Y",
  "isAjcc": "N",
  "isCap": "N"
}, {
  "idAttributeChoice": 17541,
  "idAttribute": 10301,
  "choice": "Negative",
  "sortOrder": 1,
  "isActive": "Y",
  "isAjcc": "N",
  "isCap": "N",
  "researchCode": 0
}, {
  "idAttributeChoice": 17542,
  "idAttribute": 10301,
  "choice": "Positive",
  "sortOrder": 2,
  "isActive": "Y",
  "isAjcc": "N",
  "isCap": "N",
  "researchCode": 1
}, {
  "idAttributeChoice": 17543,
  "idAttribute": 10302,
  "choice": "Positive",
  "sortOrder": 1,
  "isActive": "Y",
  "isAjcc": "N",
  "isCap": "N",
  "researchCode": 1
}, {
  "idAttributeChoice": 17544,
  "idAttribute": 10302,
  "choice": "Negative",
  "sortOrder": 2,
  "isActive": "Y",
  "isAjcc": "N",
  "isCap": "N",
  "researchCode": 0
}, {
  "idAttributeChoice": 17545,
  "idAttribute": 10302,
  "choice": "Unknown",
  "sortOrder": 3,
  "isActive": "Y",
  "isAjcc": "N",
  "isCap": "N",
  "researchCode": 9
}, {
  "idAttributeChoice": 17546,
  "idAttribute": 10302,
  "choice": "Not tested",
  "sortOrder": 4,
  "isActive": "Y",
  "isAjcc": "N",
  "isCap": "N",
  "researchCode": 8
}, {
  "idAttributeChoice": 17547,
  "idAttribute": 10303,
  "choice": "Positive",
  "sortOrder": 1,
  "isActive": "Y",
  "isAjcc": "N",
  "isCap": "N",
  "researchCode": 1
}, {
  "idAttributeChoice": 17548,
  "idAttribute": 10303,
  "choice": "Negative",
  "sortOrder": 2,
  "isActive": "Y",
  "isAjcc": "N",
  "isCap": "N",
  "researchCode": 0
}, {
  "idAttributeChoice": 17549,
  "idAttribute": 10303,
  "choice": "Unknown",
  "sortOrder": 3,
  "isActive": "Y",
  "isAjcc": "N",
  "isCap": "N",
  "researchCode": 9
}, {
  "idAttributeChoice": 17550,
  "idAttribute": 10303,
  "choice": "Not tested",
  "sortOrder": 4,
  "isActive": "Y",
  "isAjcc": "N",
  "isCap": "N",
  "researchCode": 8
}, {
  "idAttributeChoice": 17551,
  "idAttribute": 10304,
  "choice": "Positive",
  "sortOrder": 1,
  "isActive": "Y",
  "isAjcc": "N",
  "isCap": "N",
  "researchCode": 1
}, {
  "idAttributeChoice": 17552,
  "idAttribute": 10304,
  "choice": "Negative",
  "sortOrder": 2,
  "isActive": "Y",
  "isAjcc": "N",
  "isCap": "N",
  "researchCode": 0
}, {
  "idAttributeChoice": 17553,
  "idAttribute": 10304,
  "choice": "Unknown",
  "sortOrder": 3,
  "isActive": "Y",
  "isAjcc": "N",
  "isCap": "N",
  "researchCode": 9
}, {
  "idAttributeChoice": 17554,
  "idAttribute": 10304,
  "choice": "Not tested",
  "sortOrder": 4,
  "isActive": "Y",
  "isAjcc": "N",
  "isCap": "N",
  "researchCode": 8
}, {
  "idAttributeChoice": 17555,
  "idAttribute": 10305,
  "choice": "Positive",
  "sortOrder": 1,
  "isActive": "Y",
  "isAjcc": "N",
  "isCap": "N",
  "researchCode": 1
}, {
  "idAttributeChoice": 17556,
  "idAttribute": 10305,
  "choice": "Negative",
  "sortOrder": 2,
  "isActive": "Y",
  "isAjcc": "N",
  "isCap": "N",
  "researchCode": 0
}, {
  "idAttributeChoice": 17557,
  "idAttribute": 10305,
  "choice": "Unknown",
  "sortOrder": 3,
  "isActive": "Y",
  "isAjcc": "N",
  "isCap": "N",
  "researchCode": 9
}, {
  "idAttributeChoice": 17558,
  "idAttribute": 10305,
  "choice": "Not tested",
  "sortOrder": 4,
  "isActive": "Y",
  "isAjcc": "N",
  "isCap": "N",
  "researchCode": 8
}, {
  "idAttributeChoice": 17559,
  "idAttribute": 10306,
  "choice": "Positive",
  "sortOrder": 1,
  "isActive": "Y",
  "isAjcc": "N",
  "isCap": "N",
  "researchCode": 1
}, {
  "idAttributeChoice": 17560,
  "idAttribute": 10306,
  "choice": "Negative",
  "sortOrder": 2,
  "isActive": "Y",
  "isAjcc": "N",
  "isCap": "N",
  "researchCode": 0
}, {
  "idAttributeChoice": 17561,
  "idAttribute": 10306,
  "choice": "Unknown",
  "sortOrder": 3,
  "isActive": "Y",
  "isAjcc": "N",
  "isCap": "N",
  "researchCode": 9
}, {
  "idAttributeChoice": 17562,
  "idAttribute": 10306,
  "choice": "Not tested",
  "sortOrder": 4,
  "isActive": "Y",
  "isAjcc": "N",
  "isCap": "N",
  "researchCode": 8
}, {
  "idAttributeChoice": 17563,
  "idAttribute": 10307,
  "choice": "Positive",
  "sortOrder": 1,
  "isActive": "Y",
  "isAjcc": "N",
  "isCap": "N",
  "researchCode": 1
}, {
  "idAttributeChoice": 17564,
  "idAttribute": 10307,
  "choice": "Negative",
  "sortOrder": 2,
  "isActive": "Y",
  "isAjcc": "N",
  "isCap": "N",
  "researchCode": 0
}, {
  "idAttributeChoice": 17565,
  "idAttribute": 10307,
  "choice": "Unknown",
  "sortOrder": 3,
  "isActive": "Y",
  "isAjcc": "N",
  "isCap": "N",
  "researchCode": 9
}, {
  "idAttributeChoice": 17566,
  "idAttribute": 10307,
  "choice": "Not tested",
  "sortOrder": 4,
  "isActive": "Y",
  "isAjcc": "N",
  "isCap": "N",
  "researchCode": 8
}, {
  "idAttributeChoice": 17567,
  "idAttribute": 10308,
  "choice": "Subcapsular",
  "description": "Subcapsular",
  "sortOrder": 1,
  "isActive": "Y",
  "isAjcc": "N",
  "isCap": "N"
}, {
  "idAttributeChoice": 17568,
  "idAttribute": 10308,
  "choice": "Parenchymal/Intramedullary",
  "description": "Intramedullary",
  "sortOrder": 2,
  "isActive": "Y",
  "isAjcc": "N",
  "isCap": "N"
}, {
  "idAttributeChoice": 17569,
  "idAttribute": 10308,
  "choice": "Both",
  "description": "Both",
  "sortOrder": 3,
  "isActive": "Y",
  "isAjcc": "N",
  "isCap": "N"
}, {
  "idAttributeChoice": 17699,
  "idAttribute": 10259,
  "choice": "Unknown if dye used",
  "sortOrder": 6,
  "isActive": "Y",
  "isAjcc": "N",
  "isCap": "N"
}, {
  "idAttributeChoice": 29414,
  "idAttribute": 16666,
  "choice": "SPECT/CT",
  "sortOrder": 1,
  "isActive": "Y",
  "isAjcc": "N",
  "isCap": "N"
}, {
  "idAttributeChoice": 29415,
  "idAttribute": 16666,
  "choice": "None",
  "sortOrder": 2,
  "isActive": "Y",
  "isAjcc": "N",
  "isCap": "N"
}, {
  "idAttributeChoice": 35470,
  "idAttribute": 10263,
  "choice": "Other (specify)",
  "sortOrder": 9,
  "isActive": "Y",
  "isAjcc": "N",
  "isCap": "N"
}, {
  "idAttributeChoice": 35986,
  "idAttribute": 19288,
  "choice": "Positive",
  "sortOrder": 1,
  "isActive": "Y",
  "isAjcc": "N",
  "isCap": "N"
}, {
  "idAttributeChoice": 35987,
  "idAttribute": 19288,
  "choice": "Negative",
  "sortOrder": 2,
  "isActive": "Y",
  "isAjcc": "N",
  "isCap": "N"
}, {
  "idAttributeChoice": 35988,
  "idAttribute": 19288,
  "choice": "Unknown",
  "sortOrder": 3,
  "isActive": "Y",
  "isAjcc": "N",
  "isCap": "N"
}, {
  "idAttributeChoice": 35989,
  "idAttribute": 19288,
  "choice": "Not tested",
  "sortOrder": 4,
  "isActive": "Y",
  "isAjcc": "N",
  "isCap": "N"
}, {
  "idAttributeChoice": 36107,
  "idAttribute": 19316,
  "choice": "Yes",
  "sortOrder": 1,
  "isActive": "Y",
  "isAjcc": "N",
  "isCap": "N"
}, {
  "idAttributeChoice": 36108,
  "idAttribute": 19316,
  "choice": "No",
  "sortOrder": 2,
  "isActive": "Y",
  "isAjcc": "N",
  "isCap": "N"
}, {
  "idAttributeChoice": 36109,
  "idAttribute": 19316,
  "choice": "Not Commented",
  "sortOrder": 3,
  "isActive": "Y",
  "isAjcc": "N",
  "isCap": "N"
}, {
  "idAttributeChoice": 36110,
  "idAttribute": 19316,
  "choice": "NA (Measurable Burden)",
  "sortOrder": 4,
  "isActive": "Y",
  "isAjcc": "N",
  "isCap": "N"
}
]
