<svg version="1.1" id="Layer_1" xmlns="http://www.w3.org/2000/svg" xmlns:xlink="http://www.w3.org/1999/xlink" x="0px" y="0px"
	 viewBox="0 0 512 512" style="enable-background:new 0 0 512 512;" xml:space="preserve">
<path d="M223.67,237.38c-19.23,0-34.82,15.59-34.82,34.82c0,19.23,15.59,34.82,34.82,34.82s34.82-15.59,34.82-34.82
	C258.49,252.97,242.9,237.38,223.67,237.38z M215.39,271.89c-8.28,0-15-6.72-15-15c0-8.28,6.72-15,15-15c8.28,0,15,6.72,15,15
	C230.39,265.17,223.68,271.89,215.39,271.89z M231.43,286.79c-4.14,0-7.5-3.36-7.5-7.5s3.36-7.5,7.5-7.5s7.5,3.36,7.5,7.5
	S235.57,286.79,231.43,286.79z M315.55,297.79c23.08,0,41.78-18.71,41.78-41.78s-18.71-41.78-41.78-41.78s-41.78,18.71-41.78,41.78
	S292.47,297.79,315.55,297.79z M328.93,253.57c0,4.14-3.36,7.5-7.5,7.5c-4.14,0-7.5-3.36-7.5-7.5c0-4.14,3.36-7.5,7.5-7.5
	C325.57,246.07,328.93,249.43,328.93,253.57z M304.78,219.4c8.28,0,15,6.72,15,15s-6.72,15-15,15s-15-6.72-15-15
	S296.5,219.4,304.78,219.4z M265.21,332.65c-0.45-2.53,1.24-4.93,3.77-5.38l18.29-3.22c2.53-0.44,4.93,1.24,5.38,3.77
	c0.45,2.53-1.24,4.93-3.77,5.38l-18.29,3.22c-0.27,0.05-0.54,0.07-0.81,0.07C267.57,336.49,265.61,334.9,265.21,332.65z
	 M281.16,35.89l17.02,0.38l-0.25,11.04l-17.27,10.93L281.16,35.89z M117.98,40.49l3.21,14.28l-18.73,19.59l-6.5-28.92L117.98,40.49z
	 M486,170.65C461.86,48.5,326.31-31.31,55.83,12.74l-0.02-0.1C54.49,4.29,46.46-1.34,38.17,0.28c-8.14,1.57-13.46,9.43-11.9,17.57
	l56.84,295.21c-10.66,2.35-28.97,7.49-32.34,15.55c-4.23,10.13,2.46,38.43,6.89,44.45c1.42,1.94,3.56,3.88,6.65,4.69
	c0.12,0.54,9.14,41.69,14.27,46.85c4.6,4.62,22.85,4.02,26.66,3.42l15.04,78.13c0.74,3.8,4.36,6.37,8.21,5.75
	c3.93-0.63,6.6-4.32,5.97-8.25c0,0-3.78-23.57-9.67-60.39c43.49,4.46,76.57-9.47,80.9-8.29c4.93,1.35,1.75,24.52,17.6,50.35
	c-45.65,29.41,121.15,36.27,174.69,11.68c16.58-7.61,16.44-18.71,12.53-27.34s-1.97-17.25,1.58-22.94c5.47-8.77,2.07-21.24-4.94-28
	c-1.19-1.14-2.86,0.19-2.4,1.75c5.32,17.91-8.85,33.89-11.84,33c-1.44-0.43-2.67-6.34-1.88-9.26c1.02-3.46-2.41-4.45-3.95-1.16
	c-1.08,2.44-1.92,5.16-1.73,7.88c0.96,13.71,15.34,16.76,14.18,24.93c-1.39,9.8-36.56,11.67-51.01,7.84
	c-23.04-6.11-35.52-24.78-39.79-47.24c10.07-6.02,19.25-22.33,22.82-42.59c3.01-17.08,1.32-32.89-3.73-42.89
	c9.73-12.61,30.62-28.48,42.09-30.7c10.97-2.12,34.45,17.75,58.9-2.12c11.14-9.06,16.82-36.42,19.73-41.81
	c4.72-8.75,9.18,8.02,11.25,5.28c2.15-2.85,2.68-10.24,0-15c-3.75-6.67-12.78-8.75-22.64,3.75c-16.46,20.87-21.77-15.07-43.1-46.35
	c-21.33-31.28-83.54-57.07-120.46-53.37c-36.93,3.71-128.36,66.63-129.06,88.63c-1.27,39.69,19.41,78.37,48.95,97.67
	c-20.05-1.15-38.5-4.28-54.99-10.27c-0.82-9.16-3.73-19.93-7.89-24.72c-3.36-3.88-8.11-5.5-12.71-4.34
	c-1.9,0.48-10.31,4.13-12.44,4.94c-8.37-52.24-17.41-108.71-25.48-159.06C199.68,92.2,389.16,65.02,486,170.65z M169.16,290.49
	c-7.19-40.79,31.07-81.63,85.46-91.23c54.39-9.59,104.31,15.7,111.5,56.5c7.19,40.79-31.07,81.64-85.46,91.23
	C226.28,356.57,176.36,331.28,169.16,290.49z M117.04,339.45c0.93,3.58,1.66,8.23,1.79,11.32c-2.09,1.1-5.26,2.4-8.29,3.47
	c-0.61-3.84-1.23-7.71-1.86-11.61C111.7,341.65,114.56,340.51,117.04,339.45z M87.76,353.5c2.98,15.37,5.25,18.13,6.94,19.73
	l6.73,34.98c-3.32,0.17-6.6,0.16-9.1-0.02c-2.32-7.82-6.13-24.45-8.14-33.26c-0.89-3.89-1.7-7.43-2.38-10.28
	c-0.62-2.61-2.26-4.86-4.55-6.25c-1.54-0.94-3.3-1.43-5.07-1.45c-1.11-3.65-2.21-8.59-2.76-12.76c4.86,0.98,10.78,1.78,17.05,1.81
	C86.79,348.15,87.2,350.63,87.76,353.5z M151.32,110.9L130.9,97.98l-5.89-26.19L103,76.75l6.42,28.57l-16.43,18.7L76.32,49.86
	L65.01,52.4l9.83-22.47L95.4,42.94l13.25-20.61l28.41,11.24l3.13,13.93l-9.78,11.58l13.12,3.3l6.45,28.69l11.19-2.52L151.32,110.9z
	 M171.1,104.81l-8.84-69.21l-10.66,1.36l8.82-15.8l18.33-2.34l8.98,70.32L171.1,104.81z M225.73,96.36l-22.75-8.11l12.79-11.56
	l20.55,8.8l-2.57-32.23l-6.81,0.54l-12.3,17.66l-16.29-13.13l-1.86-23.28l28.98-18.99l18.49,8.55l-12.89,11.57l-18.32-9.08
	l2.21,27.65l6.81-0.54l11.57-16.58l16.85,9.91l2.4,30.1L225.73,96.36z M297.18,80.7l0.45-20.24l-17.02-0.38l-0.49,22.08l-15.42,10.7
	l1.28-57.3l-8.74-0.2l11.28-14.66l12.68,13.26l13.44-12.67l18.75,13.4l-0.24,10.76l-9.26,6.69l9,4.8l-0.5,22.17l8.65,0.19
	l-11.28,14.56L297.18,80.7z"/>
</svg>
