<?xml version="1.0" encoding="utf-8"?>
<svg version="1.1" id="CCR-logo-layer" xmlns="http://www.w3.org/2000/svg" xmlns:xlink="http://www.w3.org/1999/xlink" x="0px"
	 y="0px" viewBox="0 0 512 512" style="enable-background:new 0 0 512 512;" xml:space="preserve">
<path id="CCR-logo" d="M243.2,0.3v85.5C154.9,92.4,85.3,166,85.3,256s69.6,163.6,157.9,170.2v85.5C107.8,505,0,393.1,0,256
	S107.8,7,243.2,0.3z M128,256c0,66.4,50.5,120.9,115.2,127.4v-86.7c-17.3-5.4-29.9-21.6-29.9-40.7c0-19.1,12.6-35.3,29.9-40.7v-86.7
	C178.5,135.1,128,189.6,128,256z M404,113.4c-3.2,0-5.8,2.6-5.8,5.8c0,3.2,2.6,5.8,5.8,5.8c3.2,0,5.8-2.6,5.8-5.8
	C409.8,116,407.2,113.4,404,113.4z M512,512h-98.4l-59.5-103v103h-85.3V0.3v0C400.1,6.8,512,115.2,512,256
	c0,70.8-26.9,123.4-55.7,159.4L512,512z M344.2,61.6c0.1,3.3,1.2,46.2,1.2,46.2s16.7-9.8,33.7-14.5c0,0,0.7-28.3,0.8-31.7
	C380.2,51.3,343.9,51.3,344.2,61.6z M399.8,298c-4.7-5.5-12.3-12.9-25.7-12.9c0,0-0.7,21.3-0.9,33.9c-11.2,12.5-30.3,20.1-38.5,25.8
	c-12.7,8.8-15.4,24.6-10.4,35.7c5.1,11.2,14.6,18.9,28.7,18.9c0,0-0.6-22.2-0.8-30.1c28.6-9.5,41.7-21.1,48.6-30.7
	C407.5,329.3,411.2,311.2,399.8,298z M416.7,217.9c-2.8-21.3-20.8-35.8-40-35.8c0,0-1,35.2-1.1,41.4c-13.6,7.2-22.2,8.4-38.7,14.8
	c-20.4,7.9-30.6,29.8-22.4,49c6.3,14.6,19.3,24.1,36.1,24.1l-1-37.6c0,0,18-2,43.4-12.7C409.3,254.3,419.5,238.8,416.7,217.9z
	 M424.1,118.8c-5-13.7-18.7-17.7-28.3-16.5c-21.7,2.6-50.2,14.2-74.5,35.2c-13.9,12-24.4,28.2-16.9,51.8c6,18.8,23.4,30.5,43.9,30.5
	l-1.2-45.2c23.2-15,44.4-15.4,58.8-20.5C421.1,148.8,429.2,133.1,424.1,118.8z"/>
</svg>
