<svg version="1.1" id="Layer_1" xmlns="http://www.w3.org/2000/svg" xmlns:xlink="http://www.w3.org/1999/xlink" x="0px" y="0px"
	 viewBox="0 0 512 512" style="enable-background:new 0 0 512 512;" xml:space="preserve">
<path d="M512,139H0V95.1c0-24.2,19.7-43.9,43.9-43.9h424.2c24.2,0,43.9,19.7,43.9,43.9V139z M0,226.7h512v190.2
	c0,24.2-19.7,43.9-43.9,43.9H43.9C19.7,460.8,0,441.1,0,416.9V226.7z M58.5,391.3c0,6,4.9,11,11,11h65.8c6,0,11-4.9,11-11v-36.6
	c0-6-4.9-11-11-11H69.5c-6,0-11,4.9-11,11V391.3z M175.5,391.3c0,6,4.9,11,11,11h124.3c6,0,11-4.9,11-11v-36.6c0-6-4.9-11-11-11
	H186.5c-6,0-11,4.9-11,11V391.3z"/>
</svg>
