<svg version="1.1" id="Layer_1" xmlns="http://www.w3.org/2000/svg" xmlns:xlink="http://www.w3.org/1999/xlink" x="0px" y="0px"
	 viewBox="0 0 512 512" style="enable-background:new 0 0 512 512;" xml:space="preserve">
<path d="M350.05,94.71c0,11.9-9.65,21.55-21.55,21.55c-11.9,0-21.55-9.65-21.55-21.55c0-11.9,9.65-21.55,21.55-21.55
	C340.4,73.16,350.05,82.81,350.05,94.71z M406.5,215.56c-3.65,28.61,25.55,105.51,61.17,129.11c-39.25-6.81-68.54-18.81-76.97-25.98
	c0.21,3.12,2.42,100.65-66.8,135.89c1.61-28.34,16.96-61.64,4.55-98.22c-7.38,41.09-48.97,109.46-111.59,155.65
	c-20.44-24.6-59.83-110.96-60.23-163.58c-16.92,12.13-38.32,42.72-42.43,82.94c-32.09-15.93-43.42-120.89-26.2-174.69
	c-13.57,3.91-55,18.11-88.01,10.7c54.79-30.54,72.68-126.35,114.82-149.55c-0.12-0.21-29.23,4.9-50.12,21.29
	c2.95-11.59,32.85-75.17,118.03-89.42c-9.46-5.31-23.79-29.24-17.37-49.69c4.38,7.16,14.01,12.3,21.77,15.01
	c55.43,19.34,178.31-1.05,237.91,40.33c8.83,6.13,15.41,13,19.49,20.73c26.55,7.47,39.96,17.37,46.3,21.98
	c12.91,9.4,45.93,47.27-11.7,121.94c-4.91-40.28-27.48-41.58-31.85-42.12C428.64,175.55,410.26,186.11,406.5,215.56z M384.72,57.75
	c7.01-0.94,20.13,2.52,31.68,9.47c-42.57-39.79-172.58-19.68-237.9-42.77c0.69,4.04,16.94,21.49,35.95,26.28
	c-17.69,5.84-97.19,28.78-112.34,59.27c29.61-15.84,61.28-25.38,91.17-21.79C64.18,127.5,92.19,222.29,37.32,253.51
	c42.91-1.83,56.94-17.88,73.13-48.61c7.55,30.59-28.64,106.77-4.4,187.87c4.4-11.22,28.64-56.81,65.12-72.94
	c-12.14,59.55,47.32,164.74,48.73,166.89c30.95-20,88.87-93.77,109.02-161.16c11.97,16.29,25.49,64.39,15.83,96.99
	c28.86-36.5,38.65-74.74,28.59-139.07c10.9,15,29.94,28.49,45.21,30.22c-18.2-25.83-28.38-42.22-34.66-86.59
	c-5.28,10.56-6.03,17.8-5.12,31.71c-7.66-1.45-27.24-20.77-36.87-42.05c14.91,38.83,23.55,93.64,13.21,116.46
	c-7.61-26.98-22.17-46.25-37.49-59.02c0.73,39.27-33,116.91-64.16,130.01c17.18-40,13.29-71,0.01-101.64
	c-20.57,34.73-27.58,84.28-25.54,137.91c-33.71-51.08-44.44-158.85-20.43-197.67c-36.27,7.41-64.36,38.82-77.07,66.98
	c2.55-61.8,48.27-129.67,63.28-138.49c-19.92-10.73-67.62-8.22-86.32,2.04c34.44-47.55,103.18-59.76,148.1-60.07
	c-4.49-9.09-17.29-15.48-43.75-19.12c49.68-43.62,94.08-45.44,124.39-33.03c12.96,4.87,25.88,12.18,34.6,20.06
	c-4.55-10.99-13.47-19.6-18.5-24.47c16.03,0.48,26.76,7.83,39.79,14.85C392.49,66.04,387.64,61.2,384.72,57.75z M308.13,65.34
	c-11.56,0-24.91,9.41-27.15,22.12c-3.36,19.07,14.33,38.13,39.53,42.58c25.19,4.44,49.46-8.24,51.71-26.49
	C374.09,88.17,331.14,65.34,308.13,65.34z"/>
</svg>
