{
  "className": "hci.ri.core.subject.model.Address",
  "fields": [{
    "id": false,
    "field": "serialVersionUID",
    "type": "long",
    "notNull": false,
    "min": null,
    "max": null,
    "dictionaryClassName": null,
    "phi": false
  }, {
    "id": true,
    "field": "idAddress",
    "type": "Long",
    "notNull": false,
    "min": null,
    "max": null,
    "dictionaryClassName": null,
    "phi": false
  }, {
    "id": false,
    "field": "idAddressType",
    "type": "Long",
    "notNull": true,
    "min": null,
    "max": null,
    "dictionaryClassName": "hci.ri.core.subject.model.AddressType",
    "phi": false
  }, {
    "id": false,
    "field": "mailingName",
    "type": "String",
    "notNull": false,
    "min": 0,
    "max": 256,
    "dictionaryClassName": null,
    "phi": true
  }, {
    "id": false,
    "field": "address1",
    "type": "String",
    "notNull": false,
    "min": 0,
    "max": 512,
    "dictionaryClassName": null,
    "phi": true
  }, {
    "id": false,
    "field": "address2",
    "type": "String",
    "notNull": false,
    "min": 0,
    "max": 512,
    "dictionaryClassName": null,
    "phi": true
  }, {
    "id": false,
    "field": "city",
    "type": "String",
    "notNull": false,
    "min": 0,
    "max": 96,
    "dictionaryClassName": null,
    "phi": true
  }, {
    "id": false,
    "field": "county",
    "type": "String",
    "notNull": false,
    "min": 0,
    "max": 64,
    "dictionaryClassName": null,
    "phi": true
  }, {
    "id": false,
    "field": "state",
    "type": "String",
    "notNull": false,
    "min": 0,
    "max": 96,
    "dictionaryClassName": null,
    "phi": false
  }, {
    "id": false,
    "field": "postalCode",
    "type": "String",
    "notNull": false,
    "min": 0,
    "max": 64,
    "dictionaryClassName": null,
    "phi": true
  }, {
    "id": false,
    "field": "country",
    "type": "String",
    "notNull": false,
    "min": 0,
    "max": 96,
    "dictionaryClassName": null,
    "phi": false
  }, {
    "id": false,
    "field": "idSubject",
    "type": "Long",
    "notNull": true,
    "min": null,
    "max": null,
    "dictionaryClassName": null,
    "phi": false
  }, {
    "id": false,
    "field": "idSystemSource",
    "type": "Long",
    "notNull": true,
    "min": null,
    "max": null,
    "dictionaryClassName": null,
    "phi": false
  }, {
    "id": false,
    "field": "idRecordSource",
    "type": "Long",
    "notNull": true,
    "min": null,
    "max": null,
    "dictionaryClassName": null,
    "phi": false
  }, {
    "id": false,
    "field": "idStudy",
    "type": "Long",
    "notNull": false,
    "min": null,
    "max": null,
    "dictionaryClassName": null,
    "phi": false
  }, {
    "id": false,
    "field": "track",
    "type": "Track",
    "notNull": false,
    "min": null,
    "max": null,
    "dictionaryClassName": null,
    "phi": false
  }
  ]
}
