{
  "idAttributeValueSet": 156231,
  "createDateTime": "2012-03-06T21:14:50+00:00",
  "attributeValues": [{
    "idAttributeValue": 5797176,
    "codeAttributeDataType": "D",
    "idAttributeValueSet": 156231,
    "idAttribute": 2564,
    "valueDateTime": "2018-12-01 00:00:00.000"
  }, {
    "idAttributeValue": 5797177,
    "codeAttributeDataType": "DICT",
    "idAttributeValueSet": 156231,
    "idAttribute": 2849,
    "valueIdDictionary": 169
  }, {
    "idAttributeValue": 5797178,
    "codeAttributeDataType": "I",
    "idAttributeValueSet": 156231,
    "idAttribute": 10258,
    "valueInteger": 3
  }, {
    "idAttributeValue": 5797179,
    "codeAttributeDataType": "S",
    "idAttributeValueSet": 156231,
    "idAttribute": 2867
  }, {
    "idAttributeValue": 5797180,
    "codeAttributeDataType": "I",
    "idAttributeValueSet": 156231,
    "idAttribute": 2569,
    "valueInteger": 1
  }, {
    "idAttributeValue": 5797181,
    "codeAttributeDataType": "I",
    "idAttributeValueSet": 156231,
    "idAttribute": 2567,
    "valueInteger": 2
  }, {
    "idAttributeValue": 5797182,
    "codeAttributeDataType": "EB",
    "idAttributeValueSet": 156231,
    "idAttribute": 2566
  }, {
    "idAttributeValue": 5797183,
    "codeAttributeDataType": "EB",
    "idAttributeValueSet": 156231,
    "idAttribute": 2865,
    "valueString": "N"
  }, {
    "idAttributeValue": 5797184,
    "codeAttributeDataType": "S",
    "idAttributeValueSet": 156231,
    "idAttribute": 10260,
    "valueString": 2
  }, {
    "idAttributeValue": 5797185,
    "codeAttributeDataType": "AC",
    "idAttributeValueSet": 156231,
    "idAttribute": 2850,
    "valueIdAttributeChoice": 8334
  }, {
    "idAttributeValue": 5797186,
    "codeAttributeDataType": "S",
    "idAttributeValueSet": 156231,
    "idAttribute": 2563,
    "valueString": 1
  }, {
    "idAttributeValue": 5797187,
    "codeAttributeDataType": "S",
    "idAttributeValueSet": 156231,
    "idAttribute": 2847,
    "valueString": 2
  }, {
    "idAttributeValue": 5797188,
    "codeAttributeDataType": "D",
    "idAttributeValueSet": 156231,
    "idAttribute": 2848,
    "valueDateTime": "2014-07-30 00:00:00.000"
  }, {
    "idAttributeValue": 5797189,
    "codeAttributeDataType": "EB",
    "idAttributeValueSet": 156231,
    "idAttribute": 10247,
    "valueString": "U"
  }, {
    "idAttributeValue": 5797190,
    "codeAttributeDataType": "AC",
    "idAttributeValueSet": 156231,
    "idAttribute": 10259,
    "valueIdAttributeChoice": 17499
  }, {
    "idAttributeValue": 5797191,
    "codeAttributeDataType": "S",
    "idAttributeValueSet": 156231,
    "idAttribute": 10249
  }, {
    "idAttributeValue": 5797192,
    "codeAttributeDataType": "DICT",
    "idAttributeValueSet": 156231,
    "idAttribute": 2565,
    "valueIdDictionary": 10
  }, {
    "idAttributeValue": 5797193,
    "codeAttributeDataType": "AC",
    "idAttributeValueSet": 156231,
    "idAttribute": 16666,
    "valueIdAttributeChoice": 29415
  }, {
    "idAttributeValue": 6354309,
    "codeAttributeDataType": "S",
    "idAttributeValueSet": 156231,
    "idAttribute": 302,
    "idGroupAttribute": 301,
    "groupAttributeRowId": 1
  }, {
    "idAttributeValue": 6354310,
    "codeAttributeDataType": "D",
    "idAttributeValueSet": 156231,
    "idAttribute": 303,
    "valueDateTime": "2014-02-28 00:00:00.000",
    "idGroupAttribute": 301,
    "groupAttributeRowId": 1
  }, {
    "idAttributeValue": 6354311,
    "codeAttributeDataType": "DICT",
    "idAttributeValueSet": 156231,
    "idAttribute": 304,
    "valueIdDictionary": 127,
    "idAttributeDictionary": 7,
    "idGroupAttribute": 301,
    "groupAttributeRowId": 1
  }, {
    "idAttributeValue": 6354312,
    "codeAttributeDataType": "AC",
    "idAttributeValueSet": 156231,
    "idAttribute": 305,
    "valueIdAttributeChoice": 249,
    "idGroupAttribute": 301,
    "groupAttributeRowId": 1
  }, {
    "idAttributeValue": 6354313,
    "codeAttributeDataType": "TXT",
    "idAttributeValueSet": 156231,
    "idAttribute": 306,
    "idGroupAttribute": 301,
    "groupAttributeRowId": 1
  }, {
    "idAttributeValue": 6354314,
    "codeAttributeDataType": "S",
    "idAttributeValueSet": 156231,
    "idAttribute": 2578,
    "idGroupAttribute": 2577,
    "groupAttributeRowId": 1
  }, {
    "idAttributeValue": 6354315,
    "codeAttributeDataType": "I",
    "idAttributeValueSet": 156231,
    "idAttribute": 2579,
    "idGroupAttribute": 2577,
    "groupAttributeRowId": 1
  }, {
    "idAttributeValue": 6354316,
    "codeAttributeDataType": "I",
    "idAttributeValueSet": 156231,
    "idAttribute": 2580,
    "idGroupAttribute": 2577,
    "groupAttributeRowId": 1
  }, {
    "idAttributeValue": 6354317,
    "codeAttributeDataType": "I",
    "idAttributeValueSet": 156231,
    "idAttribute": 10261,
    "idGroupAttribute": 2577,
    "groupAttributeRowId": 1
  }, {
    "idAttributeValue": 6354318,
    "codeAttributeDataType": "I",
    "idAttributeValueSet": 156231,
    "idAttribute": 10262,
    "idGroupAttribute": 2577,
    "groupAttributeRowId": 1
  }, {
    "idAttributeValue": 6354319,
    "codeAttributeDataType": "AC",
    "idAttributeValueSet": 156231,
    "idAttribute": 2582,
    "valueIdAttributeChoice": 8043,
    "idGroupAttribute": 2577,
    "groupAttributeRowId": 1
  }, {
    "idAttributeValue": 6354320,
    "codeAttributeDataType": "AC",
    "idAttributeValueSet": 156231,
    "idAttribute": 2583,
    "valueIdAttributeChoice": 8046,
    "idGroupAttribute": 2577,
    "groupAttributeRowId": 1
  }, {
    "idAttributeValue": 6354321,
    "codeAttributeDataType": "AC",
    "idAttributeValueSet": 156231,
    "idAttribute": 10263,
    "valueIdAttributeChoice": 17510,
    "idGroupAttribute": 2577,
    "groupAttributeRowId": 1
  }, {
    "idAttributeValue": 6354322,
    "codeAttributeDataType": "S",
    "idAttributeValueSet": 156231,
    "idAttribute": 2584,
    "idGroupAttribute": 2577,
    "groupAttributeRowId": 1
  }, {
    "idAttributeValue": 6354323,
    "codeAttributeDataType": "I",
    "idAttributeValueSet": 156231,
    "idAttribute": 10264,
    "idGroupAttribute": 2577,
    "groupAttributeRowId": 1
  }, {
    "idAttributeValue": 6354324,
    "codeAttributeDataType": "I",
    "idAttributeValueSet": 156231,
    "idAttribute": 10265,
    "idGroupAttribute": 2577,
    "groupAttributeRowId": 1
  }, {
    "idAttributeValue": 6354325,
    "codeAttributeDataType": "I",
    "idAttributeValueSet": 156231,
    "idAttribute": 10266,
    "idGroupAttribute": 2577,
    "groupAttributeRowId": 1
  }, {
    "idAttributeValue": 6354326,
    "codeAttributeDataType": "EB",
    "idAttributeValueSet": 156231,
    "idAttribute": 2590,
    "valueString": "U",
    "idGroupAttribute": 2577,
    "groupAttributeRowId": 1
  }, {
    "idAttributeValue": 6354327,
    "codeAttributeDataType": "AC",
    "idAttributeValueSet": 156231,
    "idAttribute": 2581,
    "valueIdAttributeChoice": 8040,
    "idGroupAttribute": 2577,
    "groupAttributeRowId": 1
  }, {
    "idAttributeValue": 6354328,
    "codeAttributeDataType": "B",
    "idAttributeValueSet": 156231,
    "idAttribute": 2589,
    "valueString": "Y",
    "idGroupAttribute": 2577,
    "groupAttributeRowId": 1
  }, {
    "idAttributeValue": 6354329,
    "codeAttributeDataType": "S",
    "idAttributeValueSet": 156231,
    "idAttribute": 10267,
    "idGroupAttribute": 2577,
    "groupAttributeRowId": 1
  }, {
    "idAttributeValue": 6354330,
    "codeAttributeDataType": "EB",
    "idAttributeValueSet": 156231,
    "idAttribute": 10269,
    "valueString": "U",
    "idGroupAttribute": 2577,
    "groupAttributeRowId": 1
  }, {
    "idAttributeValue": 6354331,
    "codeAttributeDataType": "EB",
    "idAttributeValueSet": 156231,
    "idAttribute": 10270,
    "idGroupAttribute": 2577,
    "groupAttributeRowId": 1
  }, {
    "idAttributeValue": 6354332,
    "codeAttributeDataType": "EB",
    "idAttributeValueSet": 156231,
    "idAttribute": 10271,
    "idGroupAttribute": 2577,
    "groupAttributeRowId": 1
  }, {
    "idAttributeValue": 6354333,
    "codeAttributeDataType": "EB",
    "idAttributeValueSet": 156231,
    "idAttribute": 10272,
    "valueString": "U",
    "idGroupAttribute": 2577,
    "groupAttributeRowId": 1
  }, {
    "idAttributeValue": 6354334,
    "codeAttributeDataType": "EB",
    "idAttributeValueSet": 156231,
    "idAttribute": 10273,
    "idGroupAttribute": 2577,
    "groupAttributeRowId": 1
  }, {
    "idAttributeValue": 6354335,
    "codeAttributeDataType": "EB",
    "idAttributeValueSet": 156231,
    "idAttribute": 10274,
    "idGroupAttribute": 2577,
    "groupAttributeRowId": 1
  }, {
    "idAttributeValue": 6354336,
    "codeAttributeDataType": "S",
    "idAttributeValueSet": 156231,
    "idAttribute": 10275,
    "idGroupAttribute": 2577,
    "groupAttributeRowId": 1
  }, {
    "idAttributeValue": 6354337,
    "codeAttributeDataType": "S",
    "idAttributeValueSet": 156231,
    "idAttribute": 10276,
    "idGroupAttribute": 2577,
    "groupAttributeRowId": 1
  }, {
    "idAttributeValue": 6354338,
    "codeAttributeDataType": "I",
    "idAttributeValueSet": 156231,
    "idAttribute": 277,
    "valueInteger": 2
  }, {
    "idAttributeValue": 6354339,
    "codeAttributeDataType": "I",
    "idAttributeValueSet": 156231,
    "idAttribute": 278,
    "valueInteger": 3
  }, {
    "idAttributeValue": 6354340,
    "codeAttributeDataType": "I",
    "idAttributeValueSet": 156231,
    "idAttribute": 275,
    "valueInteger": 4
  }, {
    "idAttributeValue": 6354341,
    "codeAttributeDataType": "I",
    "idAttributeValueSet": 156231,
    "idAttribute": 276,
    "valueInteger": 5
  }, {
    "idAttributeValue": 6354342,
    "codeAttributeDataType": "I",
    "idAttributeValueSet": 156231,
    "idAttribute": 279,
    "valueInteger": 6
  }, {
    "idAttributeValue": 6354343,
    "codeAttributeDataType": "I",
    "idAttributeValueSet": 156231,
    "idAttribute": 280,
    "valueInteger": 8
  }, {
    "idAttributeValue": 6354344,
    "codeAttributeDataType": "AC",
    "idAttributeValueSet": 156231,
    "idAttribute": 2637,
    "idGroupAttribute": 2577,
    "groupAttributeRowId": 1
  }, {
    "idAttributeValue": 6354345,
    "codeAttributeDataType": "S",
    "idAttributeValueSet": 156231,
    "idAttribute": 10280,
    "idGroupAttribute": 10279,
    "groupAttributeRowId": 1
  }, {
    "idAttributeValue": 6354346,
    "codeAttributeDataType": "S",
    "idAttributeValueSet": 156231,
    "idAttribute": 10281,
    "idGroupAttribute": 10279,
    "groupAttributeRowId": 1
  }, {
    "idAttributeValue": 6354347,
    "codeAttributeDataType": "AC",
    "idAttributeValueSet": 156231,
    "idAttribute": 10282,
    "valueIdAttributeChoice": 17513,
    "idGroupAttribute": 10279,
    "groupAttributeRowId": 1
  }, {
    "idAttributeValue": 6354348,
    "codeAttributeDataType": "B",
    "idAttributeValueSet": 156231,
    "idAttribute": 10283,
    "valueString": "N",
    "idGroupAttribute": 10279,
    "groupAttributeRowId": 1
  }, {
    "idAttributeValue": 6354349,
    "codeAttributeDataType": "AC",
    "idAttributeValueSet": 156231,
    "idAttribute": 10284,
    "valueIdAttributeChoice": 17514,
    "idGroupAttribute": 10279,
    "groupAttributeRowId": 1
  }, {
    "idAttributeValue": 6354350,
    "codeAttributeDataType": "EB",
    "idAttributeValueSet": 156231,
    "idAttribute": 10285,
    "idGroupAttribute": 10279,
    "groupAttributeRowId": 1
  }, {
    "idAttributeValue": 6354351,
    "codeAttributeDataType": "EB",
    "idAttributeValueSet": 156231,
    "idAttribute": 10286,
    "idGroupAttribute": 10279,
    "groupAttributeRowId": 1
  }, {
    "idAttributeValue": 6354352,
    "codeAttributeDataType": "AC",
    "idAttributeValueSet": 156231,
    "idAttribute": 10287,
    "idGroupAttribute": 10279,
    "groupAttributeRowId": 1
  }, {
    "idAttributeValue": 6354353,
    "codeAttributeDataType": "B",
    "idAttributeValueSet": 156231,
    "idAttribute": 10288,
    "valueString": "N",
    "idGroupAttribute": 10279,
    "groupAttributeRowId": 1
  }, {
    "idAttributeValue": 6354354,
    "codeAttributeDataType": "I",
    "idAttributeValueSet": 156231,
    "idAttribute": 10289,
    "idGroupAttribute": 10279,
    "groupAttributeRowId": 1
  }, {
    "idAttributeValue": 6354355,
    "codeAttributeDataType": "I",
    "idAttributeValueSet": 156231,
    "idAttribute": 10290,
    "idGroupAttribute": 10279,
    "groupAttributeRowId": 1
  }, {
    "idAttributeValue": 6354356,
    "codeAttributeDataType": "I",
    "idAttributeValueSet": 156231,
    "idAttribute": 10291,
    "idGroupAttribute": 10279,
    "groupAttributeRowId": 1
  }, {
    "idAttributeValue": 6354357,
    "codeAttributeDataType": "I",
    "idAttributeValueSet": 156231,
    "idAttribute": 10292,
    "idGroupAttribute": 10279,
    "groupAttributeRowId": 1
  }, {
    "idAttributeValue": 6354358,
    "codeAttributeDataType": "AC",
    "idAttributeValueSet": 156231,
    "idAttribute": 10293,
    "valueIdAttributeChoice": 17520,
    "idGroupAttribute": 10279,
    "groupAttributeRowId": 1
  }, {
    "idAttributeValue": 6354359,
    "codeAttributeDataType": "AC",
    "idAttributeValueSet": 156231,
    "idAttribute": 10294,
    "idGroupAttribute": 10279,
    "groupAttributeRowId": 1
  }, {
    "idAttributeValue": 6354360,
    "codeAttributeDataType": "AC",
    "idAttributeValueSet": 156231,
    "idAttribute": 10295,
    "valueIdAttributeChoice": 17528,
    "idGroupAttribute": 10279,
    "groupAttributeRowId": 1
  }, {
    "idAttributeValue": 6354361,
    "codeAttributeDataType": "AC",
    "idAttributeValueSet": 156231,
    "idAttribute": 10296,
    "valueIdAttributeChoice": 17532,
    "idGroupAttribute": 10279,
    "groupAttributeRowId": 1
  }, {
    "idAttributeValue": 6354362,
    "codeAttributeDataType": "AC",
    "idAttributeValueSet": 156231,
    "idAttribute": 10297,
    "idGroupAttribute": 10279,
    "groupAttributeRowId": 1
  }, {
    "idAttributeValue": 6354363,
    "codeAttributeDataType": "AC",
    "idAttributeValueSet": 156231,
    "idAttribute": 10298,
    "valueIdAttributeChoice": 17540,
    "idGroupAttribute": 10279,
    "groupAttributeRowId": 1
  }, {
    "idAttributeValue": 6354364,
    "codeAttributeDataType": "S",
    "idAttributeValueSet": 156231,
    "idAttribute": 10299,
    "idGroupAttribute": 10279,
    "groupAttributeRowId": 1
  }, {
    "idAttributeValue": 6354365,
    "codeAttributeDataType": "EB",
    "idAttributeValueSet": 156231,
    "idAttribute": 10300,
    "idGroupAttribute": 10279,
    "groupAttributeRowId": 1
  }, {
    "idAttributeValue": 6354366,
    "codeAttributeDataType": "AC",
    "idAttributeValueSet": 156231,
    "idAttribute": 10302,
    "idGroupAttribute": 10279,
    "groupAttributeRowId": 1
  }, {
    "idAttributeValue": 6354367,
    "codeAttributeDataType": "AC",
    "idAttributeValueSet": 156231,
    "idAttribute": 10303,
    "valueIdAttributeChoice": 17550,
    "idGroupAttribute": 10279,
    "groupAttributeRowId": 1
  }, {
    "idAttributeValue": 6354368,
    "codeAttributeDataType": "AC",
    "idAttributeValueSet": 156231,
    "idAttribute": 10304,
    "valueIdAttributeChoice": 17554,
    "idGroupAttribute": 10279,
    "groupAttributeRowId": 1
  }, {
    "idAttributeValue": 6354369,
    "codeAttributeDataType": "AC",
    "idAttributeValueSet": 156231,
    "idAttribute": 10305,
    "valueIdAttributeChoice": 17558,
    "idGroupAttribute": 10279,
    "groupAttributeRowId": 1
  }, {
    "idAttributeValue": 6354370,
    "codeAttributeDataType": "AC",
    "idAttributeValueSet": 156231,
    "idAttribute": 10306,
    "idGroupAttribute": 10279,
    "groupAttributeRowId": 1
  }, {
    "idAttributeValue": 6354371,
    "codeAttributeDataType": "AC",
    "idAttributeValueSet": 156231,
    "idAttribute": 10307,
    "valueIdAttributeChoice": 17566,
    "idGroupAttribute": 10279,
    "groupAttributeRowId": 1
  }, {
    "idAttributeValue": 6354372,
    "codeAttributeDataType": "AC",
    "idAttributeValueSet": 156231,
    "idAttribute": 10308,
    "valueIdAttributeChoice": 17568,
    "idGroupAttribute": 10279,
    "groupAttributeRowId": 1
  }, {
    "idAttributeValue": 6354373,
    "codeAttributeDataType": "EB",
    "idAttributeValueSet": 156231,
    "idAttribute": 10313,
    "idGroupAttribute": 10279,
    "groupAttributeRowId": 1
  }, {
    "idAttributeValue": 6354374,
    "codeAttributeDataType": "N",
    "idAttributeValueSet": 156231,
    "idAttribute": 10309,
    "idGroupAttribute": 10279,
    "groupAttributeRowId": 1
  }, {
    "idAttributeValue": 6354375,
    "codeAttributeDataType": "N",
    "idAttributeValueSet": 156231,
    "idAttribute": 10315,
    "idGroupAttribute": 10279,
    "groupAttributeRowId": 1
  }, {
    "idAttributeValue": 6354376,
    "codeAttributeDataType": "I",
    "idAttributeValueSet": 156231,
    "idAttribute": 10312,
    "idGroupAttribute": 10279,
    "groupAttributeRowId": 1
  }, {
    "idAttributeValue": 6354377,
    "codeAttributeDataType": "N",
    "idAttributeValueSet": 156231,
    "idAttribute": 10310,
    "idGroupAttribute": 10279,
    "groupAttributeRowId": 1
  }, {
    "idAttributeValue": 6354378,
    "codeAttributeDataType": "N",
    "idAttributeValueSet": 156231,
    "idAttribute": 10311,
    "idGroupAttribute": 10279,
    "groupAttributeRowId": 1
  }, {
    "idAttributeValue": 6354379,
    "codeAttributeDataType": "S",
    "idAttributeValueSet": 156231,
    "idAttribute": 10314,
    "idGroupAttribute": 10279,
    "groupAttributeRowId": 1
  }, {
    "idAttributeValue": 6354590,
    "codeAttributeDataType": "S",
    "idAttributeValueSet": 156231,
    "idAttribute": 2852,
    "idGroupAttribute": 2851,
    "groupAttributeRowId": 1
  }, {
    "idAttributeValue": 6354591,
    "codeAttributeDataType": "I",
    "idAttributeValueSet": 156231,
    "idAttribute": 2853,
    "idGroupAttribute": 2851,
    "groupAttributeRowId": 1
  }, {
    "idAttributeValue": 6354592,
    "codeAttributeDataType": "I",
    "idAttributeValueSet": 156231,
    "idAttribute": 2854,
    "idGroupAttribute": 2851,
    "groupAttributeRowId": 1
  }, {
    "idAttributeValue": 6354593,
    "codeAttributeDataType": "B",
    "idAttributeValueSet": 156231,
    "idAttribute": 2855,
    "valueString": "Y",
    "idGroupAttribute": 2851,
    "groupAttributeRowId": 1
  }, {
    "idAttributeValue": 6354594,
    "codeAttributeDataType": "AC",
    "idAttributeValueSet": 156231,
    "idAttribute": 2856,
    "valueIdAttributeChoice": 8338,
    "idGroupAttribute": 2851,
    "groupAttributeRowId": 1
  }, {
    "idAttributeValue": 6354595,
    "codeAttributeDataType": "AC",
    "idAttributeValueSet": 156231,
    "idAttribute": 2857,
    "valueIdAttributeChoice": 8341,
    "idGroupAttribute": 2851,
    "groupAttributeRowId": 1
  }, {
    "idAttributeValue": 6354596,
    "codeAttributeDataType": "AC",
    "idAttributeValueSet": 156231,
    "idAttribute": 2858,
    "valueIdAttributeChoice": 8344,
    "idGroupAttribute": 2851,
    "groupAttributeRowId": 1
  }, {
    "idAttributeValue": 6354597,
    "codeAttributeDataType": "AC",
    "idAttributeValueSet": 156231,
    "idAttribute": 10250,
    "valueIdAttributeChoice": 17495,
    "idGroupAttribute": 2851,
    "groupAttributeRowId": 1
  }, {
    "idAttributeValue": 6354598,
    "codeAttributeDataType": "S",
    "idAttributeValueSet": 156231,
    "idAttribute": 2859,
    "idGroupAttribute": 2851,
    "groupAttributeRowId": 1
  }, {
    "idAttributeValue": 6354599,
    "codeAttributeDataType": "AC",
    "idAttributeValueSet": 156231,
    "idAttribute": 2860,
    "valueIdAttributeChoice": 8349,
    "idGroupAttribute": 2851,
    "groupAttributeRowId": 1
  }, {
    "idAttributeValue": 6354600,
    "codeAttributeDataType": "EB",
    "idAttributeValueSet": 156231,
    "idAttribute": 2862,
    "valueString": "U",
    "idGroupAttribute": 2851,
    "groupAttributeRowId": 1
  }, {
    "idAttributeValue": 6354601,
    "codeAttributeDataType": "EB",
    "idAttributeValueSet": 156231,
    "idAttribute": 10252,
    "valueString": "U",
    "idGroupAttribute": 2851,
    "groupAttributeRowId": 1
  }, {
    "idAttributeValue": 6354602,
    "codeAttributeDataType": "AC",
    "idAttributeValueSet": 156231,
    "idAttribute": 10251,
    "valueIdAttributeChoice": 17497,
    "idGroupAttribute": 2851,
    "groupAttributeRowId": 1
  }, {
    "idAttributeValue": 6354603,
    "codeAttributeDataType": "B",
    "idAttributeValueSet": 156231,
    "idAttribute": 2861,
    "valueString": "Y",
    "idGroupAttribute": 2851,
    "groupAttributeRowId": 1
  }, {
    "idAttributeValue": 6354604,
    "codeAttributeDataType": "N",
    "idAttributeValueSet": 156231,
    "idAttribute": 2864,
    "idGroupAttribute": 2851,
    "groupAttributeRowId": 1
  }, {
    "idAttributeValue": 6354605,
    "codeAttributeDataType": "I",
    "idAttributeValueSet": 156231,
    "idAttribute": 2863,
    "idGroupAttribute": 2851,
    "groupAttributeRowId": 1
  }, {
    "idAttributeValue": 6354606,
    "codeAttributeDataType": "EB",
    "idAttributeValueSet": 156231,
    "idAttribute": 10253,
    "valueString": "U",
    "idGroupAttribute": 2851,
    "groupAttributeRowId": 1
  }, {
    "idAttributeValue": 6354607,
    "codeAttributeDataType": "I",
    "idAttributeValueSet": 156231,
    "idAttribute": 10254,
    "idGroupAttribute": 2851,
    "groupAttributeRowId": 1
  }, {
    "idAttributeValue": 6354608,
    "codeAttributeDataType": "S",
    "idAttributeValueSet": 156231,
    "idAttribute": 4260,
    "idGroupAttribute": 2851,
    "groupAttributeRowId": 1
  }, {
    "idAttributeValue": 6354609,
    "codeAttributeDataType": "S",
    "idAttributeValueSet": 156231,
    "idAttribute": 10255,
    "idGroupAttribute": 2851,
    "groupAttributeRowId": 1
  }, {
    "idAttributeValue": 12113722,
    "codeAttributeDataType": "AC",
    "idAttributeValueSet": 156231,
    "idAttribute": 2866,
    "valueIdAttributeChoice": 8351
  }, {
    "idAttributeValue": 12113723,
    "codeAttributeDataType": "AC",
    "idAttributeValueSet": 156231,
    "idAttribute": 2866,
    "valueIdAttributeChoice": 8352
  }, {
    "idAttributeValue": 12113724,
    "codeAttributeDataType": "AC",
    "idAttributeValueSet": 156231,
    "idAttribute": 10248,
    "valueIdAttributeChoice": 17486
  }, {
    "idAttributeValue": 12113725,
    "codeAttributeDataType": "S",
    "idAttributeValueSet": 156231,
    "idAttribute": 2578,
    "valueString": 1,
    "idGroupAttribute": 2577,
    "groupAttributeRowId": 2
  }, {
    "idAttributeValue": 12113726,
    "codeAttributeDataType": "I",
    "idAttributeValueSet": 156231,
    "idAttribute": 2579,
    "valueInteger": 2,
    "idGroupAttribute": 2577,
    "groupAttributeRowId": 2
  }, {
    "idAttributeValue": 12113727,
    "codeAttributeDataType": "I",
    "idAttributeValueSet": 156231,
    "idAttribute": 2580,
    "valueInteger": 3,
    "idGroupAttribute": 2577,
    "groupAttributeRowId": 2
  }, {
    "idAttributeValue": 12113728,
    "codeAttributeDataType": "I",
    "idAttributeValueSet": 156231,
    "idAttribute": 10261,
    "valueInteger": 4,
    "idGroupAttribute": 2577,
    "groupAttributeRowId": 2
  }, {
    "idAttributeValue": 12113729,
    "codeAttributeDataType": "I",
    "idAttributeValueSet": 156231,
    "idAttribute": 10262,
    "valueInteger": 5,
    "idGroupAttribute": 2577,
    "groupAttributeRowId": 2
  }, {
    "idAttributeValue": 12113730,
    "codeAttributeDataType": "AC",
    "idAttributeValueSet": 156231,
    "idAttribute": 2582,
    "valueIdAttributeChoice": 8042,
    "idGroupAttribute": 2577,
    "groupAttributeRowId": 2
  }, {
    "idAttributeValue": 12113731,
    "codeAttributeDataType": "AC",
    "idAttributeValueSet": 156231,
    "idAttribute": 2583,
    "valueIdAttributeChoice": 8045,
    "idGroupAttribute": 2577,
    "groupAttributeRowId": 2
  }, {
    "idAttributeValue": 12113732,
    "codeAttributeDataType": "AC",
    "idAttributeValueSet": 156231,
    "idAttribute": 10263,
    "valueIdAttributeChoice": 17505,
    "idGroupAttribute": 2577,
    "groupAttributeRowId": 2
  }, {
    "idAttributeValue": 12113733,
    "codeAttributeDataType": "S",
    "idAttributeValueSet": 156231,
    "idAttribute": 2584,
    "valueString": "test",
    "idGroupAttribute": 2577,
    "groupAttributeRowId": 2
  }, {
    "idAttributeValue": 12113734,
    "codeAttributeDataType": "I",
    "idAttributeValueSet": 156231,
    "idAttribute": 10264,
    "valueInteger": 2,
    "idGroupAttribute": 2577,
    "groupAttributeRowId": 2
  }, {
    "idAttributeValue": 12113735,
    "codeAttributeDataType": "I",
    "idAttributeValueSet": 156231,
    "idAttribute": 10265,
    "valueInteger": 2,
    "idGroupAttribute": 2577,
    "groupAttributeRowId": 2
  }, {
    "idAttributeValue": 12113736,
    "codeAttributeDataType": "I",
    "idAttributeValueSet": 156231,
    "idAttribute": 10266,
    "valueInteger": 2,
    "idGroupAttribute": 2577,
    "groupAttributeRowId": 2
  }, {
    "idAttributeValue": 12113737,
    "codeAttributeDataType": "EB",
    "idAttributeValueSet": 156231,
    "idAttribute": 2590,
    "valueString": "U",
    "idGroupAttribute": 2577,
    "groupAttributeRowId": 2
  }, {
    "idAttributeValue": 12113738,
    "codeAttributeDataType": "AC",
    "idAttributeValueSet": 156231,
    "idAttribute": 2581,
    "valueIdAttributeChoice": 8038,
    "idGroupAttribute": 2577,
    "groupAttributeRowId": 2
  }, {
    "idAttributeValue": 12113739,
    "codeAttributeDataType": "B",
    "idAttributeValueSet": 156231,
    "idAttribute": 2589,
    "idGroupAttribute": 2577,
    "groupAttributeRowId": 2
  }, {
    "idAttributeValue": 12113740,
    "codeAttributeDataType": "S",
    "idAttributeValueSet": 156231,
    "idAttribute": 10267,
    "idGroupAttribute": 2577,
    "groupAttributeRowId": 2
  }, {
    "idAttributeValue": 12113741,
    "codeAttributeDataType": "EB",
    "idAttributeValueSet": 156231,
    "idAttribute": 10269,
    "valueString": "N",
    "idGroupAttribute": 2577,
    "groupAttributeRowId": 2
  }, {
    "idAttributeValue": 12113742,
    "codeAttributeDataType": "EB",
    "idAttributeValueSet": 156231,
    "idAttribute": 10270,
    "valueString": "U",
    "idGroupAttribute": 2577,
    "groupAttributeRowId": 2
  }, {
    "idAttributeValue": 12113743,
    "codeAttributeDataType": "EB",
    "idAttributeValueSet": 156231,
    "idAttribute": 19287,
    "valueString": "Y",
    "idGroupAttribute": 2577,
    "groupAttributeRowId": 2
  }, {
    "idAttributeValue": 12113744,
    "codeAttributeDataType": "EB",
    "idAttributeValueSet": 156231,
    "idAttribute": 10271,
    "idGroupAttribute": 2577,
    "groupAttributeRowId": 2
  }, {
    "idAttributeValue": 12113745,
    "codeAttributeDataType": "EB",
    "idAttributeValueSet": 156231,
    "idAttribute": 10272,
    "idGroupAttribute": 2577,
    "groupAttributeRowId": 2
  }, {
    "idAttributeValue": 12113746,
    "codeAttributeDataType": "EB",
    "idAttributeValueSet": 156231,
    "idAttribute": 10273,
    "idGroupAttribute": 2577,
    "groupAttributeRowId": 2
  }, {
    "idAttributeValue": 12113747,
    "codeAttributeDataType": "EB",
    "idAttributeValueSet": 156231,
    "idAttribute": 10274,
    "valueString": "N",
    "idGroupAttribute": 2577,
    "groupAttributeRowId": 2
  }, {
    "idAttributeValue": 12113748,
    "codeAttributeDataType": "S",
    "idAttributeValueSet": 156231,
    "idAttribute": 10275,
    "valueString": "test",
    "idGroupAttribute": 2577,
    "groupAttributeRowId": 2
  }, {
    "idAttributeValue": 12113749,
    "codeAttributeDataType": "S",
    "idAttributeValueSet": 156231,
    "idAttribute": 10276,
    "valueString": "test",
    "idGroupAttribute": 2577,
    "groupAttributeRowId": 2
  }, {
    "idAttributeValue": 12113750,
    "codeAttributeDataType": "AC",
    "idAttributeValueSet": 156231,
    "idAttribute": 2637,
    "idGroupAttribute": 2577,
    "groupAttributeRowId": 2
  }
  ]
}
