<?xml version="1.0" encoding="utf-8"?>
<svg version="1.1" id="Layer_1" xmlns="http://www.w3.org/2000/svg" xmlns:xlink="http://www.w3.org/1999/xlink" x="0px" y="0px"
	 viewBox="0 0 512 512" style="enable-background:new 0 0 512 512;" xml:space="preserve">
<path d="M362.1,128.9v244.2h51.7v-81l0,0h20.7c29.6,0,51-9.1,63.5-26.9c9.3-13.2,14-31.6,14-54.7c0-23.1-4.7-41.5-14-54.7
	c-8.6-12.3-21.4-20.4-38.2-24.3c-7.6-1.8-16.1-2.6-25.3-2.6H362.1z M463.1,210.5L463.1,210.5L463.1,210.5
	c0,19.2-10.7,30.7-28.6,30.7h-20.7v0v-61.4v0h20.7C452.4,179.8,463.1,191.3,463.1,210.5z M48.9,249.4v123.7H0V88.9L119.8,244
	l0-115.1h57.4v284.3L48.9,249.4z M226.3,128.9h56v189.6h63.3v54.6H226.3V128.9z"/>
</svg>
