<?xml version="1.0" encoding="utf-8"?>
<svg version="1.1" id="Layer_1" xmlns="http://www.w3.org/2000/svg" xmlns:xlink="http://www.w3.org/1999/xlink" x="0px" y="0px"
	 viewBox="0 0 512 512" style="enable-background:new 0 0 512 512;" xml:space="preserve">
<g>
	<path d="M123,186.2h-19.3L46.5,320.9h27.3l12.1-27.8h53.9l11.2,27.8h27.7L123,186.2z M93.9,272.3l19.3-47.4l18.6,47.4H93.9z
		 M386.2,189h-37.8v132h37.5c44.1,0,71.2-29.9,71.2-66.2C457.1,217.9,429.9,189,386.2,189z M419.8,284.7c-8.4,10-21.4,14-38.9,14
		h-6.8v-87.3h6.8c16.6,0,28.7,3.3,37.1,12.1c8,8.4,12.6,19.1,12.6,31.5C430.6,266.9,426.4,276.7,419.8,284.7z M318.1,189h-25.7v88.9
		L211.9,186h-17.7v134.9h25.7v-89.3l80.3,91.9h17.9V189z"/>
</g>
</svg>
