<svg version="1.1" id="Layer_1" xmlns="http://www.w3.org/2000/svg" xmlns:xlink="http://www.w3.org/1999/xlink" x="0px" y="0px"
	 viewBox="0 0 512 512" style="enable-background:new 0 0 512 512;" xml:space="preserve">
<path d="M164.61,224.13c1.9,5.95,2.85,12.44,2.76,19.39c-0.1,6.95-1.21,12.76-3.26,17.44c-2.04,4.67-5.01,8.2-8.8,10.59
	c-3.79,2.39-8.4,3.64-13.74,3.77c-5.32,0.12-11.37-0.87-18.05-2.99l-28.76-9.11l0.64-84.21l28.97,8.47
	c6.73,1.97,12.8,4.7,18.12,8.14c5.34,3.45,9.91,7.59,13.62,12.37C159.85,212.77,162.7,218.18,164.61,224.13z M512,81.8v317.49
	c0,13.49-8.46,25.54-21.16,30.11l-224.16,80.71c-3.5,1.26-7.17,1.89-10.84,1.89c-3.67,0-7.35-0.63-10.85-1.9L21.15,429.39
	c-0.12-0.04-0.23-0.1-0.34-0.14c-0.79-0.29-1.56-0.62-2.32-0.97c-0.31-0.14-0.61-0.3-0.91-0.45c-0.57-0.29-1.13-0.59-1.68-0.91
	c-0.32-0.18-0.64-0.37-0.94-0.56c-0.57-0.36-1.13-0.74-1.67-1.14c-0.25-0.18-0.5-0.35-0.74-0.53c-0.69-0.53-1.35-1.09-1.99-1.67
	c-0.28-0.26-0.55-0.53-0.83-0.8c-0.4-0.39-0.8-0.79-1.18-1.21c-0.27-0.29-0.53-0.58-0.78-0.88c-0.39-0.45-0.76-0.92-1.12-1.39
	c-0.2-0.26-0.41-0.52-0.6-0.78c-0.53-0.74-1.04-1.51-1.51-2.3c-0.07-0.11-0.12-0.23-0.18-0.34c-0.41-0.7-0.79-1.42-1.14-2.15
	c-0.12-0.26-0.24-0.52-0.35-0.78c-0.27-0.61-0.53-1.23-0.77-1.85c-0.11-0.29-0.22-0.57-0.32-0.87c-0.22-0.65-0.42-1.31-0.6-1.97
	c-0.07-0.26-0.15-0.51-0.22-0.77c-0.22-0.89-0.4-1.78-0.55-2.69c-0.05-0.31-0.07-0.62-0.11-0.93c-0.08-0.61-0.15-1.22-0.19-1.84
	c-0.03-0.43-0.04-0.87-0.05-1.31C0.03,399.86,0,399.58,0,399.29V81.8c0-0.12,0.02-0.23,0.02-0.35c0-0.18-0.01-0.35-0.01-0.52
	c0.03-0.94,0.09-1.88,0.2-2.8c0.01-0.1,0.03-0.2,0.05-0.29c0.13-1.02,0.31-2.02,0.53-3c0.06-0.29,0.14-0.57,0.21-0.86
	c0.23-0.89,0.48-1.76,0.78-2.62c0.07-0.19,0.12-0.39,0.19-0.58c0.38-1.04,0.82-2.05,1.3-3.04c0.09-0.19,0.2-0.37,0.29-0.55
	c0.42-0.81,0.87-1.59,1.35-2.36c0.15-0.24,0.3-0.49,0.46-0.73c1.22-1.83,2.62-3.53,4.19-5.08c0.2-0.2,0.41-0.4,0.62-0.59
	c0.7-0.65,1.43-1.28,2.19-1.87c0.1-0.08,0.19-0.17,0.29-0.25c0.03-0.03,0.07-0.04,0.11-0.07c0.89-0.67,1.83-1.29,2.79-1.87
	c0.21-0.12,0.41-0.23,0.62-0.35c0.78-0.45,1.59-0.86,2.41-1.24c0.25-0.12,0.5-0.23,0.75-0.34c1.01-0.44,2.05-0.84,3.11-1.17
	c0.05-0.02,0.1-0.03,0.15-0.04c0.8-0.24,1.61-0.47,2.44-0.65L248.89,0.76c4.57-1.01,9.32-1.02,13.89,0L486.4,50.44
	c0.05,0.01,0.09,0.02,0.14,0.03l0.4,0.09c0.48,0.11,0.94,0.25,1.41,0.38c0.72,0.19,1.43,0.41,2.12,0.65c0.59,0.2,1.18,0.4,1.75,0.64
	c0.39,0.16,0.77,0.35,1.15,0.53c0.51,0.23,1.02,0.47,1.51,0.73c0.36,0.19,0.71,0.4,1.06,0.6c0.5,0.29,0.99,0.58,1.47,0.9
	c0.32,0.21,0.64,0.42,0.95,0.65c0.5,0.35,0.98,0.71,1.45,1.09c0.28,0.22,0.56,0.44,0.83,0.66c0.51,0.43,0.99,0.88,1.47,1.34
	c0.21,0.21,0.44,0.4,0.65,0.61c0.66,0.67,1.3,1.37,1.9,2.09c0.04,0.05,0.08,0.11,0.13,0.16c0.56,0.69,1.09,1.4,1.6,2.13
	c0.21,0.3,0.39,0.62,0.59,0.93c0.31,0.49,0.62,0.98,0.9,1.49c0.21,0.37,0.4,0.75,0.6,1.13c0.24,0.47,0.47,0.95,0.69,1.43
	c0.18,0.4,0.36,0.81,0.52,1.23c0.2,0.5,0.38,1,0.55,1.51c0.14,0.41,0.29,0.82,0.41,1.23c0.18,0.6,0.33,1.22,0.47,1.84
	c0.08,0.33,0.17,0.65,0.24,0.99c0.19,0.94,0.33,1.9,0.44,2.87c0.03,0.31,0.04,0.62,0.07,0.93c0.04,0.55,0.1,1.09,0.11,1.64
	c0.01,0.16-0.01,0.32-0.01,0.48C511.98,81.54,512,81.67,512,81.8z M227.94,214.96c-4.59-15.21-11.6-29.15-20.95-41.54
	c-9.31-12.34-20.91-23.1-34.69-32c-13.68-8.84-29.48-15.81-47.25-20.66L31.11,95.09l-0.69,305.33l62.99,23.14l0.85-95.79l28.59,9.59
	c17.43,5.84,32.99,8.5,46.55,8.13c13.68-0.37,25.31-3.81,34.8-10.12c9.55-6.36,16.9-15.62,21.96-27.57
	c5.08-12.01,7.84-26.71,8.17-43.87C234.69,246.59,232.53,230.17,227.94,214.96z M348.57,85.38l-92.73-20.6l-92.53,20.58l92.64,25.96
	L348.57,85.38z M448,124l-160.09,44.84l0.08,265.57L448,376.8V124z"/>
</svg>
