<?xml version="1.0" encoding="utf-8"?>
<svg version="1.1" id="Layer_1" xmlns="http://www.w3.org/2000/svg" xmlns:xlink="http://www.w3.org/1999/xlink" x="0px" y="0px"
	 viewBox="0 0 512 512" style="enable-background:new 0 0 512 512;" xml:space="preserve">
<path d="M184.9,142.2c5.5,0,10.9-2,14.3-6.2l35.5-34.8v133.4c0,11.8,9.5,21.3,21.3,21.3s21.3-9.6,21.3-21.3V101.2L312,136
	c8.3,8.3,21.8,8.3,30.2,0c8.3-8.3,8.3-21.8,0-30.2l-71.1-71.1c-8.3-8.3-21.8-8.3-30.2,0l-71.1,71.1c-8.3,8.3-8.3,21.8,0,30.2
	C174,140.2,179.4,142.2,184.9,142.2z M512,71.1v284.4c0,23.6-19.1,42.7-42.7,42.7H298.7l14.2,42.7h64c11.8,0,21.3,9.6,21.3,21.3
	s-9.6,21.3-21.3,21.3H135.1c-11.7,0-21.3-9.6-21.3-21.3c0-11.7,9.6-21.3,21.3-21.3h64l14.2-42.7H42.7C19.1,398.2,0,379.1,0,355.6
	V71.1c0-23.6,19.1-42.7,42.7-42.7h154.2l-52.2,52.2c-1.5,1.5-2.9,3.1-4.2,4.7H56.9v199.1h398.2V85.3h-83.6c-1.3-1.6-2.7-3.2-4.2-4.7
	l-52.2-52.2h154.2C492.9,28.4,512,47.6,512,71.1z"/>
</svg>
