<svg version="1.1" id="Layer_1" xmlns="http://www.w3.org/2000/svg" xmlns:xlink="http://www.w3.org/1999/xlink" x="0px" y="0px"
	 viewBox="0 0 512 512" style="enable-background:new 0 0 512 512;" xml:space="preserve">
<path d="M337.3,272.2c11.1,0,20,8.9,20,20c0,11.1-8.9,20-20,20h-152c-11.1,0-20-8.9-20-20c0-11.1,8.9-20,20-20H337.3z M483,123.6
	c17-4.6,27.2-22.1,22.6-39.2l-16.3-60.7c-4.6-17-22.1-27.2-39.2-22.6L29,113.9c-17,4.6-27.2,22.1-22.6,39.2l16.3,60.7
	c2.4,8.8,8.2,15.8,15.6,19.8V432c0,44.1,35.9,80,80,80h286c44.1,0,80-35.9,80-80V229.7l-406,2.4L483,123.6z"/>
</svg>
