<?xml version="1.0" encoding="utf-8"?>
<svg version="1.1" id="Layer_1" xmlns="http://www.w3.org/2000/svg" xmlns:xlink="http://www.w3.org/1999/xlink" x="0px" y="0px"
	 viewBox="0 0 512 512" style="enable-background:new 0 0 512 512;" xml:space="preserve">
<path d="M288,136V0H88C74.7,0,64,10.7,64,24v464c0,13.3,10.7,24,24,24h336c13.3,0,24-10.7,24-24V160H312
	C298.8,160,288,149.2,288,136z M409.1,311.5c1.2,2.4,1.9,5.1,1.9,7.9c0,2.8-0.7,5.5-1.9,7.8c-29.2,56.9-87,95.5-153.1,95.5
	s-123.9-38.5-153.1-95.5c-1.2-2.4-1.9-5.1-1.9-7.9c0-2.8,0.7-5.5,1.9-7.8c29.2-56.9,87-95.5,153.1-95.5S379.9,254.6,409.1,311.5z
	 M448,121.9v6.1H320V0h6.1c6.4,0,12.5,2.5,17,7l97.9,98C445.5,109.5,448,115.6,448,121.9z M178.5,319.4c0,42.8,34.7,77.5,77.5,77.5
	c0,0,0,0,0,0c42.8,0,77.5-34.7,77.5-77.5v0c0-42.8-34.7-77.5-77.5-77.5S178.5,276.6,178.5,319.4z M307.7,319.3
	c0,28.5-23.1,51.6-51.6,51.6s-51.6-23.1-51.6-51.6c0-4.7,0.6-9.2,1.8-13.5c4.3,3.1,9.6,5,15.3,5c14.2,0,25.8-11.5,25.8-25.8
	c0-5.7-1.9-11-5-15.2c4.3-1.3,8.9-2,13.6-2c0,0,0.1,0,0.1,0C284.6,267.7,307.7,290.8,307.7,319.3z"/>
</svg>
