[
  {
    "id": 1,
    "mdgName": "Melanoma",
    "openCount": 33,
    "closeCount": 13,
    "pendingCount": 12
  },
  {
    "id": 2,
    "mdgName": "Breast",
    "openCount": 22,
    "closeCount": 45,
    "pendingCount": 7
  },
  {
    "id": 3,
    "mdgName": "Prostate",
    "openCount": 12,
    "closeCount": 32,
    "pendingCount": 27
  }
]
