<?xml version="1.0" encoding="utf-8"?>
<svg version="1.1" id="Layer_1" xmlns="http://www.w3.org/2000/svg" xmlns:xlink="http://www.w3.org/1999/xlink" x="0px" y="0px"
	 viewBox="0 0 512 512" style="enable-background:new 0 0 512 512;" xml:space="preserve">
<path d="M457.1,0H54.9C24.6,0,0,24.6,0,54.9v402.3C0,487.4,24.6,512,54.9,512h402.3c30.3,0,54.9-24.6,54.9-54.9V54.9
	C512,24.6,487.4,0,457.1,0z M389.5,474.7H122.8c-36.8,0-66.7-29.9-66.7-66.7c0-36.8,29.9-66.7,66.7-66.7h266.7
	c36.8,0,66.7,29.9,66.7,66.7C456.1,444.8,426.3,474.7,389.5,474.7z M389.5,322.7H122.8c-36.8,0-66.7-29.9-66.7-66.7
	c0-36.8,29.9-66.7,66.7-66.7h266.7c36.8,0,66.7,29.9,66.7,66.7C456.1,292.8,426.3,322.7,389.5,322.7z M389.5,170.7H122.8
	c-36.8,0-66.7-29.9-66.7-66.7c0-36.8,29.9-66.7,66.7-66.7h266.7c36.8,0,66.7,29.9,66.7,66.7C456.1,140.8,426.3,170.7,389.5,170.7z
	 M126.8,358c-27.6,0-50,22.3-50,50c0,27.6,22.3,50,50,50c27.6,0,50-22.3,50-50C176.8,380.4,154.5,358,126.8,358z M126,450.2
	c-6.5,0-11.8-5.3-11.8-11.8c0-6.5,5.3-11.8,11.8-11.8c6.5,0,11.8,5.3,11.8,11.8C137.8,444.9,132.5,450.2,126,450.2z M135.6,414.5
	v0.9c0,2.1-1.7,3.7-3.7,3.7h-11.3c-2.1,0-3.7-1.7-3.7-3.7v-1.5c0-9.6,7.3-13.5,12.8-16.6c4.7-2.7,7.6-4.5,7.6-8
	c0-4.6-5.9-7.7-10.7-7.7c-6.1,0-9,2.8-12.9,7.7c-1.3,1.6-3.6,1.9-5.2,0.6l-6.7-5.1c-1.6-1.2-2-3.5-0.8-5.1
	c6.3-9.1,14.4-14.2,26.8-14.2c13.2,0,27.4,10.3,27.4,23.9C155.1,407.5,135.6,407.8,135.6,414.5z M126.8,206c-27.7,0-50,22.4-50,50
	c0,27.7,22.4,50,50,50c27.7,0,50-22.4,50-50C176.8,228.3,154.4,206,126.8,206z M157.6,274.5c2.3,2.3,2.3,5.9,0,8.2l-4.1,4.1
	c-2.3,2.3-5.9,2.3-8.2,0l-18.5-18.5l-18.5,18.5c-2.3,2.3-5.9,2.3-8.2,0l-4.1-4.1c-2.3-2.3-2.3-5.9,0-8.2l18.5-18.5L96,237.5
	c-2.3-2.3-2.3-5.9,0-8.2l4.1-4.1c2.3-2.3,5.9-2.3,8.2,0l18.5,18.5l18.5-18.5c2.3-2.3,5.9-2.3,8.2,0l4.1,4.1c2.3,2.3,2.3,5.9,0,8.2
	L139.1,256L157.6,274.5z M385.5,54c-27.6,0-50,22.3-50,50c0,27.6,22.3,50,50,50c27.6,0,50-22.3,50-50C435.5,76.4,413.1,54,385.5,54z
	 M423.9,89.9l-46.7,46.7c-1.6,1.6-4.2,1.6-5.7,0l-26.4-26.4c-1.6-1.6-1.6-4.2,0-5.7l5.7-5.7c1.6-1.6,4.2-1.6,5.7,0l17.8,17.8
	l38.1-38.1c1.6-1.6,4.2-1.6,5.7,0l5.7,5.7C425.5,85.8,425.5,88.3,423.9,89.9z"/>
</svg>
