[{
  "idAttributeContainer": 71,
  "idAttributeConfiguration": 88,
  "containerName": "Transplant",
  "isAutoLayout": "Y",
  "sortOrder": 1
}, {
  "idAttributeContainer": 72,
  "idAttributeConfiguration": 88,
  "containerName": "Protocols",
  "isAutoLayout": "Y",
  "sortOrder": 2
}, {
  "idAttributeContainer": 73,
  "idAttributeConfiguration": 88,
  "containerName": "GVHD",
  "isAutoLayout": "Y",
  "sortOrder": 4
}, {
  "idAttributeContainer": 74,
  "idAttributeConfiguration": 88,
  "containerName": "Addendum",
  "isAutoLayout": "N",
  "sortOrder": 5
}, {
  "idAttributeContainer": 75,
  "idAttributeConfiguration": 88,
  "containerName": "Engraft",
  "isAutoLayout": "N",
  "sortOrder": 4
}, {
  "idAttributeContainer": 77,
  "idAttributeConfiguration": 88,
  "containerName": "Visits",
  "isAutoLayout": "N",
  "sortOrder": 3
}, {
  "idAttributeContainer": 519,
  "idAttributeConfiguration": 88,
  "containerName": "Recovery: Transplant & Engraft",
  "isAutoLayout": "N",
  "sortOrder": 6
}
]
