[
  {
    "idDashboard": 1,
    "idUserProfile": 1,
    "widgetInstances": [
      {
        "idWidgetInstance": 1,
        "widget": {
          "idWidget": 1
        },
        "sortOrder": 1,
        "attributeValueSet": {
          "idWidgetAttributeValueSet": 10,
          "attributeValues": [
            {
              "idWidgetAttributeValue": 1000,
              "idWidgetAttributeValueSet": 1,
              "idWidgetAttribute": 11,
              "valueString": "BarChartWidget",
              "valueDate": null,
              "valueInteger": null,
              "valueNumeric": null
            },
            {
              "idWidgetAttributeValue": 1001,
              "idWidgetInstance": 1,
              "idWidgetAttribute": 12,
              "valueString": "Breast",
              "valueDate": null,
              "valueInteger": null,
              "valueNumeric": null
            }
          ]
        }
      },
      {
        "idWidgetInstance": 3,
        "widget": {
          "idWidget": 2
        },
        "sortOrder": 2,
        "attributeValueSet": {
          "idWidgetAttributeValueSet": 30,
          "attributeValues": []
        }
      },
      {
        "idWidgetInstance": 2,
        "widget": {
          "idWidget": 1
        },
        "sortOrder": 3,
        "attributeValueSet": {
          "idWidgetAttributeValueSet": 20,
          "attributeValues": [
            {
              "idWidgetAttributeValue": 2000,
              "idWidgetAttributeValueSet": 2,
              "idWidgetAttribute": 11,
              "valueString": "BarChartWidget",
              "valueDate": null,
              "valueInteger": null,
              "valueNumeric": null
            },
            {
              "idWidgetAttributeValue": 2001,
              "idWidgetAttributeValueSet": 2,
              "idWidgetAttribute": 12,
              "valueString": "Melanoma",
              "valueDate": null,
              "valueInteger": null,
              "valueNumeric": null
            },
            {
              "idWidgetAttributeValue": 2002,
              "idWidgetAttributeValueSet": 2,
              "idWidgetAttribute": 12,
              "valueString": "Prostate",
              "valueDate": null,
              "valueInteger": null,
              "valueNumeric": null
            }
          ]
        }
      },
      {
        "idWidgetInstance": 4,
        "widget": {
          "idWidget": 4
        },
        "sortOrder": 5,
        "attributeValueSet": {
          "idWidgetAttributeValueSet": 40,
          "attributeValues": [
            {
              "idWidgetAttributeValue": 4000,
              "idWidgetAttributeValueSet": 4,
              "idWidgetAttribute": 1,
              "valueString": "half",
              "valueDate": null,
              "valueInteger": null,
              "valueNumeric": null
            }
          ]
        }
      },
      {
        "idWidgetInstance": 5,
        "widget": {
          "idWidget": 5
        },
        "sortOrder": 4,
        "attributeValueSet": {
          "idWidgetAttributeValueSet": 50,
          "attributeValues": [
            {
              "idWidgetAttributeValue": 5000,
              "idWidgetAttributeValueSet": 5,
              "idWidgetAttribute": 1,
              "valueString": "half",
              "valueDate": null,
              "valueInteger": null,
              "valueNumeric": null
            }
          ]
        }
      },
      {
        "idWidgetInstance": 6,
        "widget": {
          "idWidget": 6
        },
        "sortOrder": 6,
        "attributeValueSet": {
          "attributeValues": []
        }
      },
      {
        "idWidgetInstance": 7,
        "widget": {
          "idWidget": 7
        },
        "sortOrder": 7,
        "attributeValueSet": {
          "idWidgetAttributeValueSet": 70,
          "attributeValues": [
            {
              "idWidgetAttributeValue": 7000,
              "idWidgetAttributeValueSet": 7,
              "idWidgetAttribute": 1,
              "valueString": "two-third",
              "valueDate": null,
              "valueInteger": null,
              "valueNumeric": null
            }
          ]
        }
      }
    ]
  }
]
