<?xml version="1.0" encoding="utf-8"?>
<!-- Generator: Adobe Illustrator 22.0.1, SVG Export Plug-In . SVG Version: 6.00 Build 0)  -->
<svg version="1.1" id="Layer_1" xmlns="http://www.w3.org/2000/svg" xmlns:xlink="http://www.w3.org/1999/xlink" x="0px" y="0px"
	 viewBox="0 0 512 304" style="enable-background:new 0 0 512 304;" xml:space="preserve">
<path d="M256,96.7l126.6,128.4H129.4L256,96.7 M256,4.6c-9.2,0-17.2,3.5-24.1,10.5L10,240.1c-10.4,10.5-12.7,23-6.9,37.5
	c5.7,14.5,16.1,21.8,31,21.8H478c14.9,0,25.2-7.3,31-21.8c5.7-14.5,3.4-27-6.9-37.5l-222-225.1C273.2,8.1,265.2,4.6,256,4.6L256,4.6
	z"/>
</svg>
