<svg version="1.1" id="Layer_1" xmlns="http://www.w3.org/2000/svg" xmlns:xlink="http://www.w3.org/1999/xlink" x="0px" y="0px"
	 viewBox="0 0 512 512" style="enable-background:new 0 0 512 512;" xml:space="preserve">
<path d="M134.5,164.75v182.5c0,3.71-3.04,6.75-6.75,6.75h-27c-3.71,0-6.75-3.04-6.75-6.75v-182.5c0-3.71,3.04-6.75,6.75-6.75h27
	C131.46,158,134.5,161.04,134.5,164.75z M316.75,158h-27c-3.71,0-6.75,3.04-6.75,6.75v182.5c0,3.71,3.04,6.75,6.75,6.75h27
	c3.71,0,6.75-3.04,6.75-6.75v-182.5C323.5,161.04,320.46,158,316.75,158z M222.25,158h-27c-3.71,0-6.75,3.04-6.75,6.75v182.5
	c0,3.71,3.04,6.75,6.75,6.75h27c3.71,0,6.75-3.04,6.75-6.75v-182.5C229,161.04,225.96,158,222.25,158z M411.25,158h-27
	c-3.71,0-6.75,3.04-6.75,6.75v182.5c0,3.71,3.04,6.75,6.75,6.75h27c3.71,0,6.75-3.04,6.75-6.75v-182.5
	C418,161.04,414.96,158,411.25,158z M512,77v27c0,7.42-6.08,13.5-13.5,13.5v277c7.42,0,13.5,6.08,13.5,13.5v27
	c0,7.46-6.04,13.5-13.5,13.5H458c-7.46,0-13.5-6.04-13.5-13.5h-377c0,7.46-6.04,13.5-13.5,13.5H13.5C6.04,448.5,0,442.46,0,435v-27
	c0-7.42,6.08-13.5,13.5-13.5v-277C6.08,117.5,0,111.42,0,104V77c0-7.46,6.04-13.5,13.5-13.5H54c7.46,0,13.5,6.04,13.5,13.5h377
	c0-7.46,6.04-13.5,13.5-13.5h40.5C505.96,63.5,512,69.54,512,77z M458,394.5v-277H54v277H458z"/>
</svg>
