{
  "reportList" : [ {
    "name" : "Active Funded Grant By",
    "title" : "Active Funded Grants By",
    "description" : "Active Grant Projects by Investigator or Sponsor",
    "className" : "hci.artadmin.controller.reports.ReportGrantActiveBy",
    "fileName" : "activeGrantBy",
    "type" : "patient",
    "tab" : "grant",
    "owners" : [ ],
    "params" : [ {
      "caption" : "Active Date",
      "name" : "activityDate",
      "type" : "date",
      "displayOrder" : 1,
      "options" : [ ]
    }, {
      "caption" : "Type",
      "name" : "memInvChoice",
      "type" : "select",
      "tooltip" : "Defaults to 'Any'",
      "displayOrder" : 2,
      "options" : [ {
        "value" : "Member",
        "display" : "CCSG Member",
        "displayOrder" : 1
      }, {
        "value" : "Investigator",
        "display" : "Investigator",
        "displayOrder" : 2
      }, {
        "value" : "Any",
        "display" : "Any",
        "displayOrder" : 3
      } ]
    }, {
      "caption" : "Include $0 Grants",
      "name" : "zeroChoice",
      "type" : "radio",
      "displayOrder" : 3,
      "options" : [ {
        "value" : "include",
        "display" : "Include",
        "displayOrder" : 1
      }, {
        "value" : "exclude",
        "display" : "Exclude",
        "displayOrder" : 2
      } ]
    }, {
      "caption" : "Sort By",
      "name" : "sortChoice",
      "type" : "select",
      "tooltip" : "Defaults to 'PI'",
      "displayOrder" : 4,
      "options" : [ {
        "value" : "pi",
        "display" : "PI",
        "displayOrder" : 1
      }, {
        "value" : "sponsor",
        "display" : "Sponsor",
        "displayOrder" : 2
      } ]
    }, {
      "caption" : "Featured PI",
      "name" : "featureChoice",
      "type" : "select",
      "tooltip" : "Leave blank for 'Any'",
      "displayOrder" : 5,
      "options" : [ {
        "value" : "featured",
        "display" : "Featured",
        "displayOrder" : 1
      }, {
        "value" : "nonFeatured",
        "display" : "Non-Featured",
        "displayOrder" : 2
      }, {
        "value" : "any",
        "display" : "Any",
        "displayOrder" : 3
      } ]
    } ],
    "formats" : [ {
      "name" : "xls",
      "caption" : "XLS",
      "displayOrder" : 1
    }, {
      "name" : "doc",
      "caption" : "DOC",
      "displayOrder" : 2
    }, {
      "name" : "html",
      "caption" : "HTML",
      "displayOrder" : 3
    }, {
      "name" : "pdf",
      "caption" : "PDF",
      "displayOrder" : 4
    }, {
      "name" : "csv",
      "caption" : "CSV",
      "displayOrder" : 5
    } ],
    "datakey" : "Active Funded Grant By"
  }, {
    "name" : "CollaborativeGrants",
    "title" : "Collaborative Grants",
    "description" : "Shows the Collaborative status for both Programs and DOTs",
    "className" : "hci.artadmin.controller.reports.ReportCollaborativeGrants",
    "fileName" : "collabGrants",
    "type" : "global",
    "tab" : "grant",
    "owners" : [ ],
    "params" : [ {
      "caption" : "Active Date",
      "name" : "activityDate",
      "type" : "date",
      "displayOrder" : 1,
      "options" : [ ]
    }, {
      "caption" : "Programs",
      "name" : "programChoice",
      "type" : "multiselect",
      "className" : "hci.artadmin.model.dict.Program",
      "dataXPath" : "@programCode",
      "valueXPath" : "@idProgram",
      "displayXPath" : "@programName",
      "displayOrder" : 2,
      "options" : [ ]
    }, {
      "caption" : "Featured PI",
      "name" : "featureChoice",
      "type" : "select",
      "tooltip" : "Leave blank for 'Any'",
      "displayOrder" : 3,
      "options" : [ {
        "value" : "featured",
        "display" : "Featured",
        "displayOrder" : 1
      }, {
        "value" : "nonFeatured",
        "display" : "Non-Featured",
        "displayOrder" : 2
      }, {
        "value" : "any",
        "display" : "Any",
        "displayOrder" : 3
      } ]
    }, {
      "caption" : "Training Grants",
      "name" : "trainingChoice",
      "type" : "radio",
      "displayOrder" : 4,
      "options" : [ {
        "value" : "include",
        "display" : "Include",
        "displayOrder" : 1
      }, {
        "value" : "exclude",
        "display" : "Exclude",
        "displayOrder" : 2
      } ]
    }, {
      "caption" : "ZY Funding",
      "name" : "zyChoice",
      "type" : "radio",
      "displayOrder" : 5,
      "options" : [ {
        "value" : "allFunding",
        "display" : "All Funding",
        "displayOrder" : 1
      }, {
        "value" : "excludeZY",
        "display" : "Exclude ZY",
        "displayOrder" : 2
      } ]
    } ],
    "formats" : [ {
      "name" : "xls",
      "caption" : "XLS",
      "displayOrder" : 1
    }, {
      "name" : "html",
      "caption" : "HTML",
      "displayOrder" : 3
    } ],
    "datakey" : "CollaborativeGrants"
  }, {
    "name" : "DataTable1B1C",
    "title" : "eData Table 1B and 1C",
    "description" : "Returns the data needed for CCSG DataTables 1B and 1C eData",
    "className" : "hci.artadmin.controller.reports.ReportDataTable1B1C",
    "fileName" : "dataTable1B1C",
    "type" : "global",
    "tab" : "researcher",
    "owners" : [ ],
    "params" : [ {
      "caption" : "Active Date",
      "name" : "activityDate",
      "type" : "date",
      "displayOrder" : 1,
      "options" : [ ]
    }, {
      "caption" : "Featured",
      "name" : "featureChoice",
      "type" : "select",
      "tooltip" : "Leave blank for 'Any'",
      "displayOrder" : 2,
      "options" : [ {
        "value" : "featured",
        "display" : "Featured",
        "displayOrder" : 1
      }, {
        "value" : "nonFeatured",
        "display" : "Non-Featured",
        "displayOrder" : 2
      }, {
        "value" : "any",
        "display" : "Any",
        "displayOrder" : 3
      } ]
    } ],
    "formats" : [ {
      "name" : "xls",
      "caption" : "XLS",
      "displayOrder" : 1
    }, {
      "name" : "html",
      "caption" : "HTML",
      "displayOrder" : 3
    } ],
    "datakey" : "DataTable1B1C"
  }, {
    "name" : "DataTable2A",
    "title" : "Data Table 2A",
    "description" : "Returns the data needed for CCSG Data Table 2A",
    "className" : "hci.artadmin.controller.reports.ReportDataTable2AAlgorithm",
    "fileName" : "dataTable2A",
    "type" : "global",
    "tab" : "researcher",
    "owners" : [ ],
    "params" : [ {
      "caption" : "Active Date",
      "name" : "activityDate",
      "type" : "date",
      "displayOrder" : 1,
      "options" : [ ]
    }, {
      "caption" : "Programs",
      "name" : "programChoice",
      "type" : "multiselect",
      "className" : "hci.artadmin.model.dict.Program",
      "dataXPath" : "@programCode",
      "valueXPath" : "@idProgram",
      "displayXPath" : "@programName",
      "displayOrder" : 2,
      "options" : [ ]
    }, {
      "caption" : "Featured",
      "name" : "featureChoice",
      "type" : "select",
      "tooltip" : "Leave blank for 'Any'",
      "displayOrder" : 3,
      "options" : [ {
        "value" : "featured",
        "display" : "Featured",
        "displayOrder" : 1
      }, {
        "value" : "nonFeatured",
        "display" : "Non-Featured",
        "displayOrder" : 2
      }, {
        "value" : "any",
        "display" : "Any",
        "displayOrder" : 3
      } ]
    }, {
      "caption" : "Type",
      "name" : "displayChoice",
      "type" : "radio",
      "displayOrder" : 4,
      "options" : [ {
        "value" : "sort",
        "display" : "Sort-able",
        "displayOrder" : 1
      }, {
        "value" : "submit",
        "display" : "Submit-able",
        "displayOrder" : 2
      } ]
    }, {
      "caption" : "ZY Funding Only",
      "name" : "zyChoice",
      "type" : "radio",
      "displayOrder" : 5,
      "options" : [ {
        "value" : "allFunding",
        "display" : "All Funding",
        "displayOrder" : 1
      }, {
        "value" : "runZYonly",
        "display" : "ZY Only",
        "displayOrder" : 2
      } ]
    }, {
      "caption" : "Display",
      "name" : "edataChoice",
      "type" : "radio",
      "displayOrder" : 6,
      "options" : [ {
        "value" : "printReport",
        "display" : "Print version",
        "displayOrder" : 1
      }, {
        "value" : "eDataReport",
        "display" : "eData version",
        "displayOrder" : 2
      } ]
    }, {
      "caption" : "Version",
      "name" : "subcontractChoice",
      "type" : "radio",
      "displayOrder" : 7,
      "options" : [ {
        "value" : "regular",
        "display" : "Regular version",
        "displayOrder" : 1
      }, {
        "value" : "subcontract",
        "display" : "Subcontract version",
        "displayOrder" : 2
      } ]
    } ],
    "formats" : [ {
      "name" : "xls",
      "caption" : "XLS",
      "displayOrder" : 1
    }, {
      "name" : "html",
      "caption" : "HTML",
      "displayOrder" : 3
    } ],
    "datakey" : "DataTable2A"
  }, {
    "name" : "DataTable2Av2",
    "title" : "Data Table 2A v2",
    "description" : "Returns the data needed for CCSG Data Table 2A (Version 2)",
    "className" : "hci.artadmin.controller.reports.ReportDataTable2AAlgorithmV2",
    "fileName" : "dataTable2Av2",
    "type" : "global",
    "tab" : "researcher",
    "owners" : [ ],
    "params" : [ {
      "caption" : "Active Date",
      "name" : "activityDate",
      "type" : "date",
      "displayOrder" : 1,
      "options" : [ ]
    }, {
      "caption" : "Programs",
      "name" : "programChoice",
      "type" : "multiselect",
      "className" : "hci.artadmin.model.dict.Program",
      "dataXPath" : "@programCode",
      "valueXPath" : "@idProgram",
      "displayXPath" : "@programName",
      "displayOrder" : 2,
      "options" : [ ]
    }, {
      "caption" : "Featured",
      "name" : "featureChoice",
      "type" : "select",
      "tooltip" : "Leave blank for 'Any'",
      "displayOrder" : 3,
      "options" : [ {
        "value" : "featured",
        "display" : "Featured",
        "displayOrder" : 1
      }, {
        "value" : "nonFeatured",
        "display" : "Non-Featured",
        "displayOrder" : 2
      }, {
        "value" : "any",
        "display" : "Any",
        "displayOrder" : 3
      } ]
    }, {
      "caption" : "Type",
      "name" : "displayChoice",
      "type" : "radio",
      "displayOrder" : 4,
      "options" : [ {
        "value" : "sort",
        "display" : "Sort-able",
        "displayOrder" : 1
      }, {
        "value" : "submit",
        "display" : "Submit-able",
        "displayOrder" : 2
      } ]
    }, {
      "caption" : "ZY Funding",
      "name" : "zyChoice",
      "type" : "radio",
      "displayOrder" : 5,
      "options" : [ {
        "value" : "allFunding",
        "display" : "All Funding",
        "displayOrder" : 1
      }, {
        "value" : "excludeZY",
        "display" : "Exclude ZY",
        "displayOrder" : 2
      }, {
        "value" : "runZYonly",
        "display" : "ZY Only",
        "displayOrder" : 3
      } ]
    }, {
      "caption" : "Display",
      "name" : "edataChoice",
      "type" : "radio",
      "displayOrder" : 6,
      "options" : [ {
        "value" : "printReport",
        "display" : "Print version",
        "displayOrder" : 1
      }, {
        "value" : "eDataReport",
        "display" : "eData version",
        "displayOrder" : 2
      } ]
    }, {
      "caption" : "Columns",
      "name" : "columnChoice",
      "type" : "radio",
      "displayOrder" : 7,
      "options" : [ {
        "value" : "extra",
        "display" : "Internal Version",
        "displayOrder" : 1
      }, {
        "value" : "regular",
        "display" : "NCI Version",
        "displayOrder" : 2
      } ]
    }, {
      "caption" : "Zero % Cancer Related",
      "name" : "zeroCFChoice",
      "type" : "radio",
      "displayOrder" : 8,
      "options" : [ {
        "value" : "includeCF",
        "display" : "Include 0% or $0",
        "displayOrder" : 1
      }, {
        "value" : "excludeCF",
        "display" : "No 0% or $0 Cancer Related",
        "displayOrder" : 2
      } ]
    }, {
      "caption" : "Training Grants",
      "name" : "trainingChoice",
      "type" : "radio",
      "displayOrder" : 9,
      "options" : [ {
        "value" : "regular",
        "display" : "Regular report",
        "displayOrder" : 1
      }, {
        "value" : "training",
        "display" : "Training Grants only",
        "displayOrder" : 2
      } ]
    } ],
    "formats" : [ {
      "name" : "xls",
      "caption" : "XLS",
      "displayOrder" : 1
    }, {
      "name" : "html",
      "caption" : "HTML",
      "displayOrder" : 3
    } ],
    "datakey" : "DataTable2Av2"
  }, {
    "name" : "DataTable2B",
    "title" : "Data Table 2B",
    "description" : "Returns the data needed for CCSG Data Table 2B",
    "className" : "hci.artadmin.controller.reports.ReportDataTable2B",
    "fileName" : "dataTable2B",
    "type" : "global",
    "tab" : "researcher",
    "owners" : [ ],
    "params" : [ {
      "caption" : "Year",
      "name" : "year",
      "type" : "integer",
      "displayOrder" : 1,
      "options" : [ ]
    }, {
      "caption" : "Programs",
      "name" : "programChoice",
      "type" : "multiselect",
      "className" : "hci.artadmin.model.dict.Program",
      "dataXPath" : "@programCode",
      "valueXPath" : "@idProgram",
      "displayXPath" : "@programName",
      "displayOrder" : 2,
      "options" : [ ]
    }, {
      "caption" : "Featured",
      "name" : "featureChoice",
      "type" : "select",
      "tooltip" : "Leave blank for 'Any'",
      "displayOrder" : 3,
      "options" : [ {
        "value" : "featured",
        "display" : "Featured",
        "displayOrder" : 1
      }, {
        "value" : "nonFeatured",
        "display" : "Non-Featured",
        "displayOrder" : 2
      }, {
        "value" : "any",
        "display" : "Any",
        "displayOrder" : 3
      } ]
    }, {
      "caption" : "Training Grants",
      "name" : "trainingChoice",
      "type" : "radio",
      "displayOrder" : 4,
      "options" : [ {
        "value" : "exclude",
        "display" : "Exclude",
        "displayOrder" : 1
      }, {
        "value" : "include",
        "display" : "Include",
        "displayOrder" : 2
      } ]
    }, {
      "caption" : "ZY Funding",
      "name" : "zyChoice",
      "type" : "radio",
      "displayOrder" : 5,
      "options" : [ {
        "value" : "exclude",
        "display" : "Exclude",
        "displayOrder" : 1
      }, {
        "value" : "include",
        "display" : "Include",
        "displayOrder" : 2
      } ]
    }, {
      "caption" : "Version",
      "name" : "edataChoice",
      "type" : "radio",
      "displayOrder" : 6,
      "options" : [ {
        "value" : "printReport",
        "display" : "Print version",
        "displayOrder" : 1
      }, {
        "value" : "eDataReport",
        "display" : "eData version",
        "displayOrder" : 2
      } ]
    } ],
    "formats" : [ {
      "name" : "xls",
      "caption" : "XLS",
      "displayOrder" : 1
    }, {
      "name" : "html",
      "caption" : "HTML",
      "displayOrder" : 3
    } ],
    "datakey" : "DataTable2B"
  }, {
    "name" : "DuplicatePublications",
    "title" : "Duplicate Publications",
    "description" : "Finds all those Publications that have duplicates with the same Reference",
    "help" : "Simply compares publications with the same Reference. It is looking     for exact matching in the reference. No other filters are applied.",
    "className" : "hci.artadmin.controller.reports.ReportGeneric_EXAMPLE",
    "fileName" : "DuplicatePublications",
    "type" : "patient",
    "tab" : "publication",
    "owners" : [ ],
    "params" : [ ],
    "formats" : [ {
      "name" : "xls",
      "caption" : "XLS",
      "displayOrder" : 1
    }, {
      "name" : "html",
      "caption" : "HTML",
      "displayOrder" : 2
    }, {
      "name" : "doc",
      "caption" : "DOC",
      "displayOrder" : 3
    }, {
      "name" : "pdf",
      "caption" : "PDF",
      "displayOrder" : 4
    }, {
      "name" : "csv",
      "caption" : "CSV",
      "displayOrder" : 5
    } ],
    "datakey" : "DuplicatePublications"
  }, {
    "name" : "FBSMemberInfoReport",
    "title" : "FBS Member Information",
    "description" : "All currently active CCSG members (on given date)",
    "className" : "hci.artadmin.controller.reports.ReportFSBMemberInfo",
    "fileName" : "fbsMemberInfoReport",
    "type" : "global",
    "tab" : "researcher",
    "owners" : [ ],
    "params" : [ {
      "caption" : "As of Date",
      "name" : "asOfDate",
      "type" : "date",
      "displayOrder" : 1,
      "options" : [ ]
    } ],
    "formats" : [ {
      "name" : "xls",
      "caption" : "XLS",
      "displayOrder" : 1
    }, {
      "name" : "doc",
      "caption" : "DOC",
      "displayOrder" : 2
    }, {
      "name" : "html",
      "caption" : "HTML",
      "displayOrder" : 3
    }, {
      "name" : "pdf",
      "caption" : "PDF",
      "displayOrder" : 4
    }, {
      "name" : "csv",
      "caption" : "CSV",
      "displayOrder" : 5
    } ],
    "datakey" : "FBSMemberInfoReport"
  }, {
    "name" : "GrantActiveDuringRange",
    "title" : "Active During Range",
    "description" : "The Grants that are active any time in the given range",
    "className" : "hci.artadmin.controller.reports.ReportGrantActiveDuringRange",
    "fileName" : "grantActiveDuringRange",
    "type" : "patient",
    "tab" : "grant",
    "owners" : [ ],
    "params" : [ {
      "caption" : "Range Start Date",
      "name" : "startDate",
      "type" : "date",
      "displayOrder" : 1,
      "options" : [ ]
    }, {
      "caption" : "Range End Date",
      "name" : "endDate",
      "type" : "date",
      "displayOrder" : 2,
      "options" : [ ]
    } ],
    "formats" : [ {
      "name" : "xls",
      "caption" : "XLS",
      "displayOrder" : 1
    }, {
      "name" : "html",
      "caption" : "HTML",
      "displayOrder" : 2
    }, {
      "name" : "doc",
      "caption" : "DOC",
      "displayOrder" : 3
    }, {
      "name" : "pdf",
      "caption" : "PDF",
      "displayOrder" : 4
    }, {
      "name" : "csv",
      "caption" : "CSV",
      "displayOrder" : 5
    } ],
    "datakey" : "GrantActiveDuringRange"
  }, {
    "name" : "GrantActiveOnDate",
    "title" : "Grant Active On Date",
    "description" : "A simple dump of the Grants data for those active on the given date",
    "className" : "hci.artadmin.controller.reports.ReportGrantActiveOnDate",
    "fileName" : "grantActiveOnDate",
    "type" : "patient",
    "tab" : "grant",
    "owners" : [ ],
    "params" : [ {
      "caption" : "Active Date",
      "name" : "activityDate",
      "type" : "date",
      "displayOrder" : 1,
      "options" : [ ]
    } ],
    "formats" : [ {
      "name" : "xls",
      "caption" : "XLS",
      "displayOrder" : 1
    }, {
      "name" : "doc",
      "caption" : "DOC",
      "displayOrder" : 2
    }, {
      "name" : "html",
      "caption" : "HTML",
      "displayOrder" : 3
    }, {
      "name" : "pdf",
      "caption" : "PDF",
      "displayOrder" : 4
    }, {
      "name" : "csv",
      "caption" : "CSV",
      "displayOrder" : 5
    } ],
    "datakey" : "GrantActiveOnDate"
  }, {
    "name" : "GrantActiveQuarterBars",
    "title" : "Active Grants Quarter Bars",
    "description" : "The Active Grants, displayed with bars for future quarters (the Scott format)",
    "className" : "hci.artadmin.controller.reports.ReportGrantActiveQuarterBars",
    "fileName" : "grantActiveQuarterBars",
    "type" : "patient",
    "tab" : "grant",
    "owners" : [ ],
    "params" : [ {
      "caption" : "Active Date",
      "name" : "activityDate",
      "type" : "date",
      "displayOrder" : 1,
      "options" : [ ]
    } ],
    "formats" : [ {
      "name" : "xls",
      "caption" : "XLS",
      "displayOrder" : 1
    }, {
      "name" : "html",
      "caption" : "HTML",
      "displayOrder" : 2
    }, {
      "name" : "doc",
      "caption" : "DOC",
      "displayOrder" : 3
    }, {
      "name" : "pdf",
      "caption" : "PDF",
      "displayOrder" : 4
    }, {
      "name" : "csv",
      "caption" : "CSV",
      "displayOrder" : 5
    } ],
    "datakey" : "GrantActiveQuarterBars"
  }, {
    "name" : "GrantBudgetsPastEnd",
    "title" : "Grants with Budgets Past the End",
    "description" : "Shows Grants that have any Budget Periods that end after the Grant's End Date",
    "className" : "hci.artadmin.controller.reports.ReportGrantBudgetsPastEnd",
    "fileName" : "grantBudgetsPastEnd",
    "type" : "patient",
    "tab" : "grant",
    "owners" : [ ],
    "params" : [ {
      "caption" : "Active Date (optional)",
      "name" : "activityDate",
      "type" : "date",
      "displayOrder" : 1,
      "options" : [ ]
    } ],
    "formats" : [ {
      "name" : "xls",
      "caption" : "XLS",
      "displayOrder" : 1
    }, {
      "name" : "doc",
      "caption" : "DOC",
      "displayOrder" : 2
    }, {
      "name" : "html",
      "caption" : "HTML",
      "displayOrder" : 3
    }, {
      "name" : "pdf",
      "caption" : "PDF",
      "displayOrder" : 4
    }, {
      "name" : "csv",
      "caption" : "CSV",
      "displayOrder" : 5
    } ],
    "datakey" : "GrantBudgetsPastEnd"
  }, {
    "name" : "GrantDataDump",
    "title" : "Grant Data Dump",
    "description" : "A simple dump of the Grants data (also called Dream Report?)",
    "className" : "hci.artadmin.controller.reports.ReportGrantDataDump",
    "fileName" : "grantDataDump",
    "type" : "patient",
    "tab" : "grant",
    "owners" : [ ],
    "params" : [ {
      "caption" : "Status (blank for All)",
      "name" : "statusChoice",
      "type" : "select",
      "className" : "hci.artadmin.model.dict.GrantStatus",
      "valueXPath" : "@idGrantStatus",
      "displayXPath" : "@grantStatus",
      "displayOrder" : 1,
      "options" : [ ]
    } ],
    "formats" : [ {
      "name" : "xls",
      "caption" : "XLS",
      "displayOrder" : 1
    }, {
      "name" : "doc",
      "caption" : "DOC",
      "displayOrder" : 2
    }, {
      "name" : "html",
      "caption" : "HTML",
      "displayOrder" : 3
    }, {
      "name" : "pdf",
      "caption" : "PDF",
      "displayOrder" : 4
    }, {
      "name" : "csv",
      "caption" : "CSV",
      "displayOrder" : 5
    } ],
    "datakey" : "GrantDataDump"
  }, {
    "name" : "GrantEndBeforeBYEnd",
    "title" : "Grants End before Budget Years",
    "description" : "Grants where End date is before the Budget Years' end.",
    "className" : "hci.artadmin.controller.reports.ReportGrantEndBeforeBYEnd",
    "fileName" : "grantEndBeforeBYEnd",
    "type" : "patient",
    "tab" : "grant",
    "owners" : [ ],
    "params" : [ {
      "caption" : "Active Date",
      "name" : "activityDate",
      "type" : "date",
      "displayOrder" : 1,
      "options" : [ ]
    } ],
    "formats" : [ {
      "name" : "xls",
      "caption" : "XLS",
      "displayOrder" : 1
    }, {
      "name" : "doc",
      "caption" : "DOC",
      "displayOrder" : 2
    }, {
      "name" : "html",
      "caption" : "HTML",
      "displayOrder" : 3
    }, {
      "name" : "pdf",
      "caption" : "PDF",
      "displayOrder" : 4
    }, {
      "name" : "csv",
      "caption" : "CSV",
      "displayOrder" : 5
    } ],
    "datakey" : "GrantEndBeforeBYEnd"
  }, {
    "name" : "GrantFiscalForcast",
    "title" : "Grant Fiscal Forcast",
    "description" : "Grants with amounts forcasted into future fiscal years",
    "className" : "hci.artadmin.controller.reports.ReportGrantFiscalForcast",
    "fileName" : "grantFiscalForcast",
    "type" : "patient",
    "tab" : "grant",
    "owners" : [ ],
    "params" : [ {
      "caption" : "Date",
      "name" : "activityDate",
      "type" : "date",
      "displayOrder" : 1,
      "options" : [ ]
    } ],
    "formats" : [ {
      "name" : "xls",
      "caption" : "XLS",
      "displayOrder" : 1
    }, {
      "name" : "html",
      "caption" : "HTML",
      "displayOrder" : 2
    }, {
      "name" : "doc",
      "caption" : "DOC",
      "displayOrder" : 3
    }, {
      "name" : "pdf",
      "caption" : "PDF",
      "displayOrder" : 4
    }, {
      "name" : "csv",
      "caption" : "CSV",
      "displayOrder" : 5
    } ],
    "datakey" : "GrantFiscalForcast"
  }, {
    "name" : "GrantGreaterThan100",
    "title" : "Grants with Greater than 100%",
    "description" : "Shows those Grant/Budget years that have a sum total of greater than 100% between all PIs.",
    "className" : "hci.artadmin.controller.reports.ReportGrantGreaterThan100",
    "fileName" : "grantGreaterThan100",
    "type" : "patient",
    "tab" : "grant",
    "owners" : [ ],
    "params" : [ {
      "caption" : "Active Date",
      "name" : "activityDate",
      "type" : "date",
      "displayOrder" : 1,
      "options" : [ ]
    } ],
    "formats" : [ {
      "name" : "xls",
      "caption" : "XLS",
      "displayOrder" : 1
    }, {
      "name" : "doc",
      "caption" : "DOC",
      "displayOrder" : 2
    }, {
      "name" : "html",
      "caption" : "HTML",
      "displayOrder" : 3
    }, {
      "name" : "pdf",
      "caption" : "PDF",
      "displayOrder" : 4
    }, {
      "name" : "csv",
      "caption" : "CSV",
      "displayOrder" : 5
    } ],
    "datakey" : "GrantGreaterThan100"
  }, {
    "name" : "GrantOverlappingBudgets",
    "title" : "Grants with Overlapping Budgets",
    "description" : "Shows Grants that have two or more Budget Periods that overlap their time periods",
    "className" : "hci.artadmin.controller.reports.ReportGrantOverlappingBudgets",
    "fileName" : "grantOverlappingBudgets",
    "type" : "patient",
    "tab" : "grant",
    "owners" : [ ],
    "params" : [ {
      "caption" : "Active Date (optional)",
      "name" : "activityDate",
      "type" : "date",
      "displayOrder" : 1,
      "options" : [ ]
    } ],
    "formats" : [ {
      "name" : "xls",
      "caption" : "XLS",
      "displayOrder" : 1
    }, {
      "name" : "doc",
      "caption" : "DOC",
      "displayOrder" : 2
    }, {
      "name" : "html",
      "caption" : "HTML",
      "displayOrder" : 3
    }, {
      "name" : "pdf",
      "caption" : "PDF",
      "displayOrder" : 4
    }, {
      "name" : "csv",
      "caption" : "CSV",
      "displayOrder" : 5
    } ],
    "datakey" : "GrantOverlappingBudgets"
  }, {
    "name" : "GrantPilotDOTData",
    "title" : "Pilot Project Data",
    "description" : "Pilot Project Data for DOTs (and other Groups)",
    "className" : "hci.artadmin.controller.reports.ReportPilotDOTData",
    "fileName" : "grantPilotDOTData",
    "type" : "patient",
    "tab" : "grant",
    "owners" : [ ],
    "params" : [ {
      "caption" : "Groups",
      "name" : "groupChoice",
      "type" : "multiselect",
      "className" : "hci.artadmin.model.dict.GroupType",
      "dataXPath" : "@codeGroupType",
      "valueXPath" : "@codeGroupType",
      "displayXPath" : "@groupType",
      "displayOrder" : 1,
      "options" : [ ]
    } ],
    "formats" : [ {
      "name" : "xls",
      "caption" : "XLS",
      "displayOrder" : 1
    } ],
    "datakey" : "GrantPilotDOTData"
  }, {
    "name" : "GrantRedZone",
    "title" : "Red Zone Report",
    "description" : "All Grants that are within 90 days of completion from the given date",
    "className" : "hci.artadmin.controller.reports.ReportRedZone",
    "fileName" : "grantRedZone",
    "type" : "patient",
    "tab" : "grant",
    "owners" : [ ],
    "params" : [ {
      "caption" : "Active Date",
      "name" : "activityDate",
      "type" : "date",
      "tooltip" : "Defaults to today",
      "displayOrder" : 1,
      "options" : [ ]
    } ],
    "formats" : [ {
      "name" : "xls",
      "caption" : "XLS",
      "displayOrder" : 1
    }, {
      "name" : "html",
      "caption" : "HTML",
      "displayOrder" : 3
    } ],
    "datakey" : "GrantRedZone"
  }, {
    "name" : "GrantRenewalReport",
    "title" : "Grant Renewal Report",
    "description" : "Grant information for Renewals",
    "className" : "hci.artadmin.controller.reports.ReportGrantRenewal",
    "fileName" : "grantRenewalReport",
    "type" : "patient",
    "tab" : "grant",
    "owners" : [ ],
    "params" : [ {
      "caption" : "Date",
      "name" : "activityDate",
      "type" : "date",
      "displayOrder" : 1,
      "options" : [ ]
    } ],
    "formats" : [ {
      "name" : "xls",
      "caption" : "XLS",
      "displayOrder" : 1
    }, {
      "name" : "html",
      "caption" : "HTML",
      "displayOrder" : 2
    }, {
      "name" : "doc",
      "caption" : "DOC",
      "displayOrder" : 3
    }, {
      "name" : "pdf",
      "caption" : "PDF",
      "displayOrder" : 4
    }, {
      "name" : "csv",
      "caption" : "CSV",
      "displayOrder" : 5
    } ],
    "datakey" : "GrantRenewalReport"
  }, {
    "name" : "GrantReportDueDate",
    "title" : "Grant Report Due Dates",
    "description" : "List the reports due in the specified time period",
    "className" : "hci.artadmin.controller.reports.ReportGrantReportDueDate",
    "fileName" : "grantReportDueDate",
    "type" : "patient",
    "tab" : "grant",
    "owners" : [ ],
    "params" : [ {
      "caption" : "From",
      "name" : "fromDate",
      "type" : "date",
      "displayOrder" : 1,
      "options" : [ ]
    }, {
      "caption" : "To",
      "name" : "toDate",
      "type" : "date",
      "displayOrder" : 2,
      "options" : [ ]
    } ],
    "formats" : [ {
      "name" : "xls",
      "caption" : "XLS",
      "displayOrder" : 1
    }, {
      "name" : "doc",
      "caption" : "DOC",
      "displayOrder" : 2
    }, {
      "name" : "html",
      "caption" : "HTML",
      "displayOrder" : 3
    }, {
      "name" : "pdf",
      "caption" : "PDF",
      "displayOrder" : 4
    }, {
      "name" : "csv",
      "caption" : "CSV",
      "displayOrder" : 5
    } ],
    "datakey" : "GrantReportDueDate"
  }, {
    "name" : "GrantReportingReview",
    "title" : "Grant Reporting Review",
    "description" : "List the reports that are over due, or due in the next 90 days from specified date",
    "className" : "hci.artadmin.controller.reports.ReportGrantReportingReview",
    "fileName" : "grantReportingReview",
    "type" : "patient",
    "tab" : "grant",
    "owners" : [ ],
    "params" : [ {
      "caption" : "Date",
      "name" : "onDate",
      "type" : "date",
      "displayOrder" : 1,
      "options" : [ ]
    } ],
    "formats" : [ {
      "name" : "xls",
      "caption" : "XLS",
      "displayOrder" : 1
    }, {
      "name" : "html",
      "caption" : "HTML",
      "displayOrder" : 3
    } ],
    "datakey" : "GrantReportingReview"
  }, {
    "name" : "GrantReturnedOverhead",
    "title" : "Returned Overhead Report",
    "description" : "Grants active during the range using ROH parameters",
    "className" : "hci.artadmin.controller.reports.ReportReturnedOverhead",
    "fileName" : "grantReturnedOverhead",
    "type" : "patient",
    "tab" : "grant",
    "owners" : [ ],
    "params" : [ {
      "caption" : "Range Start Date",
      "name" : "startDate",
      "type" : "date",
      "displayOrder" : 1,
      "options" : [ ]
    }, {
      "caption" : "Range End Date",
      "name" : "endDate",
      "type" : "date",
      "displayOrder" : 2,
      "options" : [ ]
    }, {
      "caption" : "Version",
      "name" : "versionChoice",
      "type" : "select",
      "tooltip" : "Leave blank for 'CCSG-style'",
      "displayOrder" : 3,
      "options" : [ {
        "value" : "ccsg",
        "display" : "CCSG-style",
        "displayOrder" : 1
      }, {
        "value" : "orgid",
        "display" : "OrgID-style",
        "displayOrder" : 2
      } ]
    } ],
    "formats" : [ {
      "name" : "xls",
      "caption" : "XLS",
      "displayOrder" : 1
    }, {
      "name" : "html",
      "caption" : "HTML",
      "displayOrder" : 2
    }, {
      "name" : "doc",
      "caption" : "DOC",
      "displayOrder" : 3
    }, {
      "name" : "pdf",
      "caption" : "PDF",
      "displayOrder" : 4
    }, {
      "name" : "csv",
      "caption" : "CSV",
      "displayOrder" : 5
    } ],
    "datakey" : "GrantReturnedOverhead"
  }, {
    "name" : "GroupLeaders",
    "title" : "Group Leaders and Members",
    "description" : "Lists the leaders and members for the groups for the chosen types",
    "className" : "hci.artadmin.controller.reports.ReportGroupLeaders",
    "fileName" : "groupLeaders",
    "type" : "patient",
    "tab" : "researcher",
    "owners" : [ ],
    "params" : [ {
      "caption" : "Activity Date",
      "name" : "activityDate",
      "type" : "date",
      "tooltip" : "Date for deciding which Groups/Department a Researcher has",
      "displayOrder" : 1,
      "options" : [ ]
    }, {
      "caption" : "Groups",
      "name" : "groupChoice",
      "type" : "multiselect",
      "className" : "hci.artadmin.model.dict.GroupType",
      "dataXPath" : "@codeGroupType",
      "valueXPath" : "@codeGroupType",
      "displayXPath" : "@groupType",
      "displayOrder" : 2,
      "options" : [ ]
    }, {
      "caption" : "Featured",
      "name" : "featureChoice",
      "type" : "select",
      "tooltip" : "Leave blank for 'Any'",
      "displayOrder" : 3,
      "options" : [ {
        "value" : "featured",
        "display" : "Featured",
        "displayOrder" : 1
      }, {
        "value" : "nonFeatured",
        "display" : "Non-Featured",
        "displayOrder" : 2
      }, {
        "value" : "any",
        "display" : "Any",
        "displayOrder" : 3
      } ]
    } ],
    "formats" : [ {
      "name" : "xls",
      "caption" : "XLS",
      "displayOrder" : 1
    }, {
      "name" : "html",
      "caption" : "HTML",
      "displayOrder" : 2
    } ],
    "datakey" : "GroupLeaders"
  }, {
    "name" : "InvestigatorHandoutReport",
    "title" : "Investigator Handout Report",
    "description" : "A report of Investigators meant for handing out",
    "className" : "hci.artadmin.controller.reports.ReportInvestigatorHandout",
    "fileName" : "investigatorHandoutReport",
    "type" : "global",
    "tab" : "researcher",
    "owners" : [ ],
    "params" : [ {
      "caption" : "Include Contact Info?",
      "name" : "contactChoice",
      "type" : "radio",
      "displayOrder" : 1,
      "options" : [ {
        "value" : "contact",
        "display" : "WITH Contact Info",
        "displayOrder" : 1
      }, {
        "value" : "nocontact",
        "display" : "WITHOUT Contact Info",
        "displayOrder" : 2
      } ]
    } ],
    "formats" : [ {
      "name" : "xls",
      "caption" : "XLS",
      "displayOrder" : 1
    }, {
      "name" : "doc",
      "caption" : "DOC",
      "displayOrder" : 2
    }, {
      "name" : "html",
      "caption" : "HTML",
      "displayOrder" : 3
    }, {
      "name" : "pdf",
      "caption" : "PDF",
      "displayOrder" : 4
    }, {
      "name" : "csv",
      "caption" : "CSV",
      "displayOrder" : 5
    } ],
    "datakey" : "InvestigatorHandoutReport"
  }, {
    "name" : "InvestigatorReport",
    "title" : "Investigator Report",
    "description" : "A comprehensive report of Investigators",
    "className" : "hci.artadmin.controller.reports.ReportInvestigator",
    "fileName" : "investigatorReport",
    "type" : "global",
    "tab" : "researcher",
    "owners" : [ ],
    "params" : [ {
      "caption" : "Active",
      "name" : "inactiveChoice",
      "type" : "select",
      "tooltip" : "Leave blank for active only",
      "displayOrder" : 1,
      "options" : [ {
        "value" : "active",
        "display" : "Active",
        "displayOrder" : 1
      }, {
        "value" : "inactive",
        "display" : "Inactive",
        "displayOrder" : 2
      }, {
        "value" : "both",
        "display" : "Both",
        "displayOrder" : 3
      } ]
    }, {
      "caption" : "Group",
      "name" : "groupIdChoice",
      "type" : "multiselect",
      "className" : "hci.artadmin.model.GrantApplicationType",
      "valueXPath" : "@idGrant",
      "displayXPath" : "@grantType",
      "displayOrder" : 2,
      "options" : [ ]
    } ],
    "formats" : [ {
      "name" : "xls",
      "caption" : "XLS",
      "displayOrder" : 1
    }, {
      "name" : "doc",
      "caption" : "DOC",
      "displayOrder" : 2
    }, {
      "name" : "html",
      "caption" : "HTML",
      "displayOrder" : 3
    }, {
      "name" : "pdf",
      "caption" : "PDF",
      "displayOrder" : 4
    }, {
      "name" : "csv",
      "caption" : "CSV",
      "displayOrder" : 5
    } ],
    "datakey" : "InvestigatorReport"
  }, {
    "name" : "InvestigatorSimpleAlphaReport",
    "title" : "Investigator Simple Alpha Report",
    "description" : "A simple report of Investigators, sorted by Last Name",
    "className" : "hci.artadmin.controller.reports.ReportInvestigatorSimpleAlpha",
    "fileName" : "investigatorSimpleAlphaReport",
    "type" : "global",
    "tab" : "researcher",
    "owners" : [ ],
    "params" : [ {
      "caption" : "Active",
      "name" : "inactiveChoice",
      "type" : "select",
      "tooltip" : "Leave blank for Active only",
      "displayOrder" : 1,
      "options" : [ {
        "value" : "active",
        "display" : "Active",
        "displayOrder" : 1
      }, {
        "value" : "inactive",
        "display" : "Inactive",
        "displayOrder" : 2
      }, {
        "value" : "both",
        "display" : "Both",
        "displayOrder" : 3
      } ]
    } ],
    "formats" : [ {
      "name" : "xls",
      "caption" : "XLS",
      "displayOrder" : 1
    }, {
      "name" : "doc",
      "caption" : "DOC",
      "displayOrder" : 2
    }, {
      "name" : "html",
      "caption" : "HTML",
      "displayOrder" : 3
    }, {
      "name" : "pdf",
      "caption" : "PDF",
      "displayOrder" : 4
    }, {
      "name" : "csv",
      "caption" : "CSV",
      "displayOrder" : 5
    } ],
    "datakey" : "InvestigatorSimpleAlphaReport"
  }, {
    "name" : "Member Program Changes",
    "title" : "Member Program Changes",
    "description" : "The ranges of the various Programs that have changed during the range",
    "className" : "hci.artadmin.controller.reports.ReportProgramChanges",
    "fileName" : "programChanges",
    "type" : "patient",
    "tab" : "researcher",
    "owners" : [ ],
    "params" : [ {
      "caption" : "Start Date",
      "name" : "startDate",
      "type" : "date",
      "displayOrder" : 1,
      "options" : [ ]
    }, {
      "caption" : "End Date",
      "name" : "endDate",
      "type" : "date",
      "displayOrder" : 2,
      "options" : [ ]
    } ],
    "formats" : [ {
      "name" : "xls",
      "caption" : "XLS",
      "displayOrder" : 1
    }, {
      "name" : "doc",
      "caption" : "DOC",
      "displayOrder" : 2
    }, {
      "name" : "html",
      "caption" : "HTML",
      "displayOrder" : 3
    }, {
      "name" : "pdf",
      "caption" : "PDF",
      "displayOrder" : 4
    }, {
      "name" : "csv",
      "caption" : "CSV",
      "displayOrder" : 5
    } ],
    "datakey" : "Member Program Changes"
  }, {
    "name" : "MemberMdgDotReport",
    "title" : "Member MDGs and DOTs Report",
    "description" : "CCSG Members' MDGs and DOTs",
    "className" : "hci.artadmin.controller.reports.ReportMemberDotMdg",
    "fileName" : "memberMdgDotReport",
    "type" : "patient",
    "tab" : "researcher",
    "owners" : [ ],
    "params" : [ {
      "caption" : "Date",
      "name" : "activityDate",
      "type" : "date",
      "displayOrder" : 1,
      "options" : [ ]
    }, {
      "caption" : "Programs",
      "name" : "programChoice",
      "type" : "multiselect",
      "className" : "hci.artadmin.model.dict.Program",
      "dataXPath" : "@programCode",
      "valueXPath" : "@idProgram",
      "displayXPath" : "@programName",
      "displayOrder" : 2,
      "options" : [ ]
    }, {
      "caption" : "Featured",
      "name" : "featureChoice",
      "type" : "select",
      "tooltip" : "Leave blank for 'Any'",
      "displayOrder" : 3,
      "options" : [ {
        "value" : "featured",
        "display" : "Featured",
        "displayOrder" : 1
      }, {
        "value" : "nonFeatured",
        "display" : "Non-Featured",
        "displayOrder" : 2
      }, {
        "value" : "any",
        "display" : "Any",
        "displayOrder" : 3
      } ]
    } ],
    "formats" : [ {
      "name" : "xls",
      "caption" : "XLS",
      "displayOrder" : 1
    }, {
      "name" : "html",
      "caption" : "HTML",
      "displayOrder" : 2
    } ],
    "datakey" : "MemberMdgDotReport"
  }, {
    "name" : "MemberProgramOneSheet",
    "title" : "Member Program One Sheet",
    "description" : "All program members on one sheet",
    "className" : "hci.artadmin.controller.reports.ReportMemberProgramOneSheet",
    "fileName" : "memberProgramOneSheet",
    "type" : "global",
    "tab" : "researcher",
    "owners" : [ ],
    "params" : [ {
      "caption" : "Featured",
      "name" : "featureChoice",
      "type" : "select",
      "tooltip" : "Leave blank for 'Any'",
      "displayOrder" : 1,
      "options" : [ {
        "value" : "featured",
        "display" : "Featured",
        "displayOrder" : 1
      }, {
        "value" : "nonFeatured",
        "display" : "Non-Featured",
        "displayOrder" : 2
      }, {
        "value" : "any",
        "display" : "Any",
        "displayOrder" : 3
      } ]
    } ],
    "formats" : [ {
      "name" : "xls",
      "caption" : "XLS",
      "displayOrder" : 1
    }, {
      "name" : "html",
      "caption" : "HTML",
      "displayOrder" : 2
    } ],
    "datakey" : "MemberProgramOneSheet"
  }, {
    "name" : "MemberPubCollabNamesReport",
    "title" : "Member Pub Collab Names Report",
    "description" : "Report of CCSG Members with the other Members they have collaborated on Publications with, and the count.",
    "help" : "",
    "className" : "hci.artadmin.controller.reports.ReportMemberPubCollabNames",
    "fileName" : "memberPubCollabNamesReport",
    "type" : "patient",
    "tab" : "researcher",
    "owners" : [ ],
    "params" : [ {
      "caption" : "Range Start Date",
      "name" : "startDate",
      "type" : "date",
      "displayOrder" : 1,
      "options" : [ ]
    }, {
      "caption" : "Range End Date",
      "name" : "endDate",
      "type" : "date",
      "displayOrder" : 2,
      "options" : [ ]
    }, {
      "caption" : "Publication Year(s)",
      "name" : "pubYears",
      "type" : "input",
      "tooltip" : "Ranges and comma-separated are allowed. e.g. '2009,2014' '2009-2011,2014' ",
      "displayOrder" : 3,
      "options" : [ ]
    }, {
      "caption" : "Programs",
      "name" : "groupChoice",
      "type" : "multiselect",
      "className" : "hci.artadmin.model.dict.Program",
      "dataXPath" : "@programCode",
      "valueXPath" : "@idProgram",
      "displayXPath" : "@programName",
      "displayOrder" : 4,
      "options" : [ ]
    }, {
      "caption" : "Featured",
      "name" : "featureChoice",
      "type" : "select",
      "tooltip" : "Leave blank for 'Any'",
      "displayOrder" : 5,
      "options" : [ {
        "value" : "featured",
        "display" : "Featured",
        "displayOrder" : 1
      }, {
        "value" : "nonFeatured",
        "display" : "Non-Featured",
        "displayOrder" : 2
      }, {
        "value" : "any",
        "display" : "Any",
        "displayOrder" : 3
      } ]
    }, {
      "caption" : "Include Inactive",
      "name" : "inactiveChoice",
      "type" : "radio",
      "tooltip" : "Left the University is an example of an Includable inactive reason.",
      "displayOrder" : 6,
      "options" : [ {
        "value" : "include",
        "display" : "Includable",
        "displayOrder" : 1
      }, {
        "value" : "none",
        "display" : "No Inactive",
        "displayOrder" : 2
      } ]
    }, {
      "caption" : "Included In",
      "name" : "includeChoice",
      "type" : "multiselect",
      "className" : "hci.artadmin.model.dict.IncludedIn",
      "valueXPath" : "@value",
      "displayXPath" : "@display",
      "displayOrder" : 7,
      "options" : [ ],
      "blankMeansAll" : "N"
    } ],
    "formats" : [ {
      "name" : "xls",
      "caption" : "XLS",
      "displayOrder" : 1
    }, {
      "name" : "doc",
      "caption" : "DOC",
      "displayOrder" : 2
    }, {
      "name" : "html",
      "caption" : "HTML",
      "displayOrder" : 3
    }, {
      "name" : "pdf",
      "caption" : "PDF",
      "displayOrder" : 4
    }, {
      "name" : "csv",
      "caption" : "CSV",
      "displayOrder" : 5
    } ],
    "datakey" : "MemberPubCollabNamesReport"
  }, {
    "name" : "MemberReport",
    "title" : "Member Report",
    "description" : "A comprehensive report of CCSG Members",
    "help" : "",
    "className" : "hci.artadmin.controller.reports.ReportMember",
    "fileName" : "memberReport",
    "type" : "global",
    "tab" : "researcher",
    "owners" : [ ],
    "params" : [ {
      "caption" : "Group",
      "name" : "groupIdChoice",
      "type" : "select",
      "className" : "hci.artadmin.model.dict.GroupDict",
      "valueXPath" : "@idGroup",
      "displayXPath" : "@codedDisplay",
      "displayOrder" : 1,
      "options" : [ ]
    }, {
      "caption" : "Active/Inactive",
      "name" : "inactiveChoice",
      "type" : "select",
      "tooltip" : "Leave blank for Active",
      "displayOrder" : 2,
      "options" : [ {
        "value" : "active",
        "display" : "Active",
        "displayOrder" : 1
      }, {
        "value" : "inactive",
        "display" : "Inactive",
        "displayOrder" : 2
      }, {
        "value" : "both",
        "display" : "Both",
        "displayOrder" : 3
      } ]
    }, {
      "caption" : "Featured",
      "name" : "featureChoice",
      "type" : "select",
      "tooltip" : "Leave blank for 'Any'",
      "displayOrder" : 3,
      "options" : [ {
        "value" : "featured",
        "display" : "Featured",
        "displayOrder" : 1
      }, {
        "value" : "nonFeatured",
        "display" : "Non-Featured",
        "displayOrder" : 2
      }, {
        "value" : "any",
        "display" : "Any",
        "displayOrder" : 3
      } ]
    } ],
    "formats" : [ {
      "name" : "xls",
      "caption" : "XLS",
      "displayOrder" : 1
    }, {
      "name" : "doc",
      "caption" : "DOC",
      "displayOrder" : 2
    }, {
      "name" : "html",
      "caption" : "HTML",
      "displayOrder" : 3
    }, {
      "name" : "pdf",
      "caption" : "PDF",
      "displayOrder" : 4
    }, {
      "name" : "csv",
      "caption" : "CSV",
      "displayOrder" : 5
    } ],
    "datakey" : "MemberReport"
  }, {
    "name" : "MemberReportForSR",
    "title" : "Members in Range (for SR use)",
    "description" : "Active Members and peer-reviewed funding in given range",
    "className" : "hci.artadmin.controller.reports.ReportMemberForSR",
    "fileName" : "memberReportForSR",
    "type" : "patient",
    "tab" : "researcher",
    "owners" : [ ],
    "params" : [ {
      "caption" : "Range Start Date",
      "name" : "startDate",
      "type" : "date",
      "displayOrder" : 1,
      "options" : [ ]
    }, {
      "caption" : "Range End Date",
      "name" : "endDate",
      "type" : "date",
      "displayOrder" : 2,
      "options" : [ ]
    }, {
      "caption" : "Featured",
      "name" : "featureChoice",
      "type" : "select",
      "tooltip" : "Leave blank for 'Any'",
      "displayOrder" : 3,
      "options" : [ {
        "value" : "featured",
        "display" : "Featured",
        "displayOrder" : 1
      }, {
        "value" : "nonFeatured",
        "display" : "Non-Featured",
        "displayOrder" : 2
      }, {
        "value" : "any",
        "display" : "Any",
        "displayOrder" : 3
      } ]
    }, {
      "caption" : "Include Inactive",
      "name" : "inactiveChoice",
      "type" : "radio",
      "tooltip" : "Left the University is an example of an Includable inactive reason.",
      "displayOrder" : 4,
      "options" : [ {
        "value" : "include",
        "display" : "Includable",
        "displayOrder" : 1
      }, {
        "value" : "none",
        "display" : "No Inactive",
        "displayOrder" : 2
      } ]
    }, {
      "caption" : "Zero % Cancer Related",
      "name" : "zeroCFChoice",
      "type" : "radio",
      "displayOrder" : 5,
      "options" : [ {
        "value" : "includeCF",
        "display" : "Include 0% Cancer Related",
        "displayOrder" : 1
      }, {
        "value" : "excludeCF",
        "display" : "Only  >0% Cancer Related",
        "displayOrder" : 2
      } ]
    } ],
    "formats" : [ {
      "name" : "xls",
      "caption" : "XLS",
      "displayOrder" : 1
    }, {
      "name" : "html",
      "caption" : "HTML",
      "displayOrder" : 2
    }, {
      "name" : "doc",
      "caption" : "DOC",
      "displayOrder" : 3
    }, {
      "name" : "pdf",
      "caption" : "PDF",
      "displayOrder" : 4
    }, {
      "name" : "csv",
      "caption" : "CSV",
      "displayOrder" : 5
    } ],
    "datakey" : "MemberReportForSR"
  }, {
    "name" : "MemberReviewReport",
    "title" : "Member Review Report",
    "description" : "CCSG Membership Review data for Determination of Inclusion",
    "help" : "Only Active Members<br/>   Cancer Focused Pubs (not including Excluded pubs)<br/>   Articles or Book Chapters/Reviews marked as Include anyway   ",
    "className" : "hci.artadmin.controller.reports.ReportMemberReview",
    "fileName" : "memberReviewReport",
    "type" : "patient",
    "tab" : "researcher",
    "owners" : [ ],
    "params" : [ {
      "caption" : "Date",
      "name" : "activityDate",
      "type" : "date",
      "displayOrder" : 1,
      "options" : [ ]
    }, {
      "caption" : "Programs",
      "name" : "programChoice",
      "type" : "multiselect",
      "className" : "hci.artadmin.model.dict.Program",
      "dataXPath" : "@programCode",
      "valueXPath" : "@idProgram",
      "displayXPath" : "@programName",
      "displayOrder" : 2,
      "options" : [ ]
    }, {
      "caption" : "Include Associates",
      "name" : "associateChoice",
      "type" : "radio",
      "displayOrder" : 4,
      "options" : [ {
        "value" : "include",
        "display" : "Include",
        "displayOrder" : 1
      }, {
        "value" : "exclude",
        "display" : "Exclude",
        "displayOrder" : 2
      } ]
    }, {
      "caption" : "Featured",
      "name" : "featureChoice",
      "type" : "select",
      "tooltip" : "Leave blank for 'Any'",
      "displayOrder" : 5,
      "options" : [ {
        "value" : "featured",
        "display" : "Featured",
        "displayOrder" : 1
      }, {
        "value" : "nonFeatured",
        "display" : "Non-Featured",
        "displayOrder" : 2
      }, {
        "value" : "any",
        "display" : "Any",
        "displayOrder" : 3
      } ]
    }, {
      "caption" : "Publication Year(s)",
      "name" : "pubYears",
      "type" : "input",
      "tooltip" : "Ranges and comma-separated are allowed. e.g. '2009,2014' '2009-2011,2014' ",
      "displayOrder" : 6,
      "options" : [ ]
    } ],
    "formats" : [ {
      "name" : "xls",
      "caption" : "XLS",
      "displayOrder" : 1
    }, {
      "name" : "html",
      "caption" : "HTML",
      "displayOrder" : 2
    }, {
      "name" : "doc",
      "caption" : "DOC",
      "displayOrder" : 3
    }, {
      "name" : "pdf",
      "caption" : "PDF",
      "displayOrder" : 4
    }, {
      "name" : "csv",
      "caption" : "CSV",
      "displayOrder" : 5
    } ],
    "datakey" : "MemberReviewReport"
  }, {
    "name" : "MembershipListReport",
    "title" : "Membership List Report",
    "description" : "A nicely formatted doc of the current membership",
    "className" : "hci.artadmin.controller.reports.ReportMembershipList",
    "fileName" : "membershipListReport",
    "type" : "global",
    "tab" : "researcher",
    "owners" : [ ],
    "params" : [ {
      "caption" : "Featured",
      "name" : "featureChoice",
      "type" : "select",
      "tooltip" : "Leave blank for 'Any'",
      "displayOrder" : 1,
      "options" : [ {
        "value" : "featured",
        "display" : "Featured",
        "displayOrder" : 1
      }, {
        "value" : "nonFeatured",
        "display" : "Non-Featured",
        "displayOrder" : 2
      }, {
        "value" : "any",
        "display" : "Any",
        "displayOrder" : 3
      } ]
    } ],
    "formats" : [ {
      "name" : "doc",
      "caption" : "DOC",
      "displayOrder" : 1
    } ],
    "datakey" : "MembershipListReport"
  }, {
    "name" : "PIFundingEmail",
    "title" : "PI Funding Email",
    "description" : "Returns the grants that might be included in DT2A for emailing PIs",
    "className" : "hci.artadmin.controller.reports.ReportPIFundingEmail",
    "fileName" : "piFundingEmail",
    "type" : "patient",
    "tab" : "grant",
    "owners" : [ ],
    "params" : [ {
      "caption" : "Active Date",
      "name" : "activityDate",
      "type" : "date",
      "displayOrder" : 1,
      "options" : [ ]
    }, {
      "caption" : "Programs",
      "name" : "programChoice",
      "type" : "multiselect",
      "className" : "hci.artadmin.model.dict.Program",
      "dataXPath" : "@programCode",
      "valueXPath" : "@idProgram",
      "displayXPath" : "@programName",
      "displayOrder" : 2,
      "options" : [ ]
    }, {
      "caption" : "Featured",
      "name" : "featureChoice",
      "type" : "select",
      "tooltip" : "Leave blank for 'Any'",
      "displayOrder" : 3,
      "options" : [ {
        "value" : "featured",
        "display" : "Featured",
        "displayOrder" : 1
      }, {
        "value" : "nonFeatured",
        "display" : "Non-Featured",
        "displayOrder" : 2
      }, {
        "value" : "any",
        "display" : "Any",
        "displayOrder" : 3
      } ]
    } ],
    "formats" : [ {
      "name" : "xls",
      "caption" : "XLS",
      "displayOrder" : 1
    }, {
      "name" : "html",
      "caption" : "HTML",
      "displayOrder" : 3
    } ],
    "datakey" : "PIFundingEmail"
  }, {
    "name" : "PilotGrantReport",
    "title" : "Pilot Grant Basic Report",
    "description" : "List of Pilot Grants",
    "className" : "hci.artadmin.controller.reports.ReportPilotGrant",
    "fileName" : "pilotGrantReport",
    "type" : "patient",
    "tab" : "grant",
    "owners" : [ ],
    "params" : [ ],
    "formats" : [ {
      "name" : "xls",
      "caption" : "XLS",
      "displayOrder" : 1
    }, {
      "name" : "html",
      "caption" : "HTML",
      "displayOrder" : 2
    }, {
      "name" : "doc",
      "caption" : "DOC",
      "displayOrder" : 3
    }, {
      "name" : "pdf",
      "caption" : "PDF",
      "displayOrder" : 4
    }, {
      "name" : "csv",
      "caption" : "CSV",
      "displayOrder" : 5
    } ],
    "datakey" : "PilotGrantReport"
  }, {
    "name" : "PilotProjectHighLevelB",
    "title" : "Pilot Project Report - High-Level B View",
    "description" : "Summary of the Investment/Outcome data for Pilot Projects, Version B",
    "className" : "hci.artadmin.controller.reports.ReportPilotProjectHighLevelB",
    "fileName" : "pilotProjectHighLevelB",
    "type" : "patient",
    "tab" : "grant",
    "owners" : [ ],
    "params" : [ {
      "caption" : "Version",
      "name" : "versionChoice",
      "type" : "select",
      "tooltip" : "Leave blank for 'Assigned Fiscal Year'",
      "displayOrder" : 1,
      "options" : [ {
        "value" : "fy",
        "display" : "Assigned Fiscal Year",
        "displayOrder" : 1
      }, {
        "value" : "bp",
        "display" : "Budget Period Date",
        "displayOrder" : 2
      } ]
    }, {
      "caption" : "Group Type",
      "name" : "groupChoice",
      "type" : "select",
      "tooltip" : "Leave blank for Programs",
      "className" : "hci.artadmin.model.dict.GroupType",
      "dataXPath" : "@codeGroupType",
      "valueXPath" : "@codeGroupType",
      "displayXPath" : "@groupType",
      "displayOrder" : 2,
      "options" : [ ]
    }, {
      "caption" : "Fiscal Year(s)",
      "name" : "fyChoice",
      "type" : "multiselect",
      "className" : "hci.artadmin.model.dict.FiscalYear",
      "dataXPath" : "@fiscalYear",
      "valueXPath" : "@idFiscalYear",
      "displayXPath" : "@display",
      "displayOrder" : 3,
      "options" : [ ],
      "blankMeansAll" : "N"
    } ],
    "formats" : [ {
      "name" : "xls",
      "caption" : "XLS",
      "displayOrder" : 1
    }, {
      "name" : "html",
      "caption" : "HTML",
      "displayOrder" : 2
    }, {
      "name" : "doc",
      "caption" : "DOC",
      "displayOrder" : 3
    }, {
      "name" : "pdf",
      "caption" : "PDF",
      "displayOrder" : 4
    }, {
      "name" : "csv",
      "caption" : "CSV",
      "displayOrder" : 5
    } ],
    "datakey" : "PilotProjectHighLevelB"
  }, {
    "name" : "PilotProjectMidLevel",
    "title" : "Pilot Project Report - Mid-Level View",
    "description" : "Concise summary of the outcomes associated with each pilot project for the selected program. Program affiliation for members is based on the current date (date the report is run), excluding inactive member affiliations unless the member has an Includable inactive reason.",
    "help" : "Pilot Projects with the selected program as the funding group on a budget period will be included. Inter and Intra flags are based on active (or includable inactive) members' current program affiliations.",
    "className" : "hci.artadmin.controller.reports.ReportPilotProjectMidLevel",
    "fileName" : "PilotProjectMidLevelReport",
    "type" : "patient",
    "tab" : "grant",
    "owners" : [ ],
    "params" : [ {
      "caption" : "Programs",
      "name" : "programChoice",
      "type" : "multiselect",
      "className" : "hci.artadmin.model.dict.Program",
      "dataXPath" : "@programCode",
      "valueXPath" : "@idProgram",
      "displayXPath" : "@programName",
      "displayOrder" : 1,
      "options" : [ ]
    } ],
    "formats" : [ {
      "name" : "xls",
      "caption" : "XLS",
      "displayOrder" : 1
    }, {
      "name" : "html",
      "caption" : "HTML",
      "displayOrder" : 2
    }, {
      "name" : "doc",
      "caption" : "DOC",
      "displayOrder" : 3
    }, {
      "name" : "pdf",
      "caption" : "PDF",
      "displayOrder" : 4
    }, {
      "name" : "csv",
      "caption" : "CSV",
      "displayOrder" : 5
    } ],
    "datakey" : "PilotProjectMidLevel"
  }, {
    "name" : "ProgramMembership",
    "title" : "Program Membership",
    "description" : "All program members, degrees, program, rank, membership status",
    "className" : "hci.artadmin.controller.reports.ReportProgramMembership",
    "fileName" : "programMembership",
    "type" : "global",
    "tab" : "researcher",
    "owners" : [ ],
    "params" : [ {
      "caption" : "Program (required)",
      "name" : "programIdChoice",
      "type" : "select",
      "className" : "hci.artadmin.model.dict.Program",
      "valueXPath" : "@idProgram",
      "displayXPath" : "@programName",
      "displayOrder" : 1,
      "options" : [ ]
    }, {
      "caption" : "Featured",
      "name" : "featureChoice",
      "type" : "select",
      "tooltip" : "Leave blank for 'Any'",
      "displayOrder" : 2,
      "options" : [ {
        "value" : "featured",
        "display" : "Featured",
        "displayOrder" : 1
      }, {
        "value" : "nonFeatured",
        "display" : "Non-Featured",
        "displayOrder" : 2
      }, {
        "value" : "any",
        "display" : "Any",
        "displayOrder" : 3
      } ]
    } ],
    "formats" : [ {
      "name" : "xls",
      "caption" : "XLS",
      "displayOrder" : 1
    }, {
      "name" : "doc",
      "caption" : "DOC",
      "displayOrder" : 2
    }, {
      "name" : "html",
      "caption" : "HTML",
      "displayOrder" : 3
    }, {
      "name" : "pdf",
      "caption" : "PDF",
      "displayOrder" : 4
    }, {
      "name" : "csv",
      "caption" : "CSV",
      "displayOrder" : 5
    } ],
    "datakey" : "ProgramMembership"
  }, {
    "name" : "ProgramStatsReport",
    "title" : "Program Stats Report",
    "description" : "Comprehensive Program Stats (Incomplete)",
    "help" : "",
    "className" : "hci.artadmin.controller.reports.ReportProgramStats",
    "fileName" : "programStatsReport",
    "type" : "patient",
    "tab" : "researcher",
    "owners" : [ ],
    "params" : [ {
      "caption" : "Cost Type",
      "name" : "costChoice",
      "type" : "radio",
      "displayOrder" : 1,
      "options" : [ {
        "value" : "total",
        "display" : "Total",
        "displayOrder" : 1
      }, {
        "value" : "direct",
        "display" : "Direct",
        "displayOrder" : 2
      } ]
    }, {
      "caption" : "Programs",
      "name" : "programChoice",
      "type" : "multiselect",
      "className" : "hci.artadmin.model.dict.Program",
      "dataXPath" : "@programCode",
      "valueXPath" : "@idProgram",
      "displayXPath" : "@programName",
      "displayOrder" : 2,
      "options" : [ ]
    }, {
      "caption" : "Include Inactive",
      "name" : "inactiveChoice",
      "type" : "radio",
      "tooltip" : "This parameter only applies to the Pub portion of the report. Demographics and Grants     will not include any inactive people in any case.",
      "displayOrder" : 3,
      "options" : [ {
        "value" : "include",
        "display" : "Includable",
        "displayOrder" : 1
      }, {
        "value" : "none",
        "display" : "No Inactive",
        "displayOrder" : 2
      } ]
    }, {
      "caption" : "Include Associates",
      "name" : "associateChoice",
      "type" : "radio",
      "displayOrder" : 4,
      "options" : [ {
        "value" : "include",
        "display" : "Include",
        "displayOrder" : 1
      }, {
        "value" : "exclude",
        "display" : "Exclude",
        "displayOrder" : 2
      } ]
    }, {
      "caption" : "Featured",
      "name" : "featureChoice",
      "type" : "select",
      "tooltip" : "Leave blank for 'Any'",
      "displayOrder" : 5,
      "options" : [ {
        "value" : "featured",
        "display" : "Featured",
        "displayOrder" : 1
      }, {
        "value" : "nonFeatured",
        "display" : "Non-Featured",
        "displayOrder" : 2
      }, {
        "value" : "any",
        "display" : "Any",
        "displayOrder" : 3
      } ]
    }, {
      "caption" : "Sections",
      "name" : "sectionsChoice",
      "type" : "multiselect",
      "displayOrder" : 6,
      "options" : [ {
        "value" : "member",
        "display" : "Member Info",
        "displayOrder" : 1
      }, {
        "value" : "funding",
        "display" : "Funding",
        "displayOrder" : 2
      }, {
        "value" : "pubs",
        "display" : "Publication",
        "displayOrder" : 3
      }, {
        "value" : "trials",
        "display" : "Clinical Trials",
        "displayOrder" : 4
      } ]
    }, {
      "caption" : "Member Activity Date",
      "name" : "activityDate",
      "type" : "date",
      "tooltip" : "Defaults to today.",
      "displayOrder" : 7,
      "options" : [ ]
    }, {
      "caption" : "Funding Date",
      "name" : "fundingDate",
      "type" : "date",
      "tooltip" : "Defaults to Member Activity Date value",
      "displayOrder" : 8,
      "options" : [ ]
    }, {
      "caption" : "Publication Year(s)",
      "name" : "pubYears",
      "type" : "input",
      "tooltip" : "Ranges and comma-separated are allowed. e.g. '2009,2014' '2009-2011,2014'.     <br/>Defaults to year of Member Activity Date param.",
      "displayOrder" : 9,
      "options" : [ ]
    }, {
      "caption" : "Accrual Year",
      "name" : "accrualYear",
      "type" : "input",
      "tooltip" : "The year to use for the Clinical Trials portion.      <br/>Defaults to year of Member Activity Date parameter.",
      "displayOrder" : 10,
      "options" : [ ]
    }, {
      "caption" : "Include 'Excluded' Pubs",
      "name" : "excludedPubsChoice",
      "type" : "radio",
      "displayOrder" : 11,
      "options" : [ {
        "value" : "N",
        "display" : "No",
        "displayOrder" : 1
      }, {
        "value" : "Y",
        "display" : "Yes",
        "displayOrder" : 2
      } ]
    } ],
    "formats" : [ {
      "name" : "xls",
      "caption" : "XLS",
      "displayOrder" : 1
    }, {
      "name" : "html",
      "caption" : "HTML",
      "displayOrder" : 2
    } ],
    "datakey" : "ProgramStatsReport"
  }, {
    "name" : "PubsCollabInstitutions",
    "title" : "Publication Collaborative Institutions",
    "description" : "The Institutions from External Collaborations",
    "help" : "There are no other filters applied to the Publications than what are shown as parameters.",
    "className" : "hci.artadmin.controller.reports.ReportPubsCollabInstitutions",
    "fileName" : "pubsCollabInstitutions",
    "type" : "global",
    "tab" : "publication",
    "owners" : [ ],
    "params" : [ {
      "caption" : "Publication Year(s)",
      "name" : "pubYears",
      "type" : "input",
      "tooltip" : "Ranges and comma-separated are allowed. e.g. '2009,2014' '2009-2011,2014' ",
      "displayOrder" : 1,
      "options" : [ ]
    }, {
      "caption" : "Programs",
      "name" : "programChoice",
      "type" : "multiselect",
      "className" : "hci.artadmin.model.dict.Program",
      "dataXPath" : "@programCode",
      "valueXPath" : "@idProgram",
      "displayXPath" : "@programName",
      "displayOrder" : 2,
      "options" : [ ]
    }, {
      "caption" : "Institution Type",
      "name" : "instTypeChoice",
      "type" : "multiselect",
      "displayOrder" : 3,
      "options" : [ {
        "value" : "external",
        "display" : "External",
        "displayOrder" : 1
      }, {
        "value" : "nciCancer",
        "display" : "NCI Cancer Center",
        "displayOrder" : 2
      }, {
        "value" : "international",
        "display" : "International",
        "displayOrder" : 3
      }, {
        "value" : "academic",
        "display" : "Academic",
        "displayOrder" : 4
      }, {
        "value" : "industry",
        "display" : "Industry",
        "displayOrder" : 5
      }, {
        "value" : "other",
        "display" : "Other",
        "displayOrder" : 6
      } ]
    } ],
    "formats" : [ {
      "name" : "xls",
      "caption" : "XLS",
      "displayOrder" : 1
    }, {
      "name" : "html",
      "caption" : "HTML",
      "displayOrder" : 2
    } ],
    "datakey" : "PubsCollabInstitutions"
  }, {
    "name" : "PubsInterIntraBtwnProgs",
    "title" : "Inter Intra Between Programs",
    "description" : "Shows the Collaborations between the programs on the given years. (InPress excluded)",
    "help" : "<b>Pub filters:</b>      <br/> &nbsp;&nbsp; Cancer Related (without an Excluded reason on Pub)     <br/> &nbsp;&nbsp; Active Members (and those with a non-excludable reason)     <br/> &nbsp;&nbsp; 'In Press' Pubs Excluded     <br/> &nbsp;&nbsp; Articles and Allow-Inclusion Book Chapters/Reviews",
    "className" : "hci.artadmin.controller.reports.ReportPubsInterIntraBtwnProgs",
    "fileName" : "pubsInterIntraBtwnProgs",
    "type" : "global",
    "tab" : "publication",
    "owners" : [ ],
    "params" : [ {
      "caption" : "Publication Year(s)",
      "name" : "years",
      "type" : "input",
      "tooltip" : "Ranges and comma-separated are allowed. e.g. '2009,2014' '2009-2011,2014' ",
      "displayOrder" : 1,
      "options" : [ ]
    }, {
      "caption" : "Featured",
      "name" : "featureChoice",
      "type" : "select",
      "tooltip" : "Leave blank for 'Any'",
      "displayOrder" : 2,
      "options" : [ {
        "value" : "featured",
        "display" : "Featured",
        "displayOrder" : 1
      }, {
        "value" : "nonFeatured",
        "display" : "Non-Featured",
        "displayOrder" : 2
      }, {
        "value" : "any",
        "display" : "Any",
        "displayOrder" : 3
      } ]
    } ],
    "formats" : [ {
      "name" : "xls",
      "caption" : "XLS",
      "displayOrder" : 1
    }, {
      "name" : "html",
      "caption" : "HTML",
      "displayOrder" : 2
    }, {
      "name" : "doc",
      "caption" : "DOC",
      "displayOrder" : 3
    }, {
      "name" : "pdf",
      "caption" : "PDF",
      "displayOrder" : 4
    }, {
      "name" : "csv",
      "caption" : "CSV",
      "displayOrder" : 5
    } ],
    "datakey" : "PubsInterIntraBtwnProgs"
  }, {
    "name" : "ResearcherEmailDetails",
    "title" : "Researcher Email Details",
    "description" : "Response details for researchers in the most recent email set",
    "help" : "Finds most recent email set and returns a list of researchers that were sent emails, along with response details",
    "className" : "hci.artadmin.controller.reports.ReportGeneric_EXAMPLE",
    "fileName" : "ResearcherEmailDetails",
    "type" : "patient",
    "tab" : "researcher",
    "owners" : [ ],
    "params" : [ ],
    "formats" : [ {
      "name" : "xls",
      "caption" : "XLS",
      "displayOrder" : 1
    }, {
      "name" : "html",
      "caption" : "HTML",
      "displayOrder" : 2
    }, {
      "name" : "doc",
      "caption" : "DOC",
      "displayOrder" : 3
    }, {
      "name" : "pdf",
      "caption" : "PDF",
      "displayOrder" : 4
    }, {
      "name" : "csv",
      "caption" : "CSV",
      "displayOrder" : 5
    } ],
    "datakey" : "ResearcherEmailDetails"
  }, {
    "name" : "ResearcherEmailOverallStats",
    "title" : "Researcher Email Overall Stats",
    "description" : "Response statistics for researchers in the most recent email set",
    "help" : "Finds most recent email set and returns overall stats for researcher responses",
    "className" : "hci.artadmin.controller.reports.ReportGeneric_EXAMPLE",
    "fileName" : "ResearcherEmailOverallStats",
    "type" : "patient",
    "tab" : "researcher",
    "owners" : [ ],
    "params" : [ ],
    "formats" : [ {
      "name" : "xls",
      "caption" : "XLS",
      "displayOrder" : 1
    }, {
      "name" : "html",
      "caption" : "HTML",
      "displayOrder" : 2
    }, {
      "name" : "doc",
      "caption" : "DOC",
      "displayOrder" : 3
    }, {
      "name" : "pdf",
      "caption" : "PDF",
      "displayOrder" : 4
    }, {
      "name" : "csv",
      "caption" : "CSV",
      "displayOrder" : 5
    } ],
    "datakey" : "ResearcherEmailOverallStats"
  }, {
    "name" : "ResearcherEmailPercentages",
    "title" : "Researcher Email Percentages",
    "description" : "Response percentages for researchers in the most recent email set",
    "help" : "Finds most recent email set and returns a list of researchers that were sent emails, along with response percentages",
    "className" : "hci.artadmin.controller.reports.ReportGeneric_EXAMPLE",
    "fileName" : "ResearcherEmailPercentages",
    "type" : "patient",
    "tab" : "researcher",
    "owners" : [ ],
    "params" : [ ],
    "formats" : [ {
      "name" : "xls",
      "caption" : "XLS",
      "displayOrder" : 1
    }, {
      "name" : "html",
      "caption" : "HTML",
      "displayOrder" : 2
    }, {
      "name" : "doc",
      "caption" : "DOC",
      "displayOrder" : 3
    }, {
      "name" : "pdf",
      "caption" : "PDF",
      "displayOrder" : 4
    }, {
      "name" : "csv",
      "caption" : "CSV",
      "displayOrder" : 5
    } ],
    "datakey" : "ResearcherEmailPercentages"
  }, {
    "name" : "ResearcherQuickReport",
    "title" : "Researcher Quick Report",
    "description" : "Customizable Researcher Report",
    "className" : "CreateResearcherQuickReport",
    "fileName" : "researcherQuickReport",
    "type" : "global",
    "tab" : "researcher2",
    "owners" : [ ],
    "params" : [ ],
    "formats" : [ {
      "name" : "xls",
      "caption" : "XLS",
      "displayOrder" : 1
    }, {
      "name" : "html",
      "caption" : "HTML",
      "displayOrder" : 2
    }, {
      "name" : "doc",
      "caption" : "DOC",
      "displayOrder" : 3
    }, {
      "name" : "pdf",
      "caption" : "PDF",
      "displayOrder" : 4
    }, {
      "name" : "csv",
      "caption" : "CSV",
      "displayOrder" : 5
    } ],
    "datakey" : "ResearcherQuickReport"
  }, {
    "name" : "ResearcherReport",
    "title" : "Researcher Report",
    "description" : "A comprehensive report of Researchers",
    "className" : "hci.artadmin.controller.reports.ReportResearcher",
    "fileName" : "researcherReport",
    "type" : "global",
    "tab" : "researcher",
    "owners" : [ ],
    "params" : [ {
      "caption" : "Type",
      "name" : "memInvChoice",
      "type" : "select",
      "tooltip" : "'Any' to ignore both Type and Active",
      "displayOrder" : 1,
      "options" : [ {
        "value" : "Member",
        "display" : "CCSG Member",
        "displayOrder" : 1
      }, {
        "value" : "Investigator",
        "display" : "Investigator",
        "displayOrder" : 2
      }, {
        "value" : "Both",
        "display" : "Both",
        "displayOrder" : 3
      }, {
        "value" : "Either",
        "display" : "Either",
        "displayOrder" : 4
      }, {
        "value" : "Any",
        "display" : "Any",
        "displayOrder" : 5
      } ]
    }, {
      "caption" : "Active",
      "name" : "inactiveChoice",
      "type" : "select",
      "tooltip" : "Leave blank for Active only",
      "displayOrder" : 2,
      "options" : [ {
        "value" : "active",
        "display" : "Active",
        "displayOrder" : 1
      }, {
        "value" : "inactive",
        "display" : "Inactive",
        "displayOrder" : 2
      }, {
        "value" : "both",
        "display" : "Both",
        "displayOrder" : 3
      } ]
    }, {
      "caption" : "Group",
      "name" : "groupIdChoice",
      "type" : "multiselect",
      "className" : "hci.artadmin.model.dict.GroupDict",
      "valueXPath" : "@idGroup",
      "displayXPath" : "@codedDisplay",
      "displayOrder" : 3,
      "options" : [ ]
    }, {
      "caption" : "Featured",
      "name" : "featureChoice",
      "type" : "select",
      "tooltip" : "Leave blank for 'Any'",
      "displayOrder" : 4,
      "options" : [ {
        "value" : "featured",
        "display" : "Featured",
        "displayOrder" : 1
      }, {
        "value" : "nonFeatured",
        "display" : "Non-Featured",
        "displayOrder" : 2
      }, {
        "value" : "any",
        "display" : "Any",
        "displayOrder" : 3
      } ]
    } ],
    "formats" : [ {
      "name" : "xls",
      "caption" : "XLS",
      "displayOrder" : 1
    }, {
      "name" : "doc",
      "caption" : "DOC",
      "displayOrder" : 2
    }, {
      "name" : "html",
      "caption" : "HTML",
      "displayOrder" : 3
    }, {
      "name" : "pdf",
      "caption" : "PDF",
      "displayOrder" : 4
    }, {
      "name" : "csv",
      "caption" : "CSV",
      "displayOrder" : 5
    } ],
    "datakey" : "ResearcherReport"
  }, {
    "name" : "TraineeDetails",
    "title" : "Trainee Details",
    "description" : "List all Trainee data, according to chosen parameters",
    "help" : "",
    "className" : "hci.artadmin.controller.reports.ReportTraineeDetail",
    "fileName" : "traineeDetails",
    "type" : "patient",
    "tab" : "researcher",
    "owners" : [ ],
    "params" : [ {
      "caption" : "Trainee Active Range Start Date",
      "name" : "startDate",
      "type" : "date",
      "displayOrder" : 1,
      "options" : [ ]
    }, {
      "caption" : "Trainee Active Range End Date",
      "name" : "endDate",
      "type" : "date",
      "displayOrder" : 2,
      "options" : [ ]
    }, {
      "caption" : "Past Trainees",
      "name" : "pastChoice",
      "type" : "radio",
      "tooltip" : "Trainees who are 'Past', not 'Past' or all of the Trainees.",
      "displayOrder" : 3,
      "options" : [ {
        "value" : "current",
        "display" : "Active only",
        "displayOrder" : 1
      }, {
        "value" : "past",
        "display" : "Past only",
        "displayOrder" : 2
      }, {
        "value" : "all",
        "display" : "All",
        "displayOrder" : 3
      } ]
    }, {
      "caption" : "Mentor CCSG Member Activity Date",
      "name" : "activityDate",
      "type" : "date",
      "tooltip" : "Leave blank for all Mentors",
      "displayOrder" : 4,
      "options" : [ ]
    }, {
      "caption" : "Programs",
      "name" : "programChoice",
      "type" : "multiselect",
      "className" : "hci.artadmin.model.dict.Program",
      "dataXPath" : "@programCode",
      "valueXPath" : "@idProgram",
      "displayXPath" : "@programName",
      "displayOrder" : 5,
      "options" : [ ]
    }, {
      "caption" : "Featured",
      "name" : "featureChoice",
      "type" : "select",
      "tooltip" : "Leave blank for 'Any'",
      "displayOrder" : 6,
      "options" : [ {
        "value" : "featured",
        "display" : "Featured",
        "displayOrder" : 1
      }, {
        "value" : "nonFeatured",
        "display" : "Non-Featured",
        "displayOrder" : 2
      }, {
        "value" : "any",
        "display" : "Any",
        "displayOrder" : 3
      } ]
    } ],
    "formats" : [ {
      "name" : "xls",
      "caption" : "XLS",
      "displayOrder" : 1
    }, {
      "name" : "html",
      "caption" : "HTML",
      "displayOrder" : 2
    } ],
    "datakey" : "TraineeDetails"
  }, {
    "name" : "TraineeReport",
    "title" : "Trainee Summary",
    "description" : "Summary of the Trainee data",
    "className" : "hci.artadmin.controller.reports.ReportTrainee",
    "fileName" : "traineeReport",
    "type" : "patient",
    "tab" : "researcher",
    "owners" : [ ],
    "params" : [ {
      "caption" : "Trainee Active Range Start Date",
      "name" : "startDate",
      "type" : "date",
      "displayOrder" : 1,
      "options" : [ ]
    }, {
      "caption" : "Trainee Active Range End Date",
      "name" : "endDate",
      "type" : "date",
      "displayOrder" : 2,
      "options" : [ ]
    }, {
      "caption" : "Past Trainees",
      "name" : "pastChoice",
      "type" : "radio",
      "tooltip" : "Trainees who are 'Past', not 'Past' or all of the Trainees.",
      "displayOrder" : 3,
      "options" : [ {
        "value" : "current",
        "display" : "Active only",
        "displayOrder" : 1
      }, {
        "value" : "past",
        "display" : "Past only",
        "displayOrder" : 2
      }, {
        "value" : "all",
        "display" : "All",
        "displayOrder" : 3
      } ]
    }, {
      "caption" : "Mentor CCSG Member Activity Date",
      "name" : "activityDate",
      "type" : "date",
      "tooltip" : "Leave blank for all Mentors",
      "displayOrder" : 4,
      "options" : [ ]
    }, {
      "caption" : "Programs",
      "name" : "programChoice",
      "type" : "multiselect",
      "className" : "hci.artadmin.model.dict.Program",
      "dataXPath" : "@programCode",
      "valueXPath" : "@idProgram",
      "displayXPath" : "@programName",
      "displayOrder" : 5,
      "options" : [ ]
    }, {
      "caption" : "Featured",
      "name" : "featureChoice",
      "type" : "select",
      "tooltip" : "Leave blank for 'Any'",
      "displayOrder" : 6,
      "options" : [ {
        "value" : "featured",
        "display" : "Featured",
        "displayOrder" : 1
      }, {
        "value" : "nonFeatured",
        "display" : "Non-Featured",
        "displayOrder" : 2
      }, {
        "value" : "any",
        "display" : "Any",
        "displayOrder" : 3
      } ]
    } ],
    "formats" : [ {
      "name" : "xls",
      "caption" : "XLS",
      "displayOrder" : 1
    } ],
    "datakey" : "TraineeReport"
  } ],
  "reportTabs" : [ {
    "title" : "Patient Researcher Reports",
    "name" : "researchers",
    "type" : "patient",
    "tab" : "researcher",
    "datakey" : "researchers"
  }, {
    "title" : "Patient Grant Reports",
    "name" : "grants",
    "type" : "patient",
    "tab" : "grant",
    "datakey" : "grants"
  }, {
    "title" : "Patient Publication Reports",
    "name" : "publications",
    "type" : "patient",
    "tab" : "publication",
    "datakey" : "publications"
  }, {
    "title" : "Researcher Reports",
    "name" : "researchers2",
    "type" : "global",
    "tab" : "researcher",
    "datakey" : "researchers2"
  }, {
    "title" : "Grant Reports",
    "name" : "grants2",
    "type" : "global",
    "tab" : "grant",
    "datakey" : "grants2"
  }, {
    "title" : "Publication Reports",
    "name" : "publications2",
    "type" : "global",
    "tab" : "publication",
    "datakey" : "publications2"
  } ]
}