[
  {
    "idWidgetCategory": 1,
    "category": "Info",
    "icon": "assets/i1.svg"
  },
  {
    "idWidgetCategory": 2,
    "category": "Patients",
    "icon": "assets/i2.svg"
  },
  {
    "idWidgetCategory": 3,
    "category": "Reports",
    "icon": "assets/i3.svg"
  }
]
