<svg version="1.1" id="Layer_1" xmlns="http://www.w3.org/2000/svg" xmlns:xlink="http://www.w3.org/1999/xlink" x="0px" y="0px"
	 viewBox="0 0 512 512" style="enable-background:new 0 0 512 512;" xml:space="preserve">
<g>
	<path d="M512,175v19.5H264.2V175c0-10.8,8.8-19.5,19.5-19.5h208.7C503.2,155.5,512,164.2,512,175z M264.2,233.7H512v84.7
		c0,10.8-8.8,19.5-19.5,19.5H334.4c2.2,3.2,3.5,7,3.5,11.2v19.5H90.1v-19.5c0-10.8,8.8-19.5,19.5-19.5h158.1
		c-2.2-3.2-3.5-7-3.5-11.2V233.7z M342.4,307c0,2.7,2.2,4.9,4.9,4.9h55.4c2.7,0,4.9-2.2,4.9-4.9v-16.3c0-2.7-2.2-4.9-4.9-4.9h-55.4
		c-2.7,0-4.9,2.2-4.9,4.9V307z M290.3,307c0,2.7,2.2,4.9,4.9,4.9h29.3c2.7,0,4.9-2.2,4.9-4.9v-16.3c0-2.7-2.2-4.9-4.9-4.9h-29.3
		c-2.7,0-4.9,2.2-4.9,4.9V307z M90.1,407.7h247.8v84.7c0,10.8-8.8,19.5-19.5,19.5H109.7c-10.8,0-19.5-8.8-19.5-19.5V407.7z
		 M168.3,481c0,2.7,2.2,4.9,4.9,4.9h55.4c2.7,0,4.9-2.2,4.9-4.9v-16.3c0-2.7-2.2-4.9-4.9-4.9h-55.4c-2.7,0-4.9,2.2-4.9,4.9V481z
		 M116.2,481c0,2.7,2.2,4.9,4.9,4.9h29.3c2.7,0,4.9-2.2,4.9-4.9v-16.3c0-2.7-2.2-4.9-4.9-4.9h-29.3c-2.7,0-4.9,2.2-4.9,4.9V481z
		 M109.7,302.5c-25.7,0-46.5,20.9-46.5,46.5v55.5l-1.4,0.4c-10.4,2.8-21.1-3.4-23.9-13.8L0.7,252.7c-2.8-10.4,3.4-21.1,13.8-23.9
		l187.1-50.1l-26.8-100c-2.8-10.4,3.4-21.1,13.8-23.9l201.6-54c10.4-2.8,21.1,3.4,23.9,13.8l30.5,114H283.8
		c-25.7,0-46.5,20.9-46.5,46.5v127.5H109.7z M349,59.9l12.8,47.7l47.7-12.8l-12.8-47.7L349,59.9z M165.5,234.9l12.8,47.7l47.7-12.8
		l-12.8-47.7L165.5,234.9z"/>
</g>
</svg>
