<?xml version="1.0" encoding="utf-8"?>
<svg version="1.1" id="Layer_1" xmlns="http://www.w3.org/2000/svg" xmlns:xlink="http://www.w3.org/1999/xlink" x="0px" y="0px"
	 viewBox="0 0 512 512" style="enable-background:new 0 0 512 512;" xml:space="preserve">
<path d="M512,190v210c0,26.5-21.5,48-48,48H48c-26.5,0-48-21.5-48-48V112c0-26.5,21.5-48,48-48h34.7c26.5,0,48,21.5,48,48v30H464
	C490.5,142,512,163.5,512,190z M404,64h-34.7c-26.5,0-48,21.5-48,48H452C452,85.5,430.5,64,404,64z M243.3,64h-34.7
	c-26.5,0-48,21.5-48,48h130.7C291.3,85.5,269.8,64,243.3,64z"/>
</svg>
