<?xml version="1.0" encoding="utf-8"?>
<svg version="1.1" id="Layer_1" xmlns="http://www.w3.org/2000/svg" xmlns:xlink="http://www.w3.org/1999/xlink" x="0px" y="0px"
	 viewBox="0 0 512 512" style="enable-background:new 0 0 512 512;" xml:space="preserve">
<path d="M452,112H321.3c0-26.5,21.5-48,48-48H404C430.5,64,452,85.5,452,112z M243.3,64h-34.7c-26.5,0-48,21.5-48,48h130.7
	C291.3,85.5,269.8,64,243.3,64z M490,340.2h-42v-42c0-11.7-10.3-22-22-22s-22,10.3-22,22v42h-42c-11.7,0-22,10.3-22,22
	c0,12.5,9.5,22,22,22h42v42c0,11.5,8,20.5,19.1,21.8h5.8c11.1-1.3,19.1-10.3,19.1-21.8v-42h42c12.5,0,22-9.5,22-22
	C512,350.5,501.7,340.2,490,340.2z M464,142H130.7v-30c0-26.5-21.5-48-48-48H48C21.5,64,0,85.5,0,112v288c0,26.5,21.5,48,48,48
	h262.4c-17.8-24-28.4-53.7-28.4-85.8c0-79.5,64.5-144,144-144c32.2,0,62,10.6,86,28.5V190C512,163.5,490.5,142,464,142z"/>
</svg>
