<svg version="1.1" id="Layer_1" xmlns="http://www.w3.org/2000/svg" xmlns:xlink="http://www.w3.org/1999/xlink" x="0px" y="0px"
	 viewBox="0 0 512 512" style="enable-background:new 0 0 512 512;" xml:space="preserve">
<path d="M307.18,316.42l94.82-94.82c9.3-9.4,24.5-9.3,33.9,0c9.4,9.3,9.4,24.5,0,33.9L324.18,367.32c-9.3,9.4-24.5,9.4-33.9,0
	l-54.21-54.21c-9.4-9.3-9.3-24.5,0-33.9c9.3-9.4,24.5-9.4,33.9,0L307.18,316.42z M512,154.5V448c0,35.3-28.7,64-64,64H224
	c-29.78,0-54.86-20.42-61.98-48h-21.03c-29.77,0-54.85-20.42-61.97-48H64c-35.3,0-64-28.7-64-64V160c0-35.3,28.7-64,64-64h15.02
	c7.12-27.58,32.2-48,61.97-48h21.03c7.12-27.58,32.2-48,61.98-48h133.5c17,0,33.3,6.7,45.3,18.7l90.5,90.5
	C505.3,121.2,512,137.5,512,154.5z M64,368h13V144H64c-8.8,0-16,7.2-16,16v192C48,360.8,55.2,368,64,368z M140.99,416H160V96h-19.01
	c-8.8,0-16,7.2-16,16v288C125,408.8,132.2,416,140.99,416z M464,160h-80c-17.7,0-32-14.3-32-32V48H224c-8.8,0-16,7.2-16,16v384
	c0,8.8,7.2,16,16,16h224c8.8,0,16-7.2,16-16V160z"/>
</svg>
