<?xml version="1.0" encoding="utf-8"?>
<svg version="1.1" id="Layer_1" xmlns="http://www.w3.org/2000/svg" xmlns:xlink="http://www.w3.org/1999/xlink" x="0px" y="0px"
	 viewBox="0 0 512 512" style="enable-background:new 0 0 512 512;" xml:space="preserve">
<path d="M464,128H272l-64-64H48C21.5,64,0,85.5,0,112v288c0,26.5,21.5,48,48,48h416c26.5,0,48-21.5,48-48V176
	C512,149.5,490.5,128,464,128z M372.7,417.3h-78.2c-3.9,0-7.1-3.2-7.1-7.1c0-3.9,3.2-7.1,7.1-7.1c7.3,0,13.3-6,13.3-13.4
	c0-1.6-0.3-3.3-0.9-4.8c-0.6-1.5-21.1-54.2-27.3-70.1h-55l-23,70.8c-0.4,1.3-0.7,2.7-0.7,4.1c0,7.5,5.7,13.4,13.1,13.4h0.1
	c3.9,0,7.1,3.2,7.1,7.1c0,4-3.1,7.1-7.2,7.1l-74.7-0.2c-3.9,0-7.1-3.2-7.1-7.1c0-3.9,3.2-7.1,7.1-7.1c16.8,0,29.7-8.7,34.5-23.2
	c4.9-14.9,60.4-185.9,60.4-185.9c0.8-2.4,2.7-4.2,5.2-4.7c8.2-1.9,14.7-8.3,16.5-16.3c0.7-3,3.3-5.3,6.4-5.5c3.1-0.2,6,1.6,7.1,4.5
	c0,0,78.2,200.8,81.7,209.8c6,15.4,11.4,20.7,22.1,21.6c3.8,0.3,6.6,3.5,6.5,7.3C379.6,414.3,376.5,417.3,372.7,417.3z M249.6,238
	l19,48.8h-34.8L249.6,238z"/>
</svg>
