<svg version="1.1" id="Layer_1" xmlns="http://www.w3.org/2000/svg" xmlns:xlink="http://www.w3.org/1999/xlink" x="0px" y="0px"
	 viewBox="0 0 512 512" style="enable-background:new 0 0 512 512;" xml:space="preserve">
<path d="M157.87,278.32c0.75,3.65,0.99,7.05,1.01,9.89c0.03,6.52-1.05,11.24-2.86,14.58c-1.81,3.34-4.33,5.31-7.19,6.35
	c-2.86,1.03-6.05,1.13-9.18,0.72c-3.13-0.41-6.2-1.32-8.82-2.31l-21.65-8.14c-0.49-0.18-0.95-0.49-1.38-0.89
	c-0.42-0.4-0.81-0.88-1.13-1.43c-0.32-0.55-0.58-1.15-0.77-1.78c-0.18-0.63-0.29-1.28-0.29-1.93l-0.39-50.59
	c0-0.65,0.09-1.24,0.26-1.74c0.18-0.5,0.43-0.91,0.75-1.22c0.32-0.31,0.7-0.51,1.12-0.6c0.42-0.08,0.89-0.04,1.38,0.14l21.72,8.01
	c6.13,2.26,10.98,5.23,14.79,8.6c3.82,3.37,6.6,7.13,8.62,10.96C155.88,270.76,157.12,274.67,157.87,278.32z M512,132.65v246.7
	c0,27-17,51.2-42.5,60.3l-192,68.6c-13.9,5-29.1,5-43.1,0l-192-68.6C17,430.55,0,406.45,0,379.35v-246.7c0-27,17-51.2,42.5-60.3
	l192-68.6c13.9-5,29.1-5,43.1,0l192,68.6C495,81.45,512,105.55,512,132.65z M211.6,307.84c-0.03-14.5-1.92-28.17-5.56-40.8
	c-3.64-12.64-9.01-24.23-16-34.58c-6.98-10.35-15.57-19.45-25.63-27.12c-10.04-7.66-21.53-13.89-34.35-18.52l-71.6-25.86
	c-0.97-0.35-1.89-0.42-2.72-0.24c-0.83,0.18-1.58,0.6-2.21,1.23c-0.62,0.63-1.13,1.46-1.47,2.47c-0.34,1-0.52,2.18-0.51,3.48
	l2.5,241.09c0.01,1.27,0.22,2.57,0.58,3.81c0.36,1.24,0.88,2.44,1.51,3.52c0.63,1.08,1.39,2.05,2.22,2.84
	c0.83,0.79,1.74,1.41,2.7,1.79l38.66,15.21c0.97,0.38,1.88,0.48,2.72,0.34c0.83-0.14,1.58-0.52,2.21-1.11
	c0.63-0.59,1.13-1.39,1.48-2.36c0.35-0.97,0.53-2.12,0.52-3.4l-0.51-67.23c0-0.64,0.09-1.22,0.26-1.71c0.17-0.49,0.43-0.89,0.74-1.2
	c0.32-0.3,0.69-0.5,1.11-0.57c0.42-0.08,0.88-0.03,1.37,0.16l21.59,8.28c6.36,2.44,12.38,4.25,18.06,5.43
	c5.68,1.18,11.02,1.73,16,1.64c4.98-0.09,9.61-0.81,13.86-2.18c4.26-1.37,8.15-3.37,11.65-6.02c3.41-2.57,6.42-5.76,9.01-9.53
	c2.6-3.77,4.78-8.13,6.53-13.04c1.76-4.91,3.08-10.37,3.97-16.35C211.17,321.32,211.61,314.82,211.6,307.84z M429.7,126.05
	l-173.7-62l-173.7,62l173.7,62L429.7,126.05z M448,187.55l-160,57.1v191.9l160-57.1V187.55z"/>
</svg>
