<?xml version="1.0" encoding="utf-8"?>
<svg version="1.1" id="Layer_1" xmlns="http://www.w3.org/2000/svg" xmlns:xlink="http://www.w3.org/1999/xlink" x="0px" y="0px"
	 viewBox="0 0 512 512" style="enable-background:new 0 0 512 512;" xml:space="preserve">
<path d="M288,136V0H88C74.7,0,64,10.7,64,24v464c0,13.3,10.7,24,24,24h336c13.3,0,24-10.7,24-24V160H312
	C298.8,160,288,149.2,288,136z M189.4,386.5c4,3.4,4.5,9.3,1.2,13.4l-8.1,9.7c-3.4,4-9.3,4.6-13.4,1.2c0,0-80.6-67.4-86.7-72.5
	c-4.5-3.8-4.5-10.8,0-14.6c6.3-5.2,86.7-72.5,86.7-72.5c4-3.4,10-2.8,13.4,1.2l8.1,9.7c3.4,4,2.8,10-1.2,13.4L123.3,331L189.4,386.5
	z M245.5,486c0,3.3-2.7,6-6,6h-20c-3.3,0-6-2.7-6-6v-20c0-3.3,2.7-6,6-6h20c3.3,0,6,2.7,6,6V486z M297.5,486c0,3.3-2.7,6-6,6h-20
	c-3.3,0-6-2.7-6-6v-20c0-3.3,2.7-6,6-6h20c3.3,0,6,2.7,6,6V486z M245.5,330c0,3.3-2.7,6-6,6h-20c-3.3,0-6-2.7-6-6v-20
	c0-3.3,2.7-6,6-6h20c3.3,0,6,2.7,6,6V330z M245.5,226c0,3.3-2.7,6-6,6h-20c-3.3,0-6-2.7-6-6v-20c0-3.3,2.7-6,6-6h20c3.3,0,6,2.7,6,6
	V226z M245.5,174c0,3.3-2.7,6-6,6h-20c-3.3,0-6-2.7-6-6v-20c0-3.3,2.7-6,6-6h20c3.3,0,6,2.7,6,6V174z M297.5,434c0,3.3-2.7,6-6,6
	h-20c-3.3,0-6-2.7-6-6v-20c0-3.3,2.7-6,6-6h20c3.3,0,6,2.7,6,6V434z M297.5,382c0,3.3-2.7,6-6,6h-20c-3.3,0-6-2.7-6-6v-20
	c0-3.3,2.7-6,6-6h20c3.3,0,6,2.7,6,6V382z M245.5,382c0,3.3-2.7,6-6,6h-20c-3.3,0-6-2.7-6-6v-20c0-3.3,2.7-6,6-6h20c3.3,0,6,2.7,6,6
	V382z M297.5,278c0,3.3-2.7,6-6,6h-20c-3.3,0-6-2.7-6-6v-20c0-3.3,2.7-6,6-6h20c3.3,0,6,2.7,6,6V278z M297.5,226c0,3.3-2.7,6-6,6
	h-20c-3.3,0-6-2.7-6-6v-20c0-3.3,2.7-6,6-6h20c3.3,0,6,2.7,6,6V226z M321.4,262.1l8.1-9.7c3.4-4,9.3-4.6,13.4-1.2
	c0,0,80.5,67.3,86.7,72.5c4.5,3.8,4.5,10.8,0,14.6c-6.1,5.1-86.7,72.5-86.7,72.5c-4,3.4-10,2.8-13.4-1.2l-8.1-9.7
	c-3.4-4-2.8-10,1.2-13.4l66.2-55.5l-66.2-55.5C318.5,272.1,318,266.1,321.4,262.1z M448,121.9v6.1H320V0h6.1c6.4,0,12.5,2.5,17,7
	L441,105C445.3,109.3,448,115.3,448,121.9z"/>
</svg>
