<svg version="1.1" id="Layer_1" xmlns="http://www.w3.org/2000/svg" xmlns:xlink="http://www.w3.org/1999/xlink" x="0px" y="0px"
	 viewBox="0 0 512 512" style="enable-background:new 0 0 512 512;" xml:space="preserve">
<path d="M256,0L34.3,128v256L256,512l221.7-128V128L256,0z M385.57,272.61l-5.65-5.4c-2.15-2-5.52-1.89-7.53,0.24
	c-2.07,2.09-2.07,5.45,0,7.53l13.18,12.5v14.6l-27.21-1.28c-2.97-0.15-5.5,2.14-5.65,5.11v0.01c-0.22,2.95,1.99,5.52,4.93,5.76
	l27.91,1.3v16.12l-29.68,11.71c-2.9,1.16-4.31,4.44-3.15,7.34c0,0.01,0.01,0.02,0.01,0.02c1.03,2.95,4.25,4.5,7.2,3.47
	c0,0,0.01,0,0.02-0.01l25.59-10.26l0.04,0.07v17.08l-30.32,30.13c-43.09-85.38,6.44-120.88,30.32-155.87v39.83L385.57,272.61
	L385.57,272.61z M414.41,214.63H395c3.77-12,2.67-24.88-7.82-40.41c28.87,72.18-120.71,69.89-55.97,237.83l-3.39,3.96H184.2
	l-57.66-57.46v-144H97.59v-86.53H241.6v86.63h-28.89v114.74h86.63V214.55h-28.89v-86.53h92.84c-30.32,22.6-48.83,81.13-22.26,122.13
	c0.37-0.35,0.77-0.77,1.15-1.14l-1.13,1.09c4.34-4.12,9.4-9.94,15.35-14.72c-2.74-4.59-4.87-9.52-6.35-14.66l31.13-12.05
	c1.82-0.69,2.75-2.71,2.07-4.54c-0.69-1.82-2.71-2.75-4.54-2.07l-30.3,11.73c-1.33-7.33-1.71-14.81-1.15-22.24l30.49-0.94
	c1.92-0.03,3.45-1.61,3.43-3.52c-0.07-1.92-1.68-3.42-3.6-3.35l-29.6,0.9c0.9-6.65,2.42-13.2,4.54-19.57l21.02,6.89
	c1.76,0.65,3.72-0.25,4.37-2.02c0.59-1.78-0.37-3.69-2.15-4.29l-20.92-6.87c2.06-5.05,4.56-9.9,7.46-14.52l7.78,8.3
	c1.18,1.37,3.25,1.53,4.63,0.36c1.32-1.24,1.39-3.32,0.15-4.65l-8.83-9.41c3.02-4.09,6.6-7.74,10.62-10.85h37.76L414.41,214.63
	L414.41,214.63z"/>
</svg>
