<?xml version="1.0" encoding="utf-8"?>
<svg version="1.1" id="Layer_1" xmlns="http://www.w3.org/2000/svg" xmlns:xlink="http://www.w3.org/1999/xlink" x="0px" y="0px"
	 viewBox="0 0 512 512" style="enable-background:new 0 0 512 512;" xml:space="preserve">
<path d="M376.5,223.9c-74.9,0-135.5,60.6-135.5,135.5s60.6,135.5,135.5,135.5S512,434.3,512,359.4S451.4,223.9,376.5,223.9z
	 M483.9,371.2c0,9.4-7.7,17.1-17.1,17.1H364.7c-9.4,0-17.1-7.7-17.1-17.1V250.5c0-9.4,7.7-17.1,17.1-17.1h17.4
	c9.4,0,17.1,7.7,17.1,17.1v86.2h67.6c9.4,0,17.1,7.7,17.1,17.1L483.9,371.2L483.9,371.2z M421.6,147.2H0v-28.8
	c0-24.9,20.2-45.2,45.2-45.2h45.2V28.1c0-8.3,6.8-15.1,15.1-15.1h30.1c8.3,0,15.1,6.8,15.1,15.1v45.2h120.5V28.1
	c0-8.3,6.8-15.1,15.1-15.1h30.1c8.3,0,15.1,6.8,15.1,15.1v45.2h45.2c24.9,0,45.2,20.2,45.2,45.2v28.7H421.6z M238.5,494.9H45.2
	c-25,0-45.2-20.2-45.2-45.1V205.1h259.9c-7.1,5.4-13.8,11.2-20.2,17.6c-17.7,17.7-31.7,38.4-41.4,61.5
	c-10.1,23.9-15.2,49.2-15.2,75.3c0,26.1,5.1,51.4,15.2,75.3C207.8,457.2,221.4,477.5,238.5,494.9z"/>
</svg>
