{
  "$schema": "../../node_modules/ng-packagr/ng-package.schema.json",
  "dest": "../../dist/input",
  "lib": {
    "entryFile": "./src/index.ts"
  },
  "whitelistedNonPeerDependencies": [
    "."
  ]
}
