<?xml version="1.0" encoding="utf-8"?>
<svg version="1.1" id="Layer_1" xmlns="http://www.w3.org/2000/svg" xmlns:xlink="http://www.w3.org/1999/xlink" x="0px" y="0px"
	 viewBox="0 0 512 512" style="enable-background:new 0 0 512 512;" xml:space="preserve">
<path d="M198.1,186c39.4,0,70.9,30.3,70.9,68.4c0,38.5-30.5,69.5-70.9,69.5c-39.4,0-70.2-30.1-70.2-69.5
	C127.9,217,159.1,186,198.1,186z M198.1,300.5c24.5,0,44.3-21.9,44.3-46c0-25.2-20.7-45-44.3-45c-23.8,0-43.8,20.3-43.8,45
	C154.4,280.3,173.8,300.5,198.1,300.5z M389,320.9h-31.7l-35.7-53h-3.3v53h-25.7V189h38.3c31.7,0,46.7,16.1,46.7,39
	c0,20.8-10,33.3-30.1,37.3L389,320.9z M318.3,249.7h7.5c16.8,0,25.2-6.7,25.2-20.1c0-13.1-8.2-19.8-24.9-19.8h-7.9V249.7z"/>
</svg>
