<?xml version="1.0" encoding="utf-8"?>
<svg version="1.1" id="Layer_1" xmlns="http://www.w3.org/2000/svg" xmlns:xlink="http://www.w3.org/1999/xlink" x="0px" y="0px"
	 viewBox="0 0 512 512" style="enable-background:new 0 0 512 512;" xml:space="preserve">
<style type="text/css">
	.st0{fill:#244B87;}
	.st1{opacity:0.95;fill:#244B87;}
	.st2{opacity:0.9;fill:#244B87;}
	.st3{opacity:0.85;fill:#244B87;}
	.st4{opacity:0.8;fill:#244B87;}
	.st5{opacity:0.75;fill:#244B87;}
	.st6{opacity:0.7;fill:#244B87;}
	.st7{opacity:0.65;fill:#244B87;}
	.st8{opacity:0.6;fill:#244B87;}
	.st9{opacity:0.55;fill:#244B87;}
	.st10{opacity:0.5;fill:#244B87;}
	.st11{opacity:0.45;fill:#244B87;}
	.st12{opacity:0.43;fill:#244B87;}
	.st13{opacity:0.4;fill:#244B87;}
	.st14{opacity:0.38;fill:#244B87;}
	.st15{opacity:0.35;fill:#244B87;}
	.st16{opacity:0.33;fill:#244B87;}
	.st17{opacity:0.3;fill:#244B87;}
	.st18{opacity:0.25;fill:#244B87;}
	.st19{opacity:0.23;fill:#244B87;}
	.st20{opacity:0.2;fill:#244B87;}
	.st21{opacity:0.19;fill:#244B87;}
	.st22{opacity:0.17;fill:#244B87;}
	.st23{opacity:0.15;fill:#244B87;}
	.st24{opacity:0.13;fill:#244B87;}
	.st25{opacity:0.11;fill:#244B87;}
	.st26{opacity:9.000000e-02;fill:#244B87;}
	.st27{opacity:8.000000e-02;fill:#244B87;}
	.st28{opacity:6.000000e-02;fill:#244B87;}
	.st29{opacity:5.000000e-02;fill:#244B87;}
	.st30{opacity:3.000000e-02;fill:#244B87;}
	.st31{opacity:1.000000e-02;fill:#244B87;}
	.st32{opacity:0;fill:#244B87;}
</style>
<path class="st0" d="M277.2,175.1c0-2.2,0.9-3.9,2.4-3.9c1.5,0,2.4,1.7,2.4,3.9c0,2.2-0.9,3.9-2.4,3.9
	C278.1,179,277.2,177.3,277.2,175.1z M254.8,202.5c0,2.2,0.9,3.9,2.4,3.9s2.4-1.7,2.4-3.9c0-2.2-0.9-3.9-2.4-3.9
	S254.8,200.3,254.8,202.5z M287.8,192.7c1.5,0,2.4-1.7,2.4-3.9c0-2.2-0.9-3.9-2.4-3.9c-1.5,0-2.4,1.7-2.4,3.9
	C285.4,191,286.3,192.7,287.8,192.7z M293.1,179c1.5,0,2.4-1.7,2.4-3.9c0-2.2-0.9-3.9-2.4-3.9c-1.5,0-2.4,1.7-2.4,3.9
	C290.7,177.3,291.6,179,293.1,179z M277.4,220.1c1.5,0,2.4-1.7,2.4-3.9c0-2.2-0.9-3.9-2.4-3.9c-1.5,0-2.4,1.7-2.4,3.9
	C275,218.4,275.9,220.1,277.4,220.1z M271.6,171.1c-1.5,0-2.4,1.7-2.4,3.9c0,2.2,0.9,3.9,2.4,3.9c1.5,0,2.4-1.7,2.4-3.9
	C274,172.9,273.1,171.1,271.6,171.1z M246.9,198.6c-1.5,0-2.4,1.7-2.4,3.9c0,2.2,0.9,3.9,2.4,3.9c1.5,0,2.4-1.7,2.4-3.9
	C249.3,200.3,248.4,198.6,246.9,198.6z M249.9,192.7c1.5,0,2.4-1.7,2.4-3.9c0-2.2-0.9-3.9-2.4-3.9s-2.4,1.7-2.4,3.9
	C247.5,191,248.4,192.7,249.9,192.7z M252.9,212.3c-1.5,0-2.4,1.7-2.4,3.9c0,2.2,0.9,3.9,2.4,3.9c1.5,0,2.4-1.7,2.4-3.9
	C255.3,214,254.4,212.3,252.9,212.3z M268.9,184.8c-1.5,0-2.4,1.7-2.4,3.9c0,2.2,0.9,3.9,2.4,3.9s2.4-1.7,2.4-3.9
	C271.3,186.6,270.4,184.8,268.9,184.8z M194.4,206.4c1.5,0,2.4-1.7,2.4-3.9c0-2.2-0.9-3.9-2.4-3.9c-1.5,0-2.4,1.7-2.4,3.9
	C192,204.7,192.9,206.4,194.4,206.4z M208.3,220.1c1.5,0,2.4-1.7,2.4-3.9c0-2.2-0.9-3.9-2.4-3.9c-1.5,0-2.4,1.7-2.4,3.9
	C205.8,218.4,206.8,220.1,208.3,220.1z M209.3,192.7c1.5,0,2.4-1.7,2.4-3.9c0-2.2-0.9-3.9-2.4-3.9c-1.5,0-2.4,1.7-2.4,3.9
	C206.9,191,207.8,192.7,209.3,192.7z M213.7,239.7c-1.5,0-2.4,1.7-2.4,3.9c0,2.2,0.9,3.9,2.4,3.9c1.5,0,2.4-1.7,2.4-3.9
	C216.1,241.4,215.2,239.7,213.7,239.7z M217.3,192.7c1.5,0,2.4-1.7,2.4-3.9c0-2.2-0.9-3.9-2.4-3.9c-1.5,0-2.4,1.7-2.4,3.9
	C214.9,191,215.8,192.7,217.3,192.7z M304.5,233.8c1.5,0,2.4-1.7,2.4-3.9c0-2.2-0.9-3.9-2.4-3.9c-1.5,0-2.4,1.7-2.4,3.9
	C302.1,232.1,303,233.8,304.5,233.8z M186.8,167.4h36.8v111.2h-36.8V167.4z M196.8,239.1l-2.1,0.5v0.7l1.4-0.4v8.2h0.7V239.1z
	 M193.9,253.6v8.2h0.7v-9l-2.1,0.5v0.7L193.9,253.6z M196.2,229.9c0-2.6-1.2-4.6-3.1-4.6c-1.9,0-3.1,2-3.1,4.6s1.2,4.6,3.1,4.6
	C195,234.5,196.2,232.5,196.2,229.9z M196.8,211.6l-2.1,0.5v0.7l1.4-0.4v8.2h0.7V211.6z M199.3,266.5l-2.1,0.5v0.7l1.4-0.4v8.1h0.7
	V266.5z M202.2,239.1l-2.1,0.5v0.7l1.4-0.4v8.2h0.7V239.1z M202.2,211.6l-2.1,0.5v0.7l1.4-0.4v8.2h0.7V211.6z M204.8,266.5l-2.1,0.5
	v0.7l1.4-0.4v8.1h0.7V266.5z M206.1,261.9c1.9,0,3.1-2,3.1-4.6c0-2.6-1.2-4.6-3.1-4.6c-1.9,0-3.1,2-3.1,4.6
	C203,260,204.2,261.9,206.1,261.9z M207,239.9v8.2h0.7v-9l-2.1,0.5v0.7L207,239.9z M212.1,198.8v8.2h0.7v-9l-2.1,0.5v0.7
	L212.1,198.8z M212.1,225.3c-1.9,0-3.1,2-3.1,4.6s1.2,4.6,3.1,4.6c1.9,0,3.1-2,3.1-4.6S213.9,225.3,212.1,225.3z M218.8,226.2v8.2
	h0.7v-9l-2.1,0.5v0.7L218.8,226.2z M219.4,216.2c0-2.6-1.2-4.6-3.1-4.6c-1.9,0-3.1,2-3.1,4.6c0,2.6,1.2,4.6,3.1,4.6
	C218.2,220.8,219.4,218.8,219.4,216.2z M213.9,271.1c0-2.6-1.2-4.6-3.1-4.6s-3.1,2-3.1,4.6c0,2.1,0.8,3.8,2.1,4.4h1.9
	C213.1,274.9,213.9,273.2,213.9,271.1z M212.9,253.6v8.2h0.7v-9l-2.1,0.5v0.7L212.9,253.6z M216.8,243.6c0-2.6-1.2-4.6-3.1-4.6
	c-1.9,0-3.1,2-3.1,4.6s1.2,4.6,3.1,4.6C215.6,248.2,216.8,246.2,216.8,243.6z M220.4,267.1c-0.5-0.4-1-0.6-1.6-0.6
	c-1.9,0-3.1,2-3.1,4.6c0,2.1,0.8,3.8,2.1,4.4h1.9c0.2-0.1,0.5-0.2,0.7-0.4v-1c-0.4,0.6-1,0.9-1.6,0.9c-1.5,0-2.4-1.7-2.4-3.9
	s0.9-3.9,2.4-3.9c0.7,0,1.2,0.3,1.6,0.9V267.1z M220.4,252.9c-0.3-0.1-0.6-0.2-0.9-0.2c-1.9,0-3.1,2-3.1,4.6c0,2.6,1.2,4.6,3.1,4.6
	c0.3,0,0.6-0.1,0.9-0.2v-0.7c-0.3,0.1-0.5,0.2-0.9,0.2c-1.5,0-2.4-1.7-2.4-3.9c0-2.2,0.9-3.9,2.4-3.9c0.3,0,0.6,0.1,0.9,0.2V252.9z
	 M220.4,239.4c-1.1,0.7-1.8,2.3-1.8,4.2s0.7,3.5,1.8,4.2V247c-0.7-0.7-1.1-1.9-1.1-3.4s0.4-2.7,1.1-3.4V239.4z M220.4,198.5
	c-0.5-0.4-1-0.6-1.6-0.6c-1.9,0-3.1,2-3.1,4.6s1.2,4.6,3.1,4.6c0.6,0,1.2-0.2,1.6-0.6v-1c-0.4,0.6-1,0.9-1.6,0.9
	c-1.5,0-2.4-1.7-2.4-3.9c0-2.2,0.9-3.9,2.4-3.9c0.7,0,1.2,0.3,1.6,0.9V198.5z M218.6,175.1c0,1.9,0.7,3.5,1.8,4.2v-0.8
	c-0.7-0.7-1.1-1.9-1.1-3.4s0.4-2.7,1.1-3.4v-0.8C219.3,171.5,218.6,173.1,218.6,175.1z M217.3,184.2c-1.9,0-3.1,2-3.1,4.6
	c0,2.6,1.2,4.6,3.1,4.6c1.9,0,3.1-2,3.1-4.6C220.4,186.2,219.2,184.2,217.3,184.2z M210.6,175.1c0,2.6,1.2,4.6,3.1,4.6
	c1.9,0,3.1-2,3.1-4.6c0-2.2-0.9-4-2.3-4.4h-1.6C211.5,171.1,210.6,172.8,210.6,175.1z M209.3,184.2c-1.9,0-3.1,2-3.1,4.6
	c0,2.6,1.2,4.6,3.1,4.6c1.9,0,3.1-2,3.1-4.6C212.4,186.2,211.2,184.2,209.3,184.2z M205.7,171.7l1.4-0.4v8.2h0.7v-8.9h-0.4l-1.6,0.4
	V171.7z M205.3,199.2l1.4-0.4v8.2h0.7v-9l-2.1,0.5V199.2z M205.1,216.2c0,2.6,1.2,4.6,3.1,4.6c1.9,0,3.1-2,3.1-4.6
	c0-2.6-1.2-4.6-3.1-4.6C206.4,211.6,205.1,213.6,205.1,216.2z M204,226.6l1.4-0.4v8.2h0.7v-9l-2.1,0.5V226.6z M203.3,184.2l-2.1,0.5
	v0.7l1.4-0.4v8.2h0.7V184.2z M200.2,171.7l1.4-0.4v8.2h0.7v-8.9h-0.4l-1.6,0.4V171.7z M199.8,199.2l1.4-0.4v8.2h0.7v-9l-2.1,0.5
	V199.2z M198.5,226.6l1.4-0.4v8.2h0.7v-9l-2.1,0.5V226.6z M198,254l1.4-0.4v8.2h0.7v-9l-2.1,0.5V254z M197.8,184.2l-2.1,0.5v0.7
	l1.4-0.4v8.2h0.7V184.2z M194.7,171.7l1.4-0.4v8.2h0.7v-8.9h-0.4l-1.6,0.4V171.7z M191.3,202.5c0,2.6,1.2,4.6,3.1,4.6
	c1.9,0,3.1-2,3.1-4.6s-1.2-4.6-3.1-4.6C192.5,197.9,191.3,199.9,191.3,202.5z M191.7,185.1v8.2h0.7v-9l-2.1,0.5v0.7L191.7,185.1z
	 M190,179.5c1.5-0.4,2.4-2.2,2.4-4.5c0-2.2-0.9-4-2.3-4.4H190v0.7c1.1,0.4,1.7,1.9,1.7,3.8s-0.6,3.3-1.7,3.8V179.5z M190,220.7
	c1.5-0.4,2.4-2.2,2.4-4.5c0-2.3-0.9-4.1-2.4-4.5v0.7c1.1,0.4,1.7,1.9,1.7,3.8c0,1.8-0.6,3.3-1.7,3.8V220.7z M190,248.1
	c1.5-0.4,2.4-2.2,2.4-4.5s-0.9-4.1-2.4-4.5v0.7c1.1,0.4,1.7,1.9,1.7,3.8s-0.6,3.3-1.7,3.8V248.1z M190,274.8
	c0.3,0.3,0.6,0.5,0.9,0.6h1.9c1.3-0.6,2.1-2.3,2.1-4.4c0-2.6-1.2-4.6-3.1-4.6c-0.7,0-1.4,0.3-1.9,0.8v1.1c0.4-0.8,1-1.3,1.9-1.3
	c1.5,0,2.4,1.7,2.4,3.9s-0.9,3.9-2.4,3.9c-0.8,0-1.4-0.5-1.9-1.3V274.8z M291.2,247.6c1.5,0,2.4-1.7,2.4-3.9c0-2.2-0.9-3.9-2.4-3.9
	c-1.5,0-2.4,1.7-2.4,3.9C288.8,245.8,289.7,247.6,291.2,247.6z M285.5,226c-1.5,0-2.4,1.7-2.4,3.9c0,2.2,0.9,3.9,2.4,3.9
	c1.5,0,2.4-1.7,2.4-3.9C287.9,227.7,287,226,285.5,226z M303.6,192.7c1.5,0,2.4-1.7,2.4-3.9c0-2.2-0.9-3.9-2.4-3.9
	c-1.5,0-2.4,1.7-2.4,3.9C301.2,191,302.1,192.7,303.6,192.7z M213.7,179c1.5,0,2.4-1.7,2.4-3.9c0-2.2-0.9-3.9-2.4-3.9
	c-1.5,0-2.4,1.7-2.4,3.9C211.3,177.3,212.2,179,213.7,179z M407.8,233.8c1.5,0,2.4-1.7,2.4-3.9c0-2.2-0.9-3.9-2.4-3.9
	c-1.5,0-2.4,1.7-2.4,3.9C405.4,232.1,406.3,233.8,407.8,233.8z M406,220.1c1.5,0,2.4-1.7,2.4-3.9c0-2.2-0.9-3.9-2.4-3.9
	s-2.4,1.7-2.4,3.9C403.6,218.4,404.5,220.1,406,220.1z M406.9,206.4c1.5,0,2.4-1.7,2.4-3.9c0-2.2-0.9-3.9-2.4-3.9
	c-1.5,0-2.4,1.7-2.4,3.9C404.5,204.7,405.4,206.4,406.9,206.4z M412.6,192.7c1.5,0,2.4-1.7,2.4-3.9c0-2.2-0.9-3.9-2.4-3.9
	c-1.5,0-2.4,1.7-2.4,3.9C410.2,191,411.1,192.7,412.6,192.7z M402.2,188.8c0,2.2,0.9,3.9,2.4,3.9s2.4-1.7,2.4-3.9
	c0-2.2-0.9-3.9-2.4-3.9S402.2,186.6,402.2,188.8z M393.8,179c1.5,0,2.4-1.7,2.4-3.9c0-2.2-0.9-3.9-2.4-3.9s-2.4,1.7-2.4,3.9
	C391.4,177.3,392.3,179,393.8,179z M414.9,198.6c-1.5,0-2.4,1.7-2.4,3.9c0,2.2,0.9,3.9,2.4,3.9c1.5,0,2.4-1.7,2.4-3.9
	C417.4,200.3,416.4,198.6,414.9,198.6z M391.1,192.7c1.5,0,2.4-1.7,2.4-3.9c0-2.2-0.9-3.9-2.4-3.9c-1.5,0-2.4,1.7-2.4,3.9
	C388.7,191,389.6,192.7,391.1,192.7z M277.5,226c-1.5,0-2.4,1.7-2.4,3.9c0,2.2,0.9,3.9,2.4,3.9c1.5,0,2.4-1.7,2.4-3.9
	C279.9,227.7,279,226,277.5,226z M399.8,233.8c1.5,0,2.4-1.7,2.4-3.9c0-2.2-0.9-3.9-2.4-3.9c-1.5,0-2.4,1.7-2.4,3.9
	C397.4,232.1,398.3,233.8,399.8,233.8z M369.4,179c1.5,0,2.4-1.7,2.4-3.9c0-2.2-0.9-3.9-2.4-3.9c-1.5,0-2.4,1.7-2.4,3.9
	C367,177.3,367.9,179,369.4,179z M264.6,253.4c-1.5,0-2.4,1.7-2.4,3.9c0,2.2,0.9,3.9,2.4,3.9c1.5,0,2.4-1.7,2.4-3.9
	C267.1,255.1,266.2,253.4,264.6,253.4z M258.7,267.1c-1.5,0-2.4,1.7-2.4,3.9s0.9,3.9,2.4,3.9c1.5,0,2.4-1.7,2.4-3.9
	S260.2,267.1,258.7,267.1z M240.2,253.4c-1.5,0-2.4,1.7-2.4,3.9c0,2.2,0.9,3.9,2.4,3.9c1.5,0,2.4-1.7,2.4-3.9
	C242.6,255.1,241.7,253.4,240.2,253.4z M291.1,267.1c-1.5,0-2.4,1.7-2.4,3.9s0.9,3.9,2.4,3.9c1.5,0,2.4-1.7,2.4-3.9
	S292.6,267.1,291.1,267.1z M310.2,239.7c-1.5,0-2.4,1.7-2.4,3.9c0,2.2,0.9,3.9,2.4,3.9c1.5,0,2.4-1.7,2.4-3.9
	C312.6,241.4,311.7,239.7,310.2,239.7z M298.6,257.4c0-2.2-0.9-3.9-2.4-3.9c-1.5,0-2.4,1.7-2.4,3.9c0,2.2,0.9,3.9,2.4,3.9
	C297.7,261.3,298.6,259.6,298.6,257.4z M318.6,231.9c1.7,4,2.5,9,2.5,15c0,10.7-3.9,19.1-11.7,25.2c-7.8,6.1-19.6,9.1-35.4,9.1
	c-7.3,0-14.6-0.7-22-2.2c-7.4-1.5-13.4-3.5-18.1-6v-32.7c5.9,3.4,12.2,5.9,18.8,7.6c6.6,1.7,12.7,2.5,18.3,2.5
	c3.2,0,5.4-0.3,6.8-0.9c1.4-0.6,2.1-1.6,2.1-3c0-1.9-1.1-3.5-3.2-4.8c-2.1-1.3-6.6-3.5-13.5-6.6c-10.2-4.4-17.5-9.4-22.1-14.8
	c-4.6-5.4-6.9-12.1-6.9-19.9c0-6.8,1.9-12.8,5.6-18c3.7-5.2,9-9.3,15.9-12.3c6.8-3,14.6-4.4,23.4-4.4c7.2,0,13.6,0.6,19.2,1.7
	c5.6,1.2,10.9,3,16,5.4v31.6c-9.5-5.3-18.9-7.9-28.2-7.9c-7.5,0-11.3,1.6-11.3,4.9c0,1.6,0.9,2.9,2.6,4c1.7,1.1,4.9,2.5,9.4,4.3
	l5.9,2.4c7.5,3.2,13.3,6.3,17.3,9.4C314.1,224.4,316.9,227.9,318.6,231.9z M311.1,184.2l-2.1,0.5v0.7l1.4-0.4v8.2h0.7V184.2z
	 M305.7,175.1c0,2.6,1.2,4.6,3.1,4.6c1,0,1.8-0.5,2.3-1.4v-2c-0.3,1.6-1.1,2.7-2.3,2.7c-1.5,0-2.4-1.7-2.4-3.9
	c0-0.8,0.1-1.5,0.3-2.1c-0.2-0.1-0.4-0.2-0.6-0.2C305.9,173.4,305.7,174.2,305.7,175.1z M300.5,188.8c0,2.6,1.2,4.6,3.1,4.6
	c1.9,0,3.1-2,3.1-4.6c0-2.6-1.2-4.6-3.1-4.6C301.8,184.2,300.5,186.2,300.5,188.8z M298.5,171.7l1.4-0.4v8.2h0.7V171
	c-0.4-0.1-0.7-0.2-1.1-0.3l-1,0.3V171.7z M311.7,229.9c0,2.6,1.2,4.6,3.1,4.6c0.5,0,0.9-0.1,1.3-0.3c-0.1-0.2-0.2-0.4-0.2-0.6
	c-0.3,0.2-0.6,0.3-1,0.3c-1.5,0-2.4-1.7-2.4-3.9c0-0.6,0.1-1.2,0.2-1.8c-0.2-0.2-0.3-0.4-0.5-0.6C311.9,228.2,311.7,229,311.7,229.9
	z M301.4,229.9c0,2.6,1.2,4.6,3.1,4.6c1.9,0,3.1-2,3.1-4.6s-1.2-4.6-3.1-4.6C302.6,225.3,301.4,227.3,301.4,229.9z M308.4,253.6v8.2
	h0.7v-9l-2.1,0.5v0.7L308.4,253.6z M303.5,239.9v8.2h0.7v-9l-2.1,0.5v0.7L303.5,239.9z M295.8,216.6c0.1,2.4,1.3,4.1,3.1,4.1
	c1,0,1.8-0.5,2.3-1.4c-0.2-0.1-0.4-0.2-0.6-0.3c-0.4,0.7-1,1.1-1.7,1.1c-1.3,0-2.2-1.3-2.4-3.1C296.3,216.9,296,216.8,295.8,216.6z
	 M298,239.9v8.2h0.7v-9l-2.1,0.5v0.7L298,239.9z M297.8,226.2v8.2h0.7v-9l-2.1,0.5v0.7L297.8,226.2z M292.2,220.7h0.7v-5.3
	c-0.2-0.1-0.5-0.2-0.7-0.3V220.7z M290.9,226.6l1.4-0.4v8.2h0.7v-9l-2.1,0.5V226.6z M288.1,243.6c0,2.6,1.2,4.6,3.1,4.6
	c1.9,0,3.1-2,3.1-4.6s-1.2-4.6-3.1-4.6C289.3,239.1,288.1,241,288.1,243.6z M288.6,229.9c0-2.6-1.2-4.6-3.1-4.6
	c-1.9,0-3.1,2-3.1,4.6s1.2,4.6,3.1,4.6C287.4,234.5,288.6,232.5,288.6,229.9z M282.3,216.2c0,2.6,1.2,4.6,3.1,4.6
	c1.9,0,3.1-2,3.1-4.6c0-1.1-0.2-2.2-0.7-2.9l-1.2-0.5c0.7,0.7,1.2,1.9,1.2,3.4c0,2.2-0.9,3.9-2.4,3.9s-2.4-1.7-2.4-3.9
	c0-2.2,0.9-3.9,2.4-3.9c0,0,0,0,0.1,0c-0.4-0.1-0.7-0.3-1.1-0.4C283.1,212.4,282.3,214.1,282.3,216.2z M281.8,184.2l-2.1,0.5v0.7
	l1.4-0.4v8.2h0.7V184.2z M295.3,184.2l-2.1,0.5v0.7l1.4-0.4v8.2h0.7V184.2z M290,175.1c0,2.6,1.2,4.6,3.1,4.6c1.9,0,3.1-2,3.1-4.6
	s-1.2-4.6-3.1-4.6C291.2,170.5,290,172.4,290,175.1z M285,171.7l1.4-0.4v8.2h0.7v-9L285,171V171.7z M284.7,188.8
	c0,2.1,0.8,3.7,2,4.3c0.7,0,1.4,0,2.1,0.1c1.3-0.6,2.1-2.3,2.1-4.4c0-2.6-1.2-4.6-3.1-4.6C285.9,184.2,284.7,186.2,284.7,188.8z
	 M276.5,175.1c0,2.6,1.2,4.6,3.1,4.6c1.9,0,3.1-2,3.1-4.6s-1.2-4.6-3.1-4.6C277.7,170.5,276.5,172.4,276.5,175.1z M276.3,184.2
	l-2.1,0.5v0.7l1.4-0.4v8.2h0.7V184.2z M263.5,171.7l1.4-0.4v8.2h0.7v-9l-2.1,0.5V171.7z M259.7,212.5v8.2h0.7v-9l-2.1,0.5v0.7
	L259.7,212.5z M259.4,179.5h0.7v-7.8c-0.2,0.1-0.5,0.2-0.7,0.2V179.5z M257.3,197.9c-1.9,0-3.1,2-3.1,4.6s1.2,4.6,3.1,4.6
	c1.9,0,3.1-2,3.1-4.6S259.1,197.9,257.3,197.9z M257.4,184.2l-2.1,0.5v0.7l1.4-0.4v8.2h0.7V184.2z M249.8,176.9
	c0.4,1.6,1.5,2.7,2.9,2.7c1.9,0,3.1-2,3.1-4.6c0-0.5-0.1-1.1-0.2-1.5c-0.2,0.1-0.4,0.2-0.6,0.3c0.1,0.4,0.1,0.8,0.1,1.2
	c0,2.2-0.9,3.9-2.4,3.9c-1.2,0-2-1-2.3-2.5C250.2,176.6,250,176.8,249.8,176.9z M246.8,188.8c0,2.6,1.2,4.6,3.1,4.6s3.1-2,3.1-4.6
	c0-2.6-1.2-4.6-3.1-4.6S246.8,186.2,246.8,188.8z M240.9,197.9l-2.1,0.5v0.7l1.4-0.4v8.2h0.7V197.9z M242.7,188.8
	c0-1.4-0.4-2.7-1-3.5c-0.1,0.2-0.3,0.4-0.4,0.6c0.5,0.7,0.7,1.7,0.7,2.9c0,2.2-0.9,3.9-2.4,3.9c-0.4,0-0.8-0.1-1.1-0.4
	c-0.1,0.2-0.1,0.5-0.2,0.7c0.4,0.2,0.8,0.3,1.3,0.3C241.4,193.4,242.7,191.4,242.7,188.8z M244.6,211.6l-2.1,0.5v0.7l1.4-0.4v6
	c0.2,0.3,0.5,0.5,0.7,0.8V211.6z M250,202.5c0-2.6-1.2-4.6-3.1-4.6c-1.9,0-3.1,2-3.1,4.6s1.2,4.6,3.1,4.6
	C248.8,207.1,250,205.1,250,202.5z M256,216.2c0-2.6-1.2-4.6-3.1-4.6c-1.9,0-3.1,2-3.1,4.6c0,2.6,1.2,4.6,3.1,4.6
	C254.8,220.8,256,218.8,256,216.2z M261.6,229.9c0-2.6-1.2-4.6-3.1-4.6c-1.3,0-2.3,0.9-2.8,2.4c0.2,0.1,0.4,0.2,0.6,0.3
	c0.4-1.2,1.1-2,2.2-2c1.5,0,2.4,1.7,2.4,3.9c0,0.2,0,0.3,0,0.5c0.2,0.1,0.4,0.2,0.7,0.3C261.6,230.5,261.6,230.2,261.6,229.9z
	 M262.2,185.1v8.2h0.7v-9l-2.1,0.5v0.7L262.2,185.1z M264,198.8v8.2h0.7v-9l-2.1,0.5v0.7L264,198.8z M263.8,212.9l1.4-0.4v8.2h0.7
	v-9l-2.1,0.5V212.9z M266,225.4l-2.1,0.5v0.7l1.4-0.4v6.2c0.2,0.1,0.5,0.2,0.7,0.3V225.4z M269.5,198.8v8.2h0.7v-9l-2.1,0.5v0.7
	L269.5,198.8z M269.3,212.9l1.4-0.4v8.2h0.7v-9l-2.1,0.5V212.9z M271.5,225.4l-2.1,0.5v0.7l1.4-0.4v8.2h0.7V225.4z M272,188.8
	c0-2.6-1.2-4.6-3.1-4.6s-3.1,2-3.1,4.6c0,2.6,1.2,4.6,3.1,4.6S272,191.4,272,188.8z M274.7,175.1c0-2.6-1.2-4.6-3.1-4.6
	c-1.9,0-3.1,2-3.1,4.6s1.2,4.6,3.1,4.6C273.5,179.6,274.7,177.7,274.7,175.1z M274.3,216.2c0,2.6,1.2,4.6,3.1,4.6
	c1.9,0,3.1-2,3.1-4.6c0-2.6-1.2-4.6-3.1-4.6C275.5,211.6,274.3,213.6,274.3,216.2z M280.6,229.9c0-2.6-1.2-4.6-3.1-4.6
	c-1.9,0-3.1,2-3.1,4.6s1.2,4.6,3.1,4.6C279.4,234.5,280.6,232.5,280.6,229.9z M278.1,254l1.4-0.4v8.2h0.7v-9l-2.1,0.5V254z
	 M256.6,254l1.4-0.4v8.2h0.7v-9l-2.1,0.5V254z M241.2,271.1c0-2.6-1.2-4.6-3.1-4.6c-0.4,0-0.7,0.1-1,0.2v0.8c0.3-0.2,0.6-0.3,1-0.3
	c1.5,0,2.4,1.7,2.4,3.9c0,0.5,0,0.9-0.1,1.3c0.2,0.1,0.4,0.2,0.7,0.2C241.1,272.1,241.2,271.6,241.2,271.1z M243.3,257.4
	c0-2.6-1.2-4.6-3.1-4.6c-1.9,0-3.1,2-3.1,4.6c0,2.6,1.2,4.6,3.1,4.6C242.1,261.9,243.3,260,243.3,257.4z M245.6,266.5l-2.1,0.5v0.7
	l1.4-0.4v6.5c0.2,0.1,0.5,0.1,0.7,0.2V266.5z M247.7,252.8l-2.1,0.5v0.7l1.4-0.4v8.2h0.7V252.8z M251,266.5L249,267v0.7l1.4-0.4v7.9
	c0.2,0.1,0.5,0.1,0.7,0.1V266.5z M253.2,252.8l-2.1,0.5v0.7l1.4-0.4v8.2h0.7V252.8z M261.8,271.1c0-2.6-1.2-4.6-3.1-4.6
	c-1.9,0-3.1,2-3.1,4.6c0,2.6,1.2,4.6,3.1,4.6C260.6,275.7,261.8,273.7,261.8,271.1z M266.1,266.5l-2.1,0.5v0.7l1.4-0.4v8.2h0.7
	V266.5z M267.8,257.4c0-1.8-0.6-3.2-1.5-4c-0.9-0.1-1.9-0.2-2.8-0.3c-1.2,0.7-1.9,2.3-1.9,4.3c0,2.6,1.2,4.6,3.1,4.6
	C266.5,261.9,267.8,260,267.8,257.4z M271.6,266.5l-2.1,0.5v0.7l1.4-0.4v8.2h0.7V266.5z M275.8,257.4c0-1.7-0.5-3.1-1.4-3.9
	c-0.4,0-0.8,0.1-1.2,0.1c1.2,0.3,1.9,1.9,1.9,3.8c0,2.2-0.9,3.9-2.4,3.9c-1.5,0-2.4-1.7-2.4-3.9c0-1.9,0.7-3.4,1.8-3.8
	c-0.3,0-0.7,0-1,0c-0.1,0-0.1,0-0.2,0c-0.8,0.8-1.3,2.2-1.3,3.8c0,2.6,1.2,4.6,3.1,4.6S275.8,260,275.8,257.4z M280.7,271.1
	c0-2.6-1.2-4.6-3.1-4.6s-3.1,2-3.1,4.6c0,2.6,1.2,4.6,3.1,4.6S280.7,273.7,280.7,271.1z M284,243.6c0,1.3-0.3,2.4-0.9,3.1
	c0,0.4-0.1,0.7-0.1,1c1.1-0.7,1.7-2.3,1.7-4.2c0-2.6-1.2-4.6-3.1-4.6c-0.7,0-1.3,0.3-1.8,0.8c0.2,0.1,0.3,0.3,0.5,0.4
	c0.4-0.3,0.8-0.5,1.3-0.5C283.1,239.7,284,241.4,284,243.6z M285.1,266.5L283,267v0.7l1.4-0.4v8.2h0.7V266.5z M289.3,257.4
	c0-2.6-1.2-4.6-3.1-4.6c-1.9,0-3.1,2-3.1,4.6c0,2.6,1.2,4.6,3.1,4.6C288,261.9,289.3,260,289.3,257.4z M294.2,271.1
	c0-2.6-1.2-4.6-3.1-4.6c-1.9,0-3.1,2-3.1,4.6c0,2.6,1.2,4.6,3.1,4.6C293,275.7,294.2,273.7,294.2,271.1z M296.2,261.9
	c1.9,0,3.1-2,3.1-4.6c0-2.6-1.2-4.6-3.1-4.6c-1.9,0-3.1,2-3.1,4.6C293,260,294.3,261.9,296.2,261.9z M302.2,271.1
	c0-2.6-1.2-4.6-3.1-4.6s-3.1,2-3.1,4.6c0,1.6,0.4,2.9,1.2,3.7c0.2-0.1,0.5-0.2,0.7-0.2c-0.8-0.6-1.2-1.9-1.2-3.5
	c0-2.2,0.9-3.9,2.4-3.9s2.4,1.7,2.4,3.9c0,0.8-0.1,1.6-0.4,2.2c0.3-0.1,0.6-0.3,0.8-0.4C302.2,272.3,302.2,271.7,302.2,271.1z
	 M303.6,252.8l-2.1,0.5v0.7l1.4-0.4v8.2h0.7V252.8z M309.4,267.8c-0.5-0.8-1.3-1.4-2.3-1.4c-1.9,0-3.1,2-3.1,4.6c0,0.2,0,0.5,0,0.7
	c0.2-0.1,0.5-0.3,0.7-0.4c0-0.1,0-0.2,0-0.3c0-2.2,0.9-3.9,2.4-3.9c0.8,0,1.4,0.4,1.8,1.2C309.1,268.2,309.3,268,309.4,267.8z
	 M313.3,243.6c0-2.6-1.2-4.6-3.1-4.6c-1.9,0-3.1,2-3.1,4.6s1.2,4.6,3.1,4.6C312,248.2,313.3,246.2,313.3,243.6z M317.3,254
	c-0.5-0.7-1.3-1.2-2.2-1.2c-1.9,0-3.1,2-3.1,4.6c0,2.2,0.9,4,2.3,4.5c0.1-0.2,0.2-0.4,0.3-0.6c-1.2-0.3-2-1.9-2-3.9
	c0-2.2,0.9-3.9,2.4-3.9c0.9,0,1.5,0.6,2,1.5C317.1,254.6,317.2,254.3,317.3,254z M318,247.5c-1.4-0.2-2.2-1.8-2.2-3.9
	c0-1.8,0.6-3.3,1.7-3.8c0-0.2-0.1-0.5-0.1-0.7c-1.4,0.5-2.3,2.2-2.3,4.5c0,2.5,1.1,4.4,2.9,4.6C318,248,318,247.8,318,247.5z
	 M286.2,253.4c-1.5,0-2.4,1.7-2.4,3.9c0,2.2,0.9,3.9,2.4,3.9c1.5,0,2.4-1.7,2.4-3.9C288.6,255.1,287.7,253.4,286.2,253.4z
	 M277.6,267.1c-1.5,0-2.4,1.7-2.4,3.9s0.9,3.9,2.4,3.9c1.5,0,2.4-1.7,2.4-3.9S279.1,267.1,277.6,267.1z M100.1,233.8
	c1.5,0,2.4-1.7,2.4-3.9c0-2.2-0.9-3.9-2.4-3.9c-1.5,0-2.4,1.7-2.4,3.9C97.7,232.1,98.6,233.8,100.1,233.8z M100.1,247.6
	c1.5,0,2.4-1.7,2.4-3.9c0-2.2-0.9-3.9-2.4-3.9c-1.5,0-2.4,1.7-2.4,3.9C97.7,245.8,98.6,247.6,100.1,247.6z M81.2,267.1
	c-1.5,0-2.4,1.7-2.4,3.9s0.9,3.9,2.4,3.9c1.5,0,2.4-1.7,2.4-3.9S82.7,267.1,81.2,267.1z M100.1,206.4c1.5,0,2.4-1.7,2.4-3.9
	c0-2.2-0.9-3.9-2.4-3.9c-1.5,0-2.4,1.7-2.4,3.9C97.7,204.7,98.6,206.4,100.1,206.4z M113.6,179c1.5,0,2.4-1.7,2.4-3.9
	c0-2.2-0.9-3.9-2.4-3.9s-2.4,1.7-2.4,3.9C111.2,177.3,112.1,179,113.6,179z M81.2,239.7c-1.5,0-2.4,1.7-2.4,3.9
	c0,2.2,0.9,3.9,2.4,3.9c1.5,0,2.4-1.7,2.4-3.9C83.6,241.4,82.7,239.7,81.2,239.7z M81.2,212.3c-1.5,0-2.4,1.7-2.4,3.9
	c0,2.2,0.9,3.9,2.4,3.9c1.5,0,2.4-1.7,2.4-3.9C83.6,214,82.7,212.3,81.2,212.3z M81.2,198.6c-1.5,0-2.4,1.7-2.4,3.9
	c0,2.2,0.9,3.9,2.4,3.9c1.5,0,2.4-1.7,2.4-3.9C83.6,200.3,82.7,198.6,81.2,198.6z M127.1,179c1.5,0,2.4-1.7,2.4-3.9
	c0-2.2-0.9-3.9-2.4-3.9c-1.5,0-2.4,1.7-2.4,3.9C124.7,177.3,125.6,179,127.1,179z M81.2,253.4c-1.5,0-2.4,1.7-2.4,3.9
	c0,2.2,0.9,3.9,2.4,3.9c1.5,0,2.4-1.7,2.4-3.9C83.6,255.1,82.7,253.4,81.2,253.4z M81.2,226c-1.5,0-2.4,1.7-2.4,3.9
	c0,2.2,0.9,3.9,2.4,3.9c1.5,0,2.4-1.7,2.4-3.9C83.6,227.7,82.7,226,81.2,226z M157.2,220.1c1.5,0,2.4-1.7,2.4-3.9
	c0-2.2-0.9-3.9-2.4-3.9c-1.5,0-2.4,1.7-2.4,3.9C154.8,218.4,155.7,220.1,157.2,220.1z M137.1,192.7c1.5,0,2.4-1.7,2.4-3.9
	c0-2.2-0.9-3.9-2.4-3.9s-2.4,1.7-2.4,3.9C134.7,191,135.6,192.7,137.1,192.7z M158.6,226c-1.5,0-2.4,1.7-2.4,3.9
	c0,2.2,0.9,3.9,2.4,3.9c1.5,0,2.4-1.7,2.4-3.9C161,227.7,160.1,226,158.6,226z M165.2,220.1c1.5,0,2.4-1.7,2.4-3.9
	c0-2.2-0.9-3.9-2.4-3.9s-2.4,1.7-2.4,3.9C162.8,218.4,163.7,220.1,165.2,220.1z M169.7,206.4c1.5,0,2.4-1.7,2.4-3.9
	c0-2.2-0.9-3.9-2.4-3.9c-1.5,0-2.4,1.7-2.4,3.9C167.3,204.7,168.2,206.4,169.7,206.4z M137.1,179c1.5,0,2.4-1.7,2.4-3.9
	c0-2.2-0.9-3.9-2.4-3.9s-2.4,1.7-2.4,3.9C134.7,177.3,135.6,179,137.1,179z M137.2,229.9c0,2.2,0.9,3.9,2.4,3.9
	c1.5,0,2.4-1.7,2.4-3.9c0-2.2-0.9-3.9-2.4-3.9C138.1,226,137.2,227.7,137.2,229.9z M161.6,206.4c1.5,0,2.4-1.7,2.4-3.9
	c0-2.2-0.9-3.9-2.4-3.9c-1.5,0-2.4,1.7-2.4,3.9C159.2,204.7,160.1,206.4,161.6,206.4z M156.1,192.7c1.5,0,2.4-1.7,2.4-3.9
	c0-2.2-0.9-3.9-2.4-3.9c-1.5,0-2.4,1.7-2.4,3.9C153.7,191,154.6,192.7,156.1,192.7z M105.6,171.1c-1.5,0-2.4,1.7-2.4,3.9
	c0,2.2,0.9,3.9,2.4,3.9s2.4-1.7,2.4-3.9C108,172.9,107.1,171.1,105.6,171.1z M156.5,253.4c-1.5,0-2.4,1.7-2.4,3.9
	c0,2.2,0.9,3.9,2.4,3.9s2.4-1.7,2.4-3.9C158.9,255.1,158,253.4,156.5,253.4z M158.6,242.5l21.9,36.2h-41.6v0l-13.3-28.9h-13.8v28.9
	H75V167.4h53.8c15.1,0,26.8,3.5,35.1,10.4c8.3,6.9,12.4,16.7,12.4,29.4c0,8-1.5,15-4.5,21C168.7,234.2,164.3,239,158.6,242.5z
	 M161.7,229.9c0-2.6-1.2-4.6-3.1-4.6c-1.9,0-3.1,2-3.1,4.6s1.2,4.6,3.1,4.6C160.5,234.5,161.7,232.5,161.7,229.9z M154.9,198.8v8.2
	h0.7v-9l-2.1,0.5v0.7L154.9,198.8z M154.1,216.2c0,2.6,1.2,4.6,3.1,4.6c1.9,0,3.1-2,3.1-4.6c0-2.6-1.2-4.6-3.1-4.6
	C155.3,211.6,154.1,213.6,154.1,216.2z M166.1,225.4l-2.1,0.5v0.7l1.4-0.4v6.1c0.2-0.3,0.5-0.6,0.7-0.9V225.4z M172.9,211.6
	c-1.7,0.2-2.7,2.1-2.7,4.6c0,1.7,0.5,3,1.3,3.9c0.1-0.3,0.1-0.5,0.2-0.8c-0.5-0.7-0.8-1.8-0.8-3.1c0-2,0.7-3.6,2-3.9
	C172.8,212.1,172.8,211.9,172.9,211.6z M168.3,193.2h0.7v-4.1c-0.2-0.4-0.5-0.8-0.7-1.2V193.2z M166.6,202.5c0,2.6,1.2,4.6,3.1,4.6
	c1.9,0,3.1-2,3.1-4.6s-1.2-4.6-3.1-4.6C167.8,197.9,166.6,199.9,166.6,202.5z M165.2,211.6c-1.9,0-3.1,2-3.1,4.6
	c0,2.6,1.2,4.6,3.1,4.6c1.9,0,3.1-2,3.1-4.6C168.3,213.6,167.1,211.6,165.2,211.6z M161.5,185.5l1.4-0.4v8.2h0.7v-9l-2.1,0.5V185.5z
	 M158.5,202.5c0,2.6,1.2,4.6,3.1,4.6c1.9,0,3.1-2,3.1-4.6s-1.2-4.6-3.1-4.6C159.8,197.9,158.5,199.9,158.5,202.5z M153,175.1
	c0,2.6,1.2,4.6,3.1,4.6c1.1,0,2-0.7,2.5-1.8c-0.2-0.1-0.4-0.2-0.6-0.4c-0.4,0.9-1.1,1.5-1.9,1.5c-1.5,0-2.4-1.6-2.4-3.8
	c-0.2-0.1-0.5-0.2-0.7-0.3C153,174.9,153,175,153,175.1z M153,188.8c0,2.6,1.2,4.6,3.1,4.6c1.9,0,3.1-2,3.1-4.6
	c0-2.6-1.2-4.6-3.1-4.6C154.2,184.2,153,186.2,153,188.8z M151.9,226.2v8.2h0.7v-9l-2.1,0.5v0.7L151.9,226.2z M151.2,211.6l-2.1,0.5
	v0.7l1.4-0.4v8.2h0.7V211.6z M149.4,179.5h0.7v-5.7c-0.2-0.1-0.5-0.2-0.7-0.2V179.5z M146.4,226.2v8.2h0.7v-9l-2.1,0.5v0.7
	L146.4,226.2z M144.3,253.6v8.2h0.7v-9l-2.1,0.5v0.7L144.3,253.6z M145.7,220.7v-9l-1.5,0.4c0,0.3-0.1,0.5-0.1,0.7l0.9-0.3v8.2
	H145.7z M143.9,179.5h0.7v-7.3c-0.2-0.1-0.5-0.1-0.7-0.2V179.5z M142.5,185.5l1.4-0.4v8.2h0.7v-9l-2.1,0.5V185.5z M141.6,198.1
	c0.1,0.2,0.3,0.4,0.4,0.6c0.2-0.1,0.4-0.1,0.7-0.1c1.5,0,2.4,1.7,2.4,3.9c0,1.2-0.3,2.3-0.8,3c0,0.3,0.1,0.6,0.1,0.9
	c0.9-0.8,1.4-2.2,1.4-3.9c0-2.6-1.2-4.6-3.1-4.6C142.3,197.9,142,198,141.6,198.1z M139.6,225.3c-1.9,0-3.1,2-3.1,4.6
	s1.2,4.6,3.1,4.6c1.9,0,3.1-2,3.1-4.6S141.5,225.3,139.6,225.3z M141.7,239.9v8.2h0.7v-9l-2.1,0.5v0.7L141.7,239.9z M141.3,208.4
	c0-4.1-1.1-7.3-3.3-9.6c-2.2-2.3-5.3-3.4-9.3-3.4h-17v26.5h17c4,0,7.1-1.2,9.3-3.6C140.2,215.9,141.3,212.6,141.3,208.4z M134,175.1
	c0,2.6,1.2,4.6,3.1,4.6c1.9,0,3.1-2,3.1-4.6c0-1.6-0.5-3-1.3-3.8c-1-0.1-2.1-0.2-3.2-0.3C134.6,171.6,134,173.2,134,175.1z
	 M134,188.8c0,2.6,1.2,4.6,3.1,4.6c1.9,0,3.1-2,3.1-4.6c0-2.6-1.2-4.6-3.1-4.6C135.2,184.2,134,186.2,134,188.8z M124,175.1
	c0,2.6,1.2,4.6,3.1,4.6c1.9,0,3.1-2,3.1-4.6c0-2.2-0.9-4-2.3-4.4h-1.6C124.9,171.1,124,172.8,124,175.1z M124,188.8
	c0,1.4,0.3,2.6,0.9,3.4h0.9c-0.7-0.7-1.1-1.9-1.1-3.4c0-2.2,0.9-3.9,2.4-3.9c1.5,0,2.4,1.7,2.4,3.9c0,1.5-0.4,2.7-1.1,3.4h0.4
	c0.2,0,0.3,0,0.5,0c0.6-0.8,1-2,1-3.4c0-2.6-1.2-4.6-3.1-4.6C125.2,184.2,124,186.2,124,188.8z M119,171.7l1.4-0.4v8.2h0.7v-8.9
	h-0.4L119,171V171.7z M119,185.5l1.4-0.4v7.1h0.7v-8l-2.1,0.5V185.5z M110.5,175.1c0,2.6,1.2,4.6,3.1,4.6c1.9,0,3.1-2,3.1-4.6
	c0-2.2-0.9-4-2.3-4.4h-1.6C111.4,171.1,110.5,172.8,110.5,175.1z M110.5,188.8c0,1.4,0.3,2.6,0.9,3.4h0.4h0.5
	c-0.7-0.7-1.1-1.9-1.1-3.4c0-2.2,0.9-3.9,2.4-3.9s2.4,1.7,2.4,3.9c0,1.5-0.4,2.7-1.1,3.4h0.9c0.6-0.8,0.9-2,0.9-3.4
	c0-2.6-1.2-4.6-3.1-4.6C111.7,184.2,110.5,186.2,110.5,188.8z M97.5,171.7l1.4-0.4v8.2h0.7v-8.9h-0.4l-1.6,0.4V171.7z M97,188.8
	c0,2.6,1.2,4.6,3.1,4.6c1.9,0,3.1-2,3.1-4.6c0-2.6-1.2-4.6-3.1-4.6C98.2,184.2,97,186.2,97,188.8z M97,202.5c0,2.6,1.2,4.6,3.1,4.6
	c1.9,0,3.1-2,3.1-4.6s-1.2-4.6-3.1-4.6C98.2,197.9,97,199.9,97,202.5z M98.9,212.5v8.2h0.7v-9l-2.1,0.5v0.7L98.9,212.5z M97,229.9
	c0,2.6,1.2,4.6,3.1,4.6c1.9,0,3.1-2,3.1-4.6s-1.2-4.6-3.1-4.6C98.2,225.3,97,227.3,97,229.9z M97,243.6c0,2.6,1.2,4.6,3.1,4.6
	c1.9,0,3.1-2,3.1-4.6s-1.2-4.6-3.1-4.6C98.2,239.1,97,241,97,243.6z M98.9,253.6v8.2h0.7v-9l-2.1,0.5v0.7L98.9,253.6z M84.3,271.1
	c0-2.6-1.2-4.6-3.1-4.6c-1.5,0-2.6,1.3-3,3.2v2.8c0.3,1.5,1,2.6,2,3h1.9C83.5,274.9,84.3,273.2,84.3,271.1z M84.3,257.4
	c0-2.6-1.2-4.6-3.1-4.6c-1.5,0-2.6,1.3-3,3.2v2.8c0.4,1.9,1.4,3.2,3,3.2C83,261.9,84.3,260,84.3,257.4z M84.3,243.6
	c0-2.6-1.2-4.6-3.1-4.6c-1.5,0-2.6,1.3-3,3.2v2.8c0.4,1.9,1.4,3.2,3,3.2C83,248.2,84.3,246.2,84.3,243.6z M84.3,229.9
	c0-2.6-1.2-4.6-3.1-4.6c-1.5,0-2.6,1.3-3,3.2v2.8c0.4,1.9,1.4,3.2,3,3.2C83,234.5,84.3,232.5,84.3,229.9z M84.3,216.2
	c0-2.6-1.2-4.6-3.1-4.6c-1.5,0-2.6,1.3-3,3.2v2.8c0.4,1.9,1.4,3.2,3,3.2C83,220.8,84.3,218.8,84.3,216.2z M84.3,202.5
	c0-2.6-1.2-4.6-3.1-4.6c-1.5,0-2.6,1.3-3,3.2v2.8c0.4,1.9,1.4,3.2,3,3.2C83,207.1,84.3,205.1,84.3,202.5z M84.3,188.8
	c0-2.6-1.2-4.6-3.1-4.6c-1.5,0-2.6,1.3-3,3.2v2.8c0.4,1.9,1.4,3.2,3,3.2C83,193.4,84.3,191.4,84.3,188.8z M84.3,175.1
	c0-2.2-0.9-4-2.3-4.4h-1.6c-1.1,0.4-1.9,1.5-2.2,3.1v2.8c0.4,1.9,1.4,3.2,3,3.2C83,179.6,84.3,177.7,84.3,175.1z M88.6,266.5
	l-2.1,0.5v0.7l1.4-0.4v8.1h0.7V266.5z M88.6,252.8l-2.1,0.5v0.7l1.4-0.4v8.2h0.7V252.8z M88.6,239.1l-2.1,0.5v0.7l1.4-0.4v8.2h0.7
	V239.1z M88.6,225.4l-2.1,0.5v0.7l1.4-0.4v8.2h0.7V225.4z M88.6,211.6l-2.1,0.5v0.7l1.4-0.4v8.2h0.7V211.6z M88.6,197.9l-2.1,0.5
	v0.7l1.4-0.4v8.2h0.7V197.9z M88.6,184.2l-2.1,0.5v0.7l1.4-0.4v8.2h0.7V184.2z M88.6,170.6h-0.4l-1.6,0.4v0.7l1.4-0.4v8.2h0.7V170.6
	z M94.1,266.5l-2.1,0.5v0.7l1.4-0.4v8.1h0.7V266.5z M94.1,252.8l-2.1,0.5v0.7l1.4-0.4v8.2h0.7V252.8z M94.1,239.1l-2.1,0.5v0.7
	l1.4-0.4v8.2h0.7V239.1z M94.1,225.4l-2.1,0.5v0.7l1.4-0.4v8.2h0.7V225.4z M94.1,211.6l-2.1,0.5v0.7l1.4-0.4v8.2h0.7V211.6z
	 M94.1,197.9l-2.1,0.5v0.7l1.4-0.4v8.2h0.7V197.9z M94.1,184.2l-2.1,0.5v0.7l1.4-0.4v8.2h0.7V184.2z M94.1,170.6h-0.4l-1.6,0.4v0.7
	l1.4-0.4v8.2h0.7V170.6z M103.2,271.1c0-2.6-1.2-4.6-3.1-4.6c-1.9,0-3.1,2-3.1,4.6c0,2.1,0.8,3.8,2.1,4.4h1.9
	C102.4,274.9,103.2,273.2,103.2,271.1z M108.6,266.5c-0.2,0-0.3-0.1-0.5-0.1c-1.9,0-3.1,2-3.1,4.6c0,2.1,0.8,3.8,2.1,4.4h1.4v-0.5
	c-0.2,0-0.3,0.1-0.5,0.1c-1.5,0-2.4-1.7-2.4-3.9s0.9-3.9,2.4-3.9c0.2,0,0.3,0,0.5,0.1V266.5z M108.6,256.3c-0.3-2.1-1.4-3.5-3-3.5
	c-1.9,0-3.1,2-3.1,4.6c0,2.6,1.2,4.6,3.1,4.6c1.6,0,2.7-1.5,3-3.5V256.3z M106.9,226.2v8.2h0.7v-9l-2.1,0.5v0.7L106.9,226.2z
	 M105.5,239.6v0.7l1.4-0.4v8.2h0.7v-9L105.5,239.6z M108.6,215.2c-0.3-2.1-1.4-3.5-3-3.5c-1.9,0-3.1,2-3.1,4.6
	c0,2.6,1.2,4.6,3.1,4.6c1.6,0,2.7-1.5,3-3.5V215.2z M106.9,185.1v8.2h0.7v-9l-2.1,0.5v0.7L106.9,185.1z M105.5,198.4v0.7l1.4-0.4
	v8.2h0.7v-9L105.5,198.4z M108.7,175.1c0-2.2-0.9-4-2.3-4.4h-1.6c-1.4,0.5-2.3,2.2-2.3,4.4c0,2.6,1.2,4.6,3.1,4.6
	S108.7,177.7,108.7,175.1z M110.5,229.9c0,2.6,1.2,4.6,3.1,4.6c1.9,0,3.1-2,3.1-4.6s-1.2-4.6-3.1-4.6
	C111.7,225.3,110.5,227.3,110.5,229.9z M116.7,243.6c0-2.6-1.2-4.6-3.1-4.6c-1.9,0-3.1,2-3.1,4.6c0,1.1,0.2,2.2,0.7,2.9h0.6h0.1
	c-0.5-0.7-0.7-1.8-0.7-2.9c0-2.2,0.9-3.9,2.4-3.9c1.5,0,2.4,1.7,2.4,3.9c0,1.2-0.3,2.2-0.7,2.9h0.8
	C116.5,245.8,116.7,244.8,116.7,243.6z M121.1,239.1l-2.1,0.5v0.7l1.4-0.4v6.7h0.7V239.1z M124.7,229.9c0-2.6-1.2-4.6-3.1-4.6
	c-1.9,0-3.1,2-3.1,4.6s1.2,4.6,3.1,4.6C123.5,234.5,124.7,232.5,124.7,229.9z M126.6,239.1l-2.1,0.5v0.7l1.4-0.4v6.7h0.7V239.1z
	 M132.8,229.9c0-2.6-1.2-4.6-3.1-4.6c-1.9,0-3.1,2-3.1,4.6s1.2,4.6,3.1,4.6C131.5,234.5,132.8,232.5,132.8,229.9z M134.9,248.2
	c1.9,0,3.1-2,3.1-4.6s-1.2-4.6-3.1-4.6c-1.9,0-3.1,2-3.1,4.6S133,248.2,134.9,248.2z M140.6,257.4c0-2.6-1.2-4.6-3.1-4.6
	c-1.9,0-3.1,2-3.1,4.6c0,2.6,1.2,4.6,3.1,4.6C139.4,261.9,140.6,260,140.6,257.4z M146.6,271.1c0-2.6-1.2-4.6-3.1-4.6
	c-1.9,0-3.1,2-3.1,4.6c0,2.1,0.8,3.8,2.1,4.4h2C145.8,274.9,146.6,273.2,146.6,271.1z M147.9,239.1l-2.1,0.5v0.7l1.4-0.4v8.2h0.7
	V239.1z M148,185.5l1.4-0.4v8.2h0.7v-9l-2.1,0.5V185.5z M148.1,199.2l1.4-0.4v8.2h0.7v-9l-2.1,0.5V199.2z M148.4,254l1.4-0.4v8.2
	h0.7v-9l-2.1,0.5V254z M151,266.5L149,267v0.7l1.4-0.4v8.1h0.7V266.5z M153.9,248.2c1.4,0,2.4-1.1,2.9-2.7l-0.5-0.9
	c-0.2,1.7-1.1,2.9-2.3,2.9c-1.5,0-2.4-1.7-2.4-3.9c0-2.2,0.9-3.9,2.4-3.9c0.7,0,1.2,0.3,1.6,0.9l0.6-0.4c-0.5-0.8-1.3-1.2-2.2-1.2
	c-1.9,0-3.1,2-3.1,4.6S152,248.2,153.9,248.2z M156.5,266.5l-2.1,0.5v0.7l1.4-0.4v8.1h0.7V266.5z M164.9,271.1
	c0,2.1,0.8,3.8,2.1,4.4h2c1.3-0.6,2.1-2.3,2.1-4.4c0-2.6-1.2-4.6-3.1-4.6C166.1,266.5,164.9,268.5,164.9,271.1z M163.3,261.8h0.7
	v-4.4l-0.7-1.2V261.8z M161.9,254L161.9,254L161.9,254L161.9,254z M159.9,267.8l1.4-0.4v8.1h0.7v-8.9l-2.1,0.5V267.8z M156.5,252.8
	c-1.9,0-3.1,2-3.1,4.6c0,2.6,1.2,4.6,3.1,4.6c1.9,0,3.1-2,3.1-4.6C159.6,254.7,158.4,252.8,156.5,252.8z M168,275
	c1.5,0,2.4-1.7,2.4-3.9s-0.9-3.9-2.4-3.9c-1.5,0-2.4,1.7-2.4,3.9S166.5,275,168,275z M143.5,267.1c-1.5,0-2.4,1.7-2.4,3.9
	s0.9,3.9,2.4,3.9c1.5,0,2.4-1.7,2.4-3.9S145,267.1,143.5,267.1z M206.1,253.4c-1.5,0-2.4,1.7-2.4,3.9c0,2.2,0.9,3.9,2.4,3.9
	c1.5,0,2.4-1.7,2.4-3.9C208.5,255.1,207.6,253.4,206.1,253.4z M193.1,226c-1.5,0-2.4,1.7-2.4,3.9c0,2.2,0.9,3.9,2.4,3.9
	c1.5,0,2.4-1.7,2.4-3.9C195.5,227.7,194.6,226,193.1,226z M216.3,212.3c-1.5,0-2.4,1.7-2.4,3.9c0,2.2,0.9,3.9,2.4,3.9
	c1.5,0,2.4-1.7,2.4-3.9C218.7,214,217.8,212.3,216.3,212.3z M212.1,233.8c1.5,0,2.4-1.7,2.4-3.9c0-2.2-0.9-3.9-2.4-3.9
	c-1.5,0-2.4,1.7-2.4,3.9C209.7,232.1,210.6,233.8,212.1,233.8z M137.5,253.4c-1.5,0-2.4,1.7-2.4,3.9c0,2.2,0.9,3.9,2.4,3.9
	c1.5,0,2.4-1.7,2.4-3.9C139.9,255.1,139,253.4,137.5,253.4z M129.7,226c-1.5,0-2.4,1.7-2.4,3.9c0,2.2,0.9,3.9,2.4,3.9
	c1.5,0,2.4-1.7,2.4-3.9C132.1,227.7,131.2,226,129.7,226z M105.6,212.3c-1.5,0-2.4,1.7-2.4,3.9c0,2.2,0.9,3.9,2.4,3.9
	s2.4-1.7,2.4-3.9C108,214,107.1,212.3,105.6,212.3z M137.3,243.6c0-2.2-0.9-3.9-2.4-3.9s-2.4,1.7-2.4,3.9c0,2.2,0.9,3.9,2.4,3.9
	S137.3,245.8,137.3,243.6z M100.1,267.1c-1.5,0-2.4,1.7-2.4,3.9s0.9,3.9,2.4,3.9c1.5,0,2.4-1.7,2.4-3.9S101.6,267.1,100.1,267.1z
	 M81.2,171.1c-1.5,0-2.4,1.7-2.4,3.9c0,2.2,0.9,3.9,2.4,3.9c1.5,0,2.4-1.7,2.4-3.9C83.6,172.9,82.7,171.1,81.2,171.1z M105.6,253.4
	c-1.5,0-2.4,1.7-2.4,3.9c0,2.2,0.9,3.9,2.4,3.9s2.4-1.7,2.4-3.9C108,255.1,107.1,253.4,105.6,253.4z M210.8,267.1
	c-1.5,0-2.4,1.7-2.4,3.9s0.9,3.9,2.4,3.9c1.5,0,2.4-1.7,2.4-3.9S212.3,267.1,210.8,267.1z M81.2,184.8c-1.5,0-2.4,1.7-2.4,3.9
	c0,2.2,0.9,3.9,2.4,3.9c1.5,0,2.4-1.7,2.4-3.9C83.6,186.6,82.7,184.8,81.2,184.8z M121.6,226c-1.5,0-2.4,1.7-2.4,3.9
	c0,2.2,0.9,3.9,2.4,3.9c1.5,0,2.4-1.7,2.4-3.9C124,227.7,123.1,226,121.6,226z M113.6,233.8c1.5,0,2.4-1.7,2.4-3.9
	c0-2.2-0.9-3.9-2.4-3.9s-2.4,1.7-2.4,3.9C111.2,232.1,112.1,233.8,113.6,233.8z M100.1,192.7c1.5,0,2.4-1.7,2.4-3.9
	c0-2.2-0.9-3.9-2.4-3.9c-1.5,0-2.4,1.7-2.4,3.9C97.7,191,98.6,192.7,100.1,192.7z M342.9,206.4c1.5,0,2.4-1.7,2.4-3.9
	c0-2.2-0.9-3.9-2.4-3.9s-2.4,1.7-2.4,3.9C340.5,204.7,341.4,206.4,342.9,206.4z M350.8,192.7c1.5,0,2.4-1.7,2.4-3.9
	c0-2.2-0.9-3.9-2.4-3.9c-1.5,0-2.4,1.7-2.4,3.9C348.4,191,349.3,192.7,350.8,192.7z M399.6,261.3c1.5,0,2.4-1.7,2.4-3.9
	c0-2.2-0.9-3.9-2.4-3.9c-1.5,0-2.4,1.7-2.4,3.9C397.2,259.6,398.1,261.3,399.6,261.3z M364.3,243.6c0-2.2-0.9-3.9-2.4-3.9
	c-1.5,0-2.4,1.7-2.4,3.9c0,2.2,0.9,3.9,2.4,3.9C363.4,247.6,364.3,245.8,364.3,243.6z M343.1,233.8c1.5,0,2.4-1.7,2.4-3.9
	c0-2.2-0.9-3.9-2.4-3.9c-1.5,0-2.4,1.7-2.4,3.9C340.7,232.1,341.6,233.8,343.1,233.8z M353.4,202.5c0-2.2-0.9-3.9-2.4-3.9
	s-2.4,1.7-2.4,3.9c0,2.2,0.9,3.9,2.4,3.9S353.4,204.7,353.4,202.5z M353.8,179c1.5,0,2.4-1.7,2.4-3.9c0-2.2-0.9-3.9-2.4-3.9
	c-1.5,0-2.4,1.7-2.4,3.9C351.4,177.3,352.3,179,353.8,179z M353.8,239.7c-1.5,0-2.4,1.7-2.4,3.9c0,2.2,0.9,3.9,2.4,3.9
	c1.5,0,2.4-1.7,2.4-3.9C356.3,241.4,355.3,239.7,353.8,239.7z M413.1,253.4c-1.5,0-2.4,1.7-2.4,3.9c0,2.2,0.9,3.9,2.4,3.9
	c1.5,0,2.4-1.7,2.4-3.9C415.5,255.1,414.6,253.4,413.1,253.4z M342.7,267.1c-1.5,0-2.4,1.7-2.4,3.9s0.9,3.9,2.4,3.9s2.4-1.7,2.4-3.9
	S344.2,267.1,342.7,267.1z M342.8,192.7c1.5,0,2.4-1.7,2.4-3.9c0-2.2-0.9-3.9-2.4-3.9c-1.5,0-2.4,1.7-2.4,3.9
	C340.4,191,341.3,192.7,342.8,192.7z M345.8,239.7c-1.5,0-2.4,1.7-2.4,3.9c0,2.2,0.9,3.9,2.4,3.9c1.5,0,2.4-1.7,2.4-3.9
	C348.2,241.4,347.3,239.7,345.8,239.7z M349.2,253.4c-1.5,0-2.4,1.7-2.4,3.9c0,2.2,0.9,3.9,2.4,3.9c1.5,0,2.4-1.7,2.4-3.9
	C351.6,255.1,350.7,253.4,349.2,253.4z M337.8,179c1.5,0,2.4-1.7,2.4-3.9c0-2.2-0.9-3.9-2.4-3.9c-1.5,0-2.4,1.7-2.4,3.9
	C335.4,177.3,336.3,179,337.8,179z M342.6,220.1c1.5,0,2.4-1.7,2.4-3.9c0-2.2-0.9-3.9-2.4-3.9c-1.5,0-2.4,1.7-2.4,3.9
	C340.2,218.4,341.1,220.1,342.6,220.1z M402.5,239.7c-1.5,0-2.4,1.7-2.4,3.9c0,2.2,0.9,3.9,2.4,3.9c1.5,0,2.4-1.7,2.4-3.9
	C404.9,241.4,404,239.7,402.5,239.7z M400,267.1c-1.5,0-2.4,1.7-2.4,3.9s0.9,3.9,2.4,3.9c1.5,0,2.4-1.7,2.4-3.9
	S401.5,267.1,400,267.1z M337.8,239.7c-1.5,0-2.4,1.7-2.4,3.9c0,2.2,0.9,3.9,2.4,3.9c1.5,0,2.4-1.7,2.4-3.9
	C340.2,241.4,339.3,239.7,337.8,239.7z M377.8,229.9c0-2.2-0.9-3.9-2.4-3.9c-1.5,0-2.4,1.7-2.4,3.9c0,2.2,0.9,3.9,2.4,3.9
	C376.9,233.8,377.8,232.1,377.8,229.9z M356.2,267.1c-1.5,0-2.4,1.7-2.4,3.9s0.9,3.9,2.4,3.9c1.5,0,2.4-1.7,2.4-3.9
	S357.7,267.1,356.2,267.1z M356.1,212.3c-1.5,0-2.4,1.7-2.4,3.9c0,2.2,0.9,3.9,2.4,3.9c1.5,0,2.4-1.7,2.4-3.9
	C358.5,214,357.6,212.3,356.1,212.3z M437,278.6h-41.6l-13.3-28.9h-13.8v28.9h-36.8V167.4h53.8c15.1,0,26.8,3.5,35.1,10.4
	c8.3,6.9,12.4,16.7,12.4,29.4c0,8-1.5,15-4.5,21c-3,6-7.4,10.7-13.1,14.2L437,278.6z M415.3,225.4l-2.1,0.5v0.7l1.4-0.4v8.2h0.7
	V225.4z M412.8,212.5v8.2h0.7v-9l-2.1,0.5v0.7L412.8,212.5z M429.3,212.5c-0.5-0.6-1.2-0.9-2-0.9c-1.9,0-3.1,2-3.1,4.6
	c0,2.6,1.2,4.6,3.1,4.6c0.1,0,0.3,0,0.4,0c0.1-0.2,0.1-0.5,0.2-0.7c-0.2,0.1-0.4,0.1-0.6,0.1c-1.5,0-2.4-1.7-2.4-3.9
	c0-2.2,0.9-3.9,2.4-3.9c0.8,0,1.4,0.5,1.8,1.3C429.2,213.2,429.2,212.9,429.3,212.5z M425.3,202.5c0,2.6,1.2,4.6,3.1,4.6
	c0.4,0,0.8-0.1,1.1-0.3c0-0.3,0-0.5,0-0.8c-0.3,0.2-0.7,0.4-1.1,0.4c-1.5,0-2.4-1.7-2.4-3.9c0-2.2,0.9-3.9,2.4-3.9
	c0.1,0,0.2,0,0.3,0c0-0.2-0.1-0.5-0.1-0.7c-0.1,0-0.1,0-0.2,0C426.6,197.9,425.3,199.9,425.3,202.5z M420.2,188.8
	c0,2.6,1.2,4.6,3.1,4.6c1.4,0,2.5-1.1,2.9-2.9c-0.2-0.4-0.3-0.7-0.5-1.1c-0.2,1.9-1,3.3-2.4,3.3c-1.5,0-2.4-1.7-2.4-3.9
	c0-1.9,0.7-3.5,1.9-3.8c-0.1-0.2-0.3-0.4-0.4-0.5C421,184.9,420.2,186.6,420.2,188.8z M421.7,198.8v8.2h0.7v-9l-2.1,0.5v0.7
	L421.7,198.8z M418.2,229.9c0,2.1,0.8,3.7,2,4.3c0.2-0.2,0.3-0.3,0.5-0.5c-1.1-0.4-1.8-1.9-1.8-3.8c0-2.2,0.9-3.9,2.4-3.9
	c1.5,0,2.3,1.6,2.4,3.7c0.2-0.3,0.4-0.6,0.6-1c-0.3-2-1.4-3.4-3-3.4C419.4,225.3,418.2,227.3,418.2,229.9z M419,211.6l-2.1,0.5v0.7
	l1.4-0.4v8.2h0.7V211.6z M418.1,202.5c0-2.6-1.2-4.6-3.1-4.6c-1.9,0-3.1,2-3.1,4.6s1.2,4.6,3.1,4.6
	C416.8,207.1,418.1,205.1,418.1,202.5z M412.3,176.3c0.3,2,1.4,3.4,3,3.4c0.6,0,1.1-0.2,1.5-0.5c-0.2-0.1-0.4-0.3-0.6-0.4
	c-0.3,0.2-0.6,0.3-0.9,0.3c-1.1,0-1.9-0.9-2.2-2.3C412.9,176.6,412.6,176.4,412.3,176.3z M409.5,188.8c0,2.6,1.2,4.6,3.1,4.6
	c1.9,0,3.1-2,3.1-4.6c0-2.6-1.2-4.6-3.1-4.6C410.7,184.2,409.5,186.2,409.5,188.8z M402.9,216.2c0,2.6,1.2,4.6,3.1,4.6
	c1.9,0,3.1-2,3.1-4.6c0-2.6-1.2-4.6-3.1-4.6C404.2,211.6,402.9,213.6,402.9,216.2z M406.9,207.1c1.9,0,3.1-2,3.1-4.6
	s-1.2-4.6-3.1-4.6c-1.9,0-3.1,2-3.1,4.6S405,207.1,406.9,207.1z M404.7,229.9c0,2.6,1.2,4.6,3.1,4.6c1.9,0,3.1-2,3.1-4.6
	s-1.2-4.6-3.1-4.6C405.9,225.3,404.7,227.3,404.7,229.9z M408.6,179.5h0.7v-4.7c-0.2-0.1-0.5-0.2-0.7-0.3V179.5z M404.6,184.2
	c-1.9,0-3.1,2-3.1,4.6c0,2.6,1.2,4.6,3.1,4.6s3.1-2,3.1-4.6C407.7,186.2,406.5,184.2,404.6,184.2z M400.2,198.8v3.8
	c0.4,1.2,0.6,2.6,0.7,4v-8.7l-2.1,0.5v0.7L400.2,198.8z M398,220.1c-0.3,0-0.5-0.1-0.7-0.2c-0.1,0.2-0.2,0.3-0.4,0.5
	c0,0,0,0-0.1,0.1c0.4,0.2,0.8,0.3,1.2,0.3c1.9,0,3.1-2,3.1-4.6c0-1.1-0.2-2.2-0.7-2.9c-0.1,0.4-0.2,0.7-0.3,1.1
	c0.2,0.5,0.2,1.2,0.2,1.8C400.4,218.4,399.5,220.1,398,220.1z M396.7,229.9c0,2.6,1.2,4.6,3.1,4.6c1.9,0,3.1-2,3.1-4.6
	s-1.2-4.6-3.1-4.6C397.9,225.3,396.7,227.3,396.7,229.9z M398.8,175.1c0,2.6,1.2,4.6,3.1,4.6c1.9,0,3.1-2,3.1-4.6
	c0-0.7-0.1-1.3-0.2-1.9c-0.3-0.1-0.5-0.2-0.8-0.2c0.2,0.6,0.3,1.3,0.3,2.1c0,2.2-0.9,3.9-2.4,3.9s-2.4-1.7-2.4-3.9
	c0-1.2,0.3-2.3,0.8-3c-0.2,0-0.5-0.1-0.7-0.1C399,172.7,398.8,173.8,398.8,175.1z M398.6,184.2l-2.1,0.5v0.7l1.4-0.4v8.2h0.7V184.2z
	 M390.7,175.1c0,2.6,1.2,4.6,3.1,4.6c1.9,0,3.1-2,3.1-4.6c0-1.6-0.5-3-1.3-3.8c-1.1-0.1-2.1-0.3-3.2-0.3
	C391.4,171.6,390.7,173.2,390.7,175.1z M388,188.8c0,1.6,0.5,3,1.3,3.8c0.9,0.2,1.7,0.4,2.5,0.7c1.5-0.4,2.4-2.2,2.4-4.5
	c0-2.6-1.2-4.6-3.1-4.6C389.2,184.2,388,186.2,388,188.8z M385.8,171.7l1.4-0.4v8.2h0.7v-8.9c-0.2,0-0.4,0-0.5,0l-1.5,0.4V171.7z
	 M385.3,195.3h-17v26.5h17c4,0,7.1-1.2,9.3-3.6c2.2-2.4,3.3-5.7,3.3-9.9c0-4.1-1.1-7.3-3.3-9.6C392.4,196.5,389.3,195.3,385.3,195.3
	z M393.1,226.2v8.2h0.7v-9l-2.1,0.5v0.7L393.1,226.2z M390.3,239.9v8.2h0.7v-9l-2.1,0.5v0.7L390.3,239.9z M383,185.5l1.4-0.4v7.1
	h0.7v-8l-2.1,0.5V185.5z M380.3,171.7l1.4-0.4v8.2h0.7v-8.9h-0.4l-1.6,0.4V171.7z M377.5,185.5l1.4-0.4v7.1h0.7v-8l-2.1,0.5V185.5z
	 M374.8,171.7l1.4-0.4v8.2h0.7v-8.9h-0.4l-1.6,0.4V171.7z M372.1,184.2c-1.9,0-3.1,2-3.1,4.6c0,1.4,0.3,2.6,0.9,3.4h0.9
	c-0.7-0.7-1.1-1.9-1.1-3.4c0-2.2,0.9-3.9,2.4-3.9c1.5,0,2.4,1.7,2.4,3.9c0,1.5-0.4,2.7-1.1,3.4h0.9c0.6-0.8,0.9-2,0.9-3.4
	C375.2,186.2,374,184.2,372.1,184.2z M366.3,175.1c0,2.6,1.2,4.6,3.1,4.6s3.1-2,3.1-4.6c0-2.2-0.9-4-2.3-4.4h-1.6
	C367.2,171.1,366.3,172.8,366.3,175.1z M364.1,185.5l1.4-0.4v7.1h0.7v-8l-2.1,0.5V185.5z M361.3,202.5c0,2.6,1.2,4.6,3.1,4.6
	c0.2,0,0.5,0,0.7-0.1v-0.7c-0.2,0.1-0.4,0.1-0.7,0.1c-1.5,0-2.4-1.7-2.4-3.9c0-2.2,0.9-3.9,2.4-3.9c0.2,0,0.5,0,0.7,0.1V198
	c-0.2-0.1-0.4-0.1-0.7-0.1C362.6,197.9,361.3,199.9,361.3,202.5z M362.9,212.5v8.2h0.7v-9l-2.1,0.5v0.7L362.9,212.5z M360.8,226.2
	v8.2h0.7v-9l-2.1,0.5v0.7L360.8,226.2z M359.2,171.7l1.4-0.4v8.2h0.7v-8.9h-0.4l-1.6,0.4V171.7z M356,253.6v8.2h0.7v-9l-2.1,0.5v0.7
	L356,253.6z M357,243.6c0-2.6-1.2-4.6-3.1-4.6c-1.9,0-3.1,2-3.1,4.6s1.2,4.6,3.1,4.6C355.7,248.2,357,246.2,357,243.6z M349.9,226.2
	v8.2h0.7v-9l-2.1,0.5v0.7L349.9,226.2z M349.4,212.5v8.2h0.7v-9l-2.1,0.5v0.7L349.4,212.5z M351,207.1c1.9,0,3.1-2,3.1-4.6
	s-1.2-4.6-3.1-4.6c-1.9,0-3.1,2-3.1,4.6S349.1,207.1,351,207.1z M355.4,226.2v8.2h0.7v-9l-2.1,0.5v0.7L355.4,226.2z M359.2,216.2
	c0-2.6-1.2-4.6-3.1-4.6c-1.9,0-3.1,2-3.1,4.6c0,2.6,1.2,4.6,3.1,4.6C358,220.8,359.2,218.8,359.2,216.2z M358.4,197.9l-2.1,0.5v0.7
	l1.4-0.4v8.2h0.7V197.9z M358.3,184.2l-2.1,0.5v0.7l1.4-0.4v8.2h0.7V184.2z M350.7,175.1c0,2.6,1.2,4.6,3.1,4.6s3.1-2,3.1-4.6
	c0-2.2-0.9-4-2.3-4.4H353C351.6,171.1,350.7,172.8,350.7,175.1z M347.7,188.8c0,2.6,1.2,4.6,3.1,4.6c1.9,0,3.1-2,3.1-4.6
	c0-2.6-1.2-4.6-3.1-4.6C348.9,184.2,347.7,186.2,347.7,188.8z M342.7,175.1c0,2.6,1.2,4.6,3.1,4.6c1.9,0,3.1-2,3.1-4.6
	c0-2.2-0.9-4-2.3-4.4H345C343.6,171.1,342.7,172.8,342.7,175.1z M339.5,216.2c0,2.6,1.2,4.6,3.1,4.6c1.9,0,3.1-2,3.1-4.6
	c0-2.6-1.2-4.6-3.1-4.6C340.8,211.6,339.5,213.6,339.5,216.2z M342.9,207.1c1.9,0,3.1-2,3.1-4.6s-1.2-4.6-3.1-4.6
	c-1.9,0-3.1,2-3.1,4.6S341.1,207.1,342.9,207.1z M340,229.9c0,2.6,1.2,4.6,3.1,4.6c1.9,0,3.1-2,3.1-4.6s-1.2-4.6-3.1-4.6
	C341.2,225.3,340,227.3,340,229.9z M339.7,188.8c0,2.6,1.2,4.6,3.1,4.6c1.9,0,3.1-2,3.1-4.6c0-2.6-1.2-4.6-3.1-4.6
	C340.9,184.2,339.7,186.2,339.7,188.8z M334.7,175.1c0,2.6,1.2,4.6,3.1,4.6s3.1-2,3.1-4.6c0-2.2-0.9-4-2.3-4.4H337
	C335.6,171.1,334.7,172.8,334.7,175.1z M334.7,193.3c0,0,0.1,0,0.1,0c1.9,0,3.1-2,3.1-4.6c0-2.6-1.2-4.6-3.1-4.6c0,0-0.1,0-0.1,0
	v0.7c0,0,0.1,0,0.1,0c1.5,0,2.4,1.7,2.4,3.9c0,2.2-0.9,3.9-2.4,3.9c0,0-0.1,0-0.1,0V193.3z M334.7,199l0.7-0.2v8.2h0.7v-9l-1.4,0.4
	V199z M334.7,220.8c1.9,0,3.1-2,3.1-4.6c0-2.6-1.2-4.5-3.1-4.6v0.7c1.5,0,2.4,1.7,2.4,3.9c0,2.2-0.9,3.9-2.4,3.9V220.8z
	 M336.8,226.2v8.2h0.7v-9l-2.1,0.5v0.7L336.8,226.2z M334.7,261.4c1-0.7,1.6-2.3,1.6-4.1c0-1.8-0.6-3.3-1.6-4.1v0.9
	c0.6,0.7,0.9,1.8,0.9,3.1c0,1.3-0.3,2.4-0.9,3.1V261.4z M336.4,266.5l-1.7,0.4v0.7l1-0.3v8.1h0.7V266.5z M337.8,248.2
	c1.9,0,3.1-2,3.1-4.6s-1.2-4.6-3.1-4.6c-1.9,0-3.1,2-3.1,4.6S335.9,248.2,337.8,248.2z M341.2,261.9c1.9,0,3.1-2,3.1-4.6
	c0-2.6-1.2-4.6-3.1-4.6c-1.9,0-3.1,2-3.1,4.6C338.1,260,339.3,261.9,341.2,261.9z M345.8,271.1c0-2.6-1.2-4.6-3.1-4.6
	c-1.9,0-3.1,2-3.1,4.6c0,2.1,0.8,3.8,2.1,4.4h1.9C345,274.9,345.8,273.2,345.8,271.1z M345.8,248.2c1.9,0,3.1-2,3.1-4.6
	s-1.2-4.6-3.1-4.6c-1.9,0-3.1,2-3.1,4.6S343.9,248.2,345.8,248.2z M350.2,266.5l-2.1,0.5v0.7l1.4-0.4v8.1h0.7V266.5z M352.3,257.4
	c0-2.6-1.2-4.6-3.1-4.6c-1.9,0-3.1,2-3.1,4.6c0,2.6,1.2,4.6,3.1,4.6C351.1,261.9,352.3,260,352.3,257.4z M359.3,271.1
	c0-2.6-1.2-4.6-3.1-4.6c-1.9,0-3.1,2-3.1,4.6c0,2.1,0.8,3.8,2.1,4.4h1.9C358.5,274.9,359.3,273.2,359.3,271.1z M361.9,248.2
	c1.9,0,3.1-2,3.1-4.6s-1.2-4.6-3.1-4.6c-1.9,0-3.1,2-3.1,4.6S360,248.2,361.9,248.2z M360.1,254l1.4-0.4v8.2h0.7v-9l-2.1,0.5V254z
	 M365.1,266.7c-0.3-0.1-0.6-0.2-0.9-0.2c-1.9,0-3.1,2-3.1,4.6c0,2.1,0.8,3.8,2.1,4.4h1.9v-0.7c-0.3,0.2-0.6,0.3-0.9,0.3
	c-1.5,0-2.4-1.7-2.4-3.9s0.9-3.9,2.4-3.9c0.3,0,0.7,0.1,0.9,0.3V266.7z M367,225.4l-2.1,0.5v0.7l1.4-0.4v8.2h0.7V225.4z
	 M369.3,239.1l-2.1,0.5v0.7l1.4-0.4v6.7h0.7V239.1z M375.4,234.5c1.9,0,3.1-2,3.1-4.6s-1.2-4.6-3.1-4.6c-1.9,0-3.1,2-3.1,4.6
	S373.5,234.5,375.4,234.5z M381.1,243.6c0-2.6-1.2-4.6-3.1-4.6c-1.9,0-3.1,2-3.1,4.6c0,1.1,0.2,2.2,0.7,2.9h0.8
	c-0.5-0.7-0.7-1.8-0.7-2.9c0-2.2,0.9-3.9,2.4-3.9c1.5,0,2.4,1.7,2.4,3.9c0,1.2-0.3,2.2-0.7,2.9h0.8
	C380.9,245.8,381.1,244.8,381.1,243.6z M382.8,225.4l-2.1,0.5v0.7l1.4-0.4v8.2h0.7V225.4z M385.5,239.1l-2.1,0.5v0.7l1.4-0.4v8.1
	l0,0h0.7V239.1z M388.3,225.4l-2.1,0.5v0.7l1.4-0.4v8.2h0.7V225.4z M394.7,257.4c0-2.6-1.2-4.6-3.1-4.6c-1.6,0-2.7,1.4-3,3.4
	l0.6,1.3c0,0,0-0.1,0-0.1c0-2.2,0.9-3.9,2.4-3.9c1.5,0,2.4,1.7,2.4,3.9c0,2.2-0.9,3.9-2.4,3.9c-0.3,0-0.5-0.1-0.7-0.1l0.4,0.8
	c0.1,0,0.2,0,0.3,0C393.4,261.9,394.7,260,394.7,257.4z M396.5,239.1l-2.1,0.5v0.7l1.4-0.4v8.2h0.7V239.1z M396.5,257.4
	c0,2.6,1.2,4.6,3.1,4.6c1.9,0,3.1-2,3.1-4.6c0-2.6-1.2-4.6-3.1-4.6C397.7,252.8,396.5,254.7,396.5,257.4z M403.1,271.1
	c0-2.6-1.2-4.6-3.1-4.6c-1.9,0-3.1,2-3.1,4.6c0,2.1,0.8,3.8,2.1,4.4h1.9C402.3,274.9,403.1,273.2,403.1,271.1z M405.6,243.6
	c0-2.6-1.2-4.6-3.1-4.6c-1.9,0-3.1,2-3.1,4.6s1.2,4.6,3.1,4.6C404.4,248.2,405.6,246.2,405.6,243.6z M405,254l1.4-0.4v8.2h0.7v-9
	l-2.1,0.5V254z M407.5,266.5l-2.1,0.5v0.7l1.4-0.4v8.1h0.7V266.5z M410.5,248.2c1.4,0,2.4-1,2.8-2.6l-0.5-0.8
	c-0.3,1.6-1.1,2.8-2.3,2.8c-1.5,0-2.4-1.7-2.4-3.9c0-2.2,0.9-3.9,2.4-3.9c0.7,0,1.2,0.3,1.6,0.9l0.6-0.3c-0.5-0.7-1.3-1.2-2.2-1.2
	c-1.9,0-3.1,2-3.1,4.6S408.6,248.2,410.5,248.2z M413,266.5l-2.1,0.5v0.7l1.4-0.4v8.1h0.7V266.5z M416.2,257.4
	c0-2.6-1.2-4.6-3.1-4.6c-1.9,0-3.1,2-3.1,4.6c0,2.6,1.2,4.6,3.1,4.6C414.9,261.9,416.2,260,416.2,257.4z M418.4,266.5l-2.1,0.5v0.7
	l1.4-0.4v8.1h0.7V266.5z M420.5,257.6l-0.7-1.2v5.4h0.7V257.6z M427.6,271.1c0-2.6-1.2-4.6-3.1-4.6c-1.9,0-3.1,2-3.1,4.6
	c0,2.1,0.8,3.8,2.1,4.4h1.9C426.7,274.9,427.6,273.2,427.6,271.1z M345.8,179c1.5,0,2.4-1.7,2.4-3.9c0-2.2-0.9-3.9-2.4-3.9
	s-2.4,1.7-2.4,3.9C343.4,177.3,344.3,179,345.8,179z M424.5,267.1c-1.5,0-2.4,1.7-2.4,3.9s0.9,3.9,2.4,3.9c1.5,0,2.4-1.7,2.4-3.9
	S426,267.1,424.5,267.1z M343.6,257.4c0-2.2-0.9-3.9-2.4-3.9c-1.5,0-2.4,1.7-2.4,3.9c0,2.2,0.9,3.9,2.4,3.9
	C342.7,261.3,343.6,259.6,343.6,257.4z M88.5,308.1c1.7-0.6,2.9-1.5,3.8-2.8c0.9-1.3,1.3-2.9,1.3-4.8c0-2.5-0.8-4.5-2.4-5.9
	c-1.6-1.4-4-2.1-7-2.1H75v23.7h3.2v-7.4h6c0.3,0,0.8,0,1.3-0.1l4.7,7.4v0H94L88.5,308.1z M84.3,305.8h-6v-10.4h6
	c2,0,3.6,0.4,4.7,1.3s1.6,2.1,1.6,3.8c0,1.7-0.5,3-1.6,3.9C87.9,305.3,86.3,305.8,84.3,305.8z M115.5,307.4c0-2.9-0.7-5.2-2.1-6.8
	c-1.4-1.6-3.5-2.4-6.3-2.5c-1.7,0-3.3,0.4-4.6,1.2c-1.4,0.8-2.4,1.8-3.2,3.2c-0.8,1.4-1.1,2.9-1.1,4.7c0,1.8,0.4,3.3,1.1,4.7
	c0.7,1.4,1.8,2.4,3.2,3.2c1.4,0.8,2.9,1.1,4.7,1.1c1.5,0,2.9-0.3,4.1-0.8c1.2-0.5,2.3-1.3,3.2-2.2l-1.7-1.8
	c-0.7,0.7-1.5,1.2-2.4,1.6c-0.9,0.4-1.9,0.6-3,0.6c-1.6,0-2.9-0.5-4-1.4c-1.1-1-1.8-2.2-2-3.8h14.1
	C115.5,308.2,115.5,307.8,115.5,307.4z M112.6,306h-11.4c0.2-1.6,0.8-2.9,1.9-3.8c1-1,2.4-1.4,3.9-1.4c1.6,0,2.9,0.5,3.9,1.4
	C112,303,112.6,304.3,112.6,306L112.6,306z M127.8,301.1c-0.9-0.3-1.7-0.4-2.6-0.4c-0.9,0-1.7,0.2-2.3,0.5c-0.6,0.3-0.9,0.9-0.9,1.6
	s0.3,1.3,1,1.6c0.6,0.4,1.6,0.7,2.9,1.1c1.2,0.4,2.3,0.7,3,1.1s1.5,0.9,2,1.6c0.6,0.7,0.8,1.6,0.8,2.8c0,1.7-0.6,3-1.9,3.8
	c-1.3,0.9-2.9,1.3-4.8,1.3c-1.3,0-2.6-0.2-3.9-0.6s-2.3-1-3.2-1.8l1.2-2.3c0.7,0.7,1.7,1.2,2.8,1.6c1.1,0.4,2.2,0.6,3.2,0.6
	c1,0,1.9-0.2,2.5-0.6c0.6-0.4,0.9-1,0.9-1.8c0-0.8-0.3-1.4-1-1.8c-0.7-0.4-1.7-0.8-3-1.2c-1.2-0.3-2.2-0.7-2.9-1
	c-0.8-0.3-1.4-0.9-1.9-1.5c-0.5-0.7-0.8-1.6-0.8-2.6c0-1.7,0.6-2.9,1.8-3.8c1.2-0.8,2.7-1.3,4.6-1.3c1.1,0,2.1,0.2,3.2,0.5
	c1,0.3,2,0.7,2.7,1.2l-1.1,2.4C129.5,301.7,128.7,301.4,127.8,301.1z M152.4,307.4c0-2.9-0.7-5.2-2.1-6.8c-1.4-1.6-3.5-2.4-6.3-2.5
	c-1.7,0-3.3,0.4-4.6,1.2c-1.4,0.8-2.4,1.8-3.2,3.2c-0.8,1.4-1.1,2.9-1.1,4.7c0,1.8,0.4,3.3,1.1,4.7c0.7,1.4,1.8,2.4,3.2,3.2
	s2.9,1.1,4.7,1.1c1.5,0,2.9-0.3,4.1-0.8c1.2-0.5,2.3-1.3,3.2-2.2l-1.7-1.8c-0.7,0.7-1.5,1.2-2.4,1.6c-0.9,0.4-1.9,0.6-3,0.6
	c-1.6,0-2.9-0.5-4-1.4c-1.1-1-1.8-2.2-2-3.8h14.1C152.4,308.2,152.4,307.8,152.4,307.4z M149.6,306h-11.4c0.2-1.6,0.8-2.9,1.9-3.8
	c1-1,2.4-1.4,3.9-1.4c1.6,0,2.9,0.5,3.9,1.4C148.9,303,149.5,304.3,149.6,306L149.6,306z M168.4,316.1h3.1l0-11.8
	c0-2-0.6-3.5-1.9-4.6c-1.2-1.1-2.9-1.6-5.2-1.6c-1.5,0-2.8,0.2-3.9,0.6c-1.1,0.4-2.3,1-3.6,1.8l1.3,2.2c1.9-1.3,3.7-1.9,5.5-1.9
	c1.5,0,2.6,0.3,3.4,1c0.8,0.7,1.2,1.7,1.2,2.9v0.8h-5.7c-2.1,0-3.8,0.5-5,1.4c-1.2,0.9-1.8,2.2-1.8,3.8c0,1,0.3,2,0.8,2.8
	c0.5,0.8,1.2,1.5,2.2,2c0.9,0.5,2,0.7,3.3,0.7c2.8,0,4.9-0.9,6.3-2.6V316.1L168.4,316.1z M168.3,309.7c-0.2,1.2-0.8,2.1-1.8,2.8
	c-1,0.7-2.3,1.1-3.7,1c-1.2,0-2.1-0.3-2.8-0.8c-0.7-0.5-1-1.3-1-2.2c0-0.9,0.3-1.6,1-2c0.7-0.4,1.7-0.6,3.2-0.6h5.2V309.7z
	 M183.5,299.2c1.1-0.7,2.4-1,3.8-1v3c-1.8-0.1-3.3,0.4-4.4,1.4c-1.1,1-1.8,2.4-1.9,4.1v9.4h-3.1v-17.9h3.1v3.8
	C181.6,300.8,182.4,299.8,183.5,299.2z M198.9,300.9c-1.2,0-2.2,0.3-3.1,0.8c-0.9,0.5-1.6,1.3-2.1,2.2c-0.5,0.9-0.8,2-0.8,3.3
	c0,1.2,0.3,2.3,0.8,3.3c0.5,0.9,1.2,1.7,2.1,2.2c0.9,0.5,1.9,0.8,3.1,0.8c1.1,0,2.2-0.2,3.1-0.6c0.9-0.4,1.7-0.9,2.3-1.7l1.8,1.8
	c-0.8,1-1.8,1.8-3.1,2.3c-1.3,0.5-2.7,0.8-4.2,0.8c-1.7,0-3.3-0.4-4.6-1.1c-1.4-0.8-2.4-1.8-3.2-3.2c-0.8-1.4-1.1-2.9-1.1-4.7
	s0.4-3.3,1.1-4.7c0.8-1.4,1.8-2.4,3.2-3.2s2.9-1.1,4.6-1.1c1.5,0,2.9,0.2,4.1,0.7s2.2,1.1,3,2l-1.7,2.2
	C202.6,301.6,200.9,300.9,198.9,300.9z M226.3,300c1.2,1.2,1.8,2.9,1.8,5.1v11.1H225v-10.2c0-1.5-0.4-2.7-1.3-3.5s-2-1.3-3.5-1.3
	c-1.7,0-3.1,0.6-4.1,1.8c-1,1.1-1.5,2.6-1.5,4.5v8.8h-3.1V291h3.1v11.1c1.2-2.6,3.5-3.9,6.8-4C223.5,298.1,225.1,298.7,226.3,300z
	 M244.4,292.4h3.2v23.7h-3.2V292.4z M269.7,300c1.2,1.2,1.8,2.9,1.8,5.1v11.1h-3.1v-10.2c0-1.5-0.4-2.7-1.3-3.5s-2-1.3-3.5-1.3
	c-1.6,0-2.9,0.5-3.9,1.5c-1,1-1.6,2.3-1.7,3.9v9.6h-3.1v-17.9h3.1v3.8c1.2-2.5,3.5-3.8,6.8-3.9C266.9,298.1,268.5,298.7,269.7,300z
	 M282.4,294.4c-0.5,0.5-0.8,1.2-0.8,2.1v2.3h4.9v2.4h-4.9v14.9h-3.1v-14.9h-2.3v-2.4h2.3v-1.9c0-1.3,0.3-2.4,0.8-3.3
	c0.6-0.9,1.3-1.6,2.2-2.1s1.9-0.7,2.9-0.7c1,0,2,0.3,3.1,0.8l-0.7,2.6c-0.8-0.4-1.6-0.6-2.3-0.6C283.6,293.6,283,293.9,282.4,294.4z
	 M305.3,302.5c-0.8-1.4-1.9-2.4-3.2-3.2c-1.4-0.8-3-1.1-4.8-1.1c-1.8,0-3.4,0.4-4.8,1.1c-1.4,0.8-2.5,1.8-3.2,3.2
	c-0.8,1.4-1.2,2.9-1.2,4.7c0,1.8,0.4,3.4,1.2,4.7c0.8,1.4,1.9,2.4,3.2,3.2c1.4,0.8,3,1.1,4.8,1.1c1.8,0,3.4-0.4,4.8-1.1
	c1.4-0.8,2.5-1.8,3.2-3.2c0.8-1.4,1.2-2.9,1.2-4.7C306.4,305.4,306,303.8,305.3,302.5z M302.5,310.5c-0.5,1-1.2,1.7-2.1,2.2
	c-0.9,0.5-1.9,0.8-3.1,0.8c-1.2,0-2.2-0.3-3.1-0.8c-0.9-0.5-1.6-1.3-2.1-2.2c-0.5-1-0.8-2.1-0.8-3.3c0-1.2,0.3-2.3,0.8-3.3
	s1.2-1.7,2.1-2.2c0.9-0.5,2-0.8,3.1-0.8c1.1,0,2.2,0.3,3.1,0.8c0.9,0.5,1.6,1.3,2.1,2.2s0.8,2,0.8,3.3
	C303.3,308.4,303,309.5,302.5,310.5z M317.2,299.2c1.1-0.7,2.4-1,3.8-1v3c-1.8-0.1-3.3,0.4-4.4,1.4c-1.1,1-1.8,2.4-1.9,4.1v9.4h-3.1
	v-17.9h3.1v3.8C315.3,300.8,316.1,299.8,317.2,299.2z M353.2,300c1.2,1.2,1.8,2.9,1.8,5.1v11.1h-3.2v-10.2c0-1.5-0.4-2.7-1.2-3.5
	c-0.8-0.9-2-1.3-3.4-1.3c-1.7,0-3,0.6-4,1.8c-1,1.1-1.5,2.6-1.5,4.4v8.8h-3.2v-10.2c0-1.5-0.4-2.7-1.2-3.5s-2-1.3-3.4-1.3
	c-1.7,0-3,0.6-4,1.8c-1,1.1-1.5,2.6-1.5,4.4v8.8h-3.1v-17.9h3.1v3.8c1.2-2.5,3.4-3.8,6.7-3.8c1.6,0,3,0.4,4.1,1.2
	c1.1,0.8,1.8,1.9,2.2,3.3c1.1-3,3.4-4.5,7-4.5C350.4,298.1,352,298.7,353.2,300z M372.2,316.1h3.1l0-11.8c0-2-0.6-3.5-1.9-4.6
	c-1.2-1.1-2.9-1.6-5.2-1.6c-1.5,0-2.8,0.2-3.9,0.6s-2.3,1-3.6,1.8l1.3,2.2c1.9-1.3,3.7-1.9,5.5-1.9c1.5,0,2.6,0.3,3.4,1
	c0.8,0.7,1.2,1.7,1.2,2.9v0.8h-5.7c-2.1,0-3.8,0.5-5,1.4c-1.2,0.9-1.8,2.2-1.8,3.8c0,1,0.3,2,0.8,2.8c0.5,0.8,1.2,1.5,2.2,2
	c0.9,0.5,2,0.7,3.3,0.7c2.8,0,4.9-0.9,6.3-2.6V316.1L372.2,316.1z M372.2,309.7c-0.2,1.2-0.8,2.1-1.8,2.8c-1,0.7-2.3,1.1-3.7,1
	c-1.2,0-2.1-0.3-2.8-0.8c-0.7-0.5-1-1.3-1-2.2c0-0.9,0.3-1.6,1-2c0.7-0.4,1.7-0.6,3.2-0.6h5.2V309.7z M391.3,314.9
	c-1.4,0.9-2.8,1.3-4.2,1.3c-1.4,0-2.6-0.4-3.5-1.3c-0.9-0.8-1.3-2.1-1.3-3.8v-9.9h-2.5v-2.4h2.5V294h3.2v4.8h5.5v2.4h-5.5v9.3
	c0,1,0.2,1.7,0.5,2.1c0.4,0.4,0.9,0.6,1.6,0.6c0.9,0,1.8-0.3,2.8-0.8L391.3,314.9z M398.8,291.7c0.4,0.4,0.6,0.9,0.6,1.5
	c0,0.6-0.2,1.1-0.6,1.5c-0.4,0.4-0.8,0.6-1.4,0.6c-0.6,0-1-0.2-1.4-0.6c-0.4-0.4-0.6-0.9-0.6-1.5c0-0.6,0.2-1.1,0.6-1.5
	c0.4-0.4,0.8-0.6,1.4-0.6C398,291.1,398.4,291.3,398.8,291.7z M395.8,298.2h3.1v17.9h-3.1V298.2z M413.3,300.9
	c-1.2,0-2.2,0.3-3.1,0.8c-0.9,0.5-1.6,1.3-2.1,2.2c-0.5,0.9-0.8,2-0.8,3.3c0,1.2,0.3,2.3,0.8,3.3c0.5,0.9,1.2,1.7,2.1,2.2
	c0.9,0.5,1.9,0.8,3.1,0.8c1.1,0,2.2-0.2,3.1-0.6c0.9-0.4,1.7-0.9,2.3-1.7l1.8,1.8c-0.8,1-1.8,1.8-3.1,2.3c-1.3,0.5-2.7,0.8-4.2,0.8
	c-1.7,0-3.3-0.4-4.6-1.1c-1.4-0.8-2.4-1.8-3.2-3.2c-0.8-1.4-1.1-2.9-1.1-4.7s0.4-3.3,1.1-4.7c0.8-1.4,1.8-2.4,3.2-3.2
	c1.4-0.8,2.9-1.1,4.6-1.1c1.5,0,2.9,0.2,4.1,0.7c1.2,0.5,2.2,1.1,3,2l-1.7,2.2C417,301.6,415.3,300.9,413.3,300.9z M432.9,301.1
	c-0.9-0.3-1.7-0.4-2.6-0.4c-0.9,0-1.7,0.2-2.3,0.5c-0.6,0.3-0.9,0.9-0.9,1.6s0.3,1.3,1,1.6c0.6,0.4,1.6,0.7,2.9,1.1
	c1.2,0.4,2.3,0.7,3,1.1s1.5,0.9,2,1.6c0.6,0.7,0.8,1.6,0.8,2.8c0,1.7-0.6,3-1.9,3.8c-1.3,0.9-2.9,1.3-4.8,1.3
	c-1.3,0-2.6-0.2-3.9-0.6c-1.3-0.4-2.3-1-3.2-1.8l1.2-2.3c0.7,0.7,1.7,1.2,2.8,1.6c1.1,0.4,2.2,0.6,3.2,0.6c1,0,1.9-0.2,2.5-0.6
	c0.6-0.4,0.9-1,0.9-1.8c0-0.8-0.3-1.4-1-1.8c-0.7-0.4-1.7-0.8-3-1.2c-1.2-0.3-2.2-0.7-2.9-1c-0.8-0.3-1.4-0.9-1.9-1.5
	c-0.5-0.7-0.8-1.6-0.8-2.6c0-1.7,0.6-2.9,1.8-3.8c1.2-0.8,2.7-1.3,4.6-1.3c1.1,0,2.1,0.2,3.2,0.5c1,0.3,2,0.7,2.7,1.2l-1.1,2.4
	C434.6,301.7,433.8,301.4,432.9,301.1z M87.2,325c-1.2-0.4-2.3-0.6-3.3-0.6c-1.4,0-2.5,0.3-3.3,0.8c-0.8,0.6-1.2,1.3-1.2,2.3
	c0,0.9,0.3,1.6,0.8,2.1c0.5,0.6,1.2,1,1.9,1.3c0.7,0.3,1.8,0.7,3.1,1.1c1.6,0.5,3,1,4,1.5c1,0.5,1.9,1.2,2.6,2.1
	c0.7,0.9,1.1,2.2,1.2,3.7c0.1,1.4-0.3,2.7-1,3.7c-0.7,1.1-1.7,1.9-3,2.5c-1.3,0.6-2.8,0.9-4.6,0.9c-1.7,0-3.5-0.3-5.2-1.1
	s-3.2-1.7-4.4-2.8l1.4-2.9c1.2,1.2,2.5,2.1,3.9,2.7s2.8,0.9,4.2,0.9c1.6,0,2.8-0.3,3.7-1c0.9-0.7,1.3-1.5,1.3-2.6
	c0-0.9-0.3-1.6-0.8-2.2c-0.5-0.6-1.2-1-1.9-1.4c-0.8-0.3-1.8-0.7-3.1-1.1c-1.6-0.5-2.9-1-3.9-1.5c-1-0.5-1.9-1.2-2.6-2.1
	c-0.7-0.9-1.1-2.1-1.2-3.7c0-1.3,0.3-2.5,0.9-3.5c0.7-1,1.6-1.8,2.9-2.3c1.3-0.5,2.7-0.8,4.4-0.8c1.4,0,2.8,0.2,4.2,0.7
	c1.4,0.4,2.6,1,3.7,1.8l-1.2,3.1C89.6,325.9,88.4,325.3,87.2,325z M119.7,330.2c1.2,1.2,1.8,2.9,1.8,5.1v11h-3.1v-10.2
	c0-1.5-0.4-2.7-1.3-3.5c-0.8-0.8-2-1.3-3.5-1.3c-1.7,0-3.1,0.6-4.1,1.7c-1,1.1-1.5,2.6-1.5,4.4v8.7h-3.1v-25h3.1v11
	c1.2-2.6,3.5-3.9,6.8-3.9C116.8,328.4,118.5,329,119.7,330.2z M147.7,346.3l0-11.7c0-2-0.6-3.5-1.8-4.6c-1.2-1.1-2.9-1.6-5.1-1.6
	c-1.5,0-2.8,0.2-3.9,0.6s-2.3,1-3.5,1.8l1.3,2.1c1.9-1.3,3.7-1.9,5.5-1.9c1.5,0,2.6,0.3,3.4,1c0.8,0.7,1.2,1.7,1.2,2.9v0.8h-5.6
	c-2.1,0-3.7,0.5-4.9,1.4c-1.2,0.9-1.8,2.2-1.8,3.8c0,1,0.3,2,0.8,2.8c0.5,0.8,1.2,1.5,2.1,2c0.9,0.5,2,0.7,3.2,0.7
	c2.8,0,4.9-0.9,6.2-2.6v2.5H147.7z M144.6,340c-0.2,1.2-0.8,2.1-1.8,2.8c-1,0.7-2.3,1.1-3.7,1c-1.2,0-2.1-0.3-2.8-0.8
	c-0.7-0.5-1-1.3-1-2.2s0.3-1.6,1-2c0.7-0.4,1.7-0.6,3.1-0.6h5.2V340z M165.6,329.4c1.1-0.7,2.4-1,3.8-1v3c-1.8-0.1-3.3,0.4-4.4,1.4
	c-1.1,1-1.8,2.4-1.9,4.1v9.4H160v-17.8h3.1v3.8C163.7,331.1,164.6,330.1,165.6,329.4z M195.1,337.6c0-2.9-0.7-5.2-2.1-6.8
	c-1.4-1.6-3.5-2.4-6.2-2.4c-1.7,0-3.3,0.4-4.6,1.2c-1.4,0.8-2.4,1.8-3.1,3.2c-0.7,1.4-1.1,2.9-1.1,4.7c0,1.7,0.4,3.3,1.1,4.7
	s1.8,2.4,3.2,3.2c1.4,0.7,2.9,1.1,4.7,1.1c1.5,0,2.9-0.3,4.1-0.8c1.2-0.5,2.3-1.2,3.2-2.2l-1.7-1.8c-0.7,0.7-1.5,1.2-2.4,1.6
	c-0.9,0.4-1.9,0.6-2.9,0.6c-1.6,0-2.9-0.5-4-1.4c-1.1-0.9-1.8-2.2-2-3.8h14.1C195.1,338.4,195.1,338.1,195.1,337.6z M181,336.2
	c0.2-1.6,0.8-2.9,1.9-3.8c1-0.9,2.4-1.4,3.9-1.4c1.6,0,2.9,0.5,3.9,1.4c1,0.9,1.5,2.2,1.6,3.8H181z M219.6,321.3V332
	c-0.7-1.2-1.5-2.1-2.7-2.7c-1.1-0.6-2.5-0.9-4-0.9c-1.7,0-3.1,0.4-4.4,1.1c-1.3,0.8-2.3,1.8-3,3.2c-0.7,1.4-1.1,2.9-1.1,4.7
	c0,1.8,0.4,3.4,1.1,4.7c0.7,1.4,1.7,2.5,3,3.2c1.3,0.8,2.8,1.2,4.5,1.2c1.5,0,2.8-0.3,4-1c1.1-0.6,2-1.5,2.7-2.7v3.5h3.1v-25v0
	H219.6z M218.8,340.7c-0.5,1-1.2,1.7-2.1,2.3c-0.9,0.5-1.9,0.8-3.1,0.8c-1.2,0-2.2-0.3-3.1-0.8c-0.9-0.5-1.6-1.3-2.1-2.3
	c-0.5-1-0.8-2.1-0.8-3.3s0.3-2.3,0.8-3.3c0.5-1,1.2-1.7,2.1-2.3c0.9-0.5,1.9-0.8,3.1-0.8c1.2,0,2.2,0.3,3.1,0.8
	c0.9,0.5,1.6,1.3,2.1,2.3c0.5,1,0.8,2.1,0.8,3.3C219.6,338.7,219.3,339.7,218.8,340.7z M260.4,346.3l-5.5-8c1.7-0.6,2.9-1.5,3.8-2.8
	s1.3-2.9,1.3-4.8c0-2.5-0.8-4.5-2.4-5.9c-1.6-1.4-3.9-2.1-6.9-2.1h-9.2v23.5h3.2V339h6c0.3,0,0.8,0,1.3-0.1l4.7,7.4v0H260.4z
	 M250.7,336L250.7,336l-6,0v-10.4h6c2,0,3.6,0.4,4.6,1.3c1.1,0.9,1.6,2.1,1.6,3.8c0,1.7-0.5,3-1.6,3.9
	C254.2,335.6,252.7,336,250.7,336z M287.7,337.6c0-2.9-0.7-5.2-2.1-6.8c-1.4-1.6-3.5-2.4-6.2-2.4c-1.7,0-3.3,0.4-4.6,1.2
	c-1.4,0.8-2.4,1.8-3.1,3.2c-0.7,1.4-1.1,2.9-1.1,4.7c0,1.7,0.4,3.3,1.1,4.7c0.7,1.4,1.8,2.4,3.2,3.2c1.4,0.7,2.9,1.1,4.7,1.1
	c1.5,0,2.9-0.3,4.1-0.8c1.2-0.5,2.3-1.2,3.2-2.2l-1.7-1.8c-0.7,0.7-1.5,1.2-2.4,1.6c-0.9,0.4-1.9,0.6-2.9,0.6c-1.6,0-2.9-0.5-4-1.4
	c-1.1-0.9-1.8-2.2-2-3.8h14.1C287.7,338.4,287.7,338.1,287.7,337.6z M273.6,336.2c0.2-1.6,0.8-2.9,1.9-3.8c1-0.9,2.4-1.4,3.9-1.4
	c1.6,0,2.9,0.5,3.9,1.4c1,0.9,1.5,2.2,1.6,3.8H273.6z M306,331.4c-0.9-0.3-1.7-0.4-2.5-0.4c-0.9,0-1.7,0.2-2.3,0.5s-0.9,0.9-0.9,1.6
	c0,0.7,0.3,1.3,1,1.6c0.6,0.4,1.6,0.7,2.9,1.1c1.2,0.4,2.2,0.7,3,1.1s1.4,0.9,2,1.6c0.6,0.7,0.8,1.6,0.8,2.8c0,1.7-0.6,3-1.9,3.8
	c-1.3,0.9-2.8,1.3-4.7,1.3c-1.3,0-2.6-0.2-3.8-0.6c-1.2-0.4-2.3-1-3.1-1.8l1.2-2.3c0.7,0.7,1.7,1.2,2.7,1.6c1.1,0.4,2.1,0.6,3.2,0.6
	s1.9-0.2,2.5-0.6c0.6-0.4,0.9-1,0.9-1.7c0-0.8-0.3-1.4-1-1.8c-0.7-0.4-1.7-0.8-3-1.2c-1.2-0.3-2.2-0.7-2.9-1
	c-0.7-0.3-1.4-0.9-1.9-1.5c-0.5-0.7-0.8-1.5-0.8-2.6c0-1.7,0.6-2.9,1.8-3.7c1.2-0.8,2.7-1.2,4.5-1.2c1.1,0,2.1,0.2,3.2,0.5
	c1,0.3,1.9,0.7,2.7,1.2l-1.1,2.4C307.7,332,306.9,331.6,306,331.4z M336.3,332.7c-0.8-1.4-1.9-2.4-3.2-3.2c-1.4-0.8-3-1.1-4.7-1.1
	c-1.8,0-3.4,0.4-4.8,1.1c-1.4,0.8-2.5,1.8-3.2,3.2c-0.8,1.4-1.2,2.9-1.2,4.7c0,1.8,0.4,3.3,1.2,4.7c0.8,1.4,1.9,2.4,3.2,3.2
	c1.4,0.8,3,1.1,4.8,1.1c1.8,0,3.4-0.4,4.7-1.1c1.4-0.8,2.5-1.8,3.2-3.2c0.8-1.4,1.2-2.9,1.2-4.7C337.4,335.6,337,334.1,336.3,332.7z
	 M333.5,340.7c-0.5,1-1.2,1.7-2.1,2.2c-0.9,0.5-1.9,0.8-3.1,0.8c-1.2,0-2.2-0.3-3.1-0.8c-0.9-0.5-1.6-1.3-2.1-2.2
	c-0.5-1-0.8-2.1-0.8-3.3c0-1.2,0.3-2.3,0.8-3.2c0.5-1,1.2-1.7,2.1-2.2c0.9-0.5,1.9-0.8,3.1-0.8c1.1,0,2.2,0.3,3.1,0.8
	c0.9,0.5,1.6,1.3,2.1,2.2c0.5,1,0.8,2,0.8,3.2C334.3,338.6,334,339.7,333.5,340.7z M364.3,328.5v17.8h-3.2v-3.8
	c-1.2,2.5-3.4,3.8-6.6,3.9c-2.1,0-3.7-0.6-4.8-1.8c-1.2-1.2-1.7-2.9-1.7-5.1v-11h3.2v10.2c0,1.5,0.4,2.7,1.2,3.5
	c0.8,0.8,1.9,1.3,3.4,1.3c1.7,0,3-0.6,4-1.8c1-1.2,1.5-2.6,1.5-4.4v-8.7H364.3L364.3,328.5z M382.7,329.4c1.1-0.7,2.4-1,3.8-1v3
	c-1.8-0.1-3.3,0.4-4.4,1.4c-1.1,1-1.8,2.4-1.9,4.1v9.4h-3.1v-17.8h3.1v3.8C380.8,331.1,381.6,330.1,382.7,329.4z M404,331.2
	c-1.2,0-2.2,0.3-3.1,0.8c-0.9,0.5-1.6,1.2-2.1,2.2c-0.5,0.9-0.8,2-0.8,3.3s0.3,2.3,0.8,3.3c0.5,0.9,1.2,1.7,2.1,2.2
	c0.9,0.5,1.9,0.8,3,0.8s2.2-0.2,3.1-0.6c0.9-0.4,1.7-0.9,2.3-1.7l1.8,1.8c-0.8,1-1.8,1.8-3.1,2.3c-1.2,0.5-2.7,0.8-4.2,0.8
	c-1.7,0-3.3-0.4-4.6-1.1s-2.4-1.8-3.1-3.2c-0.7-1.4-1.1-2.9-1.1-4.7c0-1.7,0.4-3.3,1.1-4.7c0.7-1.4,1.8-2.4,3.1-3.2
	c1.3-0.8,2.9-1.1,4.6-1.1c1.5,0,2.8,0.2,4.1,0.7c1.2,0.5,2.2,1.1,3,2l-1.7,2.1C407.7,331.9,406,331.2,404,331.2z M437,337.6
	c0-2.9-0.7-5.2-2.1-6.8c-1.4-1.6-3.5-2.4-6.2-2.4c-1.7,0-3.3,0.4-4.6,1.2c-1.4,0.8-2.4,1.8-3.1,3.2c-0.7,1.4-1.1,2.9-1.1,4.7
	c0,1.7,0.4,3.3,1.1,4.7s1.8,2.4,3.2,3.2c1.4,0.7,2.9,1.1,4.7,1.1c1.5,0,2.9-0.3,4.1-0.8c1.2-0.5,2.3-1.2,3.2-2.2l-1.7-1.8
	c-0.7,0.7-1.5,1.2-2.4,1.6c-0.9,0.4-1.9,0.6-2.9,0.6c-1.6,0-2.9-0.5-4-1.4c-1.1-0.9-1.8-2.2-2-3.8H437
	C437,338.4,437,338.1,437,337.6z M422.9,336.2c0.2-1.6,0.8-2.9,1.9-3.8c1-0.9,2.4-1.4,3.9-1.4c1.6,0,2.9,0.5,3.9,1.4
	c1,0.9,1.5,2.2,1.6,3.8H422.9z"/>
<g id="_x3C_binaryRing_x3E_">
	<path class="st0" d="M72.2,93.8c1.1,1.5,2.3,2.8,3.6,4c1.2,1.2,2.6,2.3,4.1,3.4c1.5,1.1,3.1,1.9,4.8,2.5c1.1,0.4,2.3,0.6,3.4,0.6
		c0.5,0,1.1,0,1.6-0.1c1.7-0.3,3.3-1.2,4.8-2.7c1.5-1.5,2.3-3.2,2.5-4.9c0.2-1.7,0-3.4-0.7-5c-0.6-1.6-1.5-3.2-2.7-4.7
		c-1.1-1.5-2.4-2.8-3.6-4c-1.2-1.2-2.6-2.3-4.1-3.4c-1.5-1.1-3.1-1.9-4.8-2.5c-1.7-0.6-3.4-0.7-5-0.5c-1.7,0.3-3.3,1.2-4.8,2.7
		c-1.5,1.5-2.3,3.2-2.5,4.9c-0.2,1.7,0,3.4,0.7,5C70.1,90.8,71,92.3,72.2,93.8z M76.3,84.1c0.3-0.4,0.8-0.5,1.3-0.4
		c0.7,0.1,1.4,0.4,2.2,0.9c0.8,0.5,1.6,1.1,2.5,1.8c0.8,0.7,1.6,1.4,2.4,2.1c0.7,0.7,1.4,1.4,2.2,2.2c0.7,0.8,1.4,1.6,1.9,2.4
		c0.5,0.8,0.8,1.5,1,2.2c0.1,0.6,0,1-0.3,1.3c-0.3,0.4-0.8,0.5-1.3,0.4c-0.7-0.1-1.4-0.4-2.2-0.9c-0.8-0.5-1.7-1.1-2.5-1.8
		c-0.9-0.7-1.6-1.4-2.3-2.1c-0.7-0.7-1.5-1.4-2.2-2.3c-0.7-0.8-1.4-1.6-1.9-2.4c-0.5-0.8-0.8-1.5-1-2.1C75.9,84.8,76,84.4,76.3,84.1
		z"/>
	<polygon class="st0" points="80.9,115.9 81.3,105.1 74.4,104.1 74.3,109.2 57.5,95.9 52.7,101.9 76.8,121 	"/>
	<path class="st0" d="M41.8,126.6c0.9,1.5,2.1,2.8,3.5,4.1c1.4,1.2,2.8,2.3,4.2,3.2c1.4,0.9,3,1.8,4.7,2.6c1.7,0.8,3.4,1.3,5.1,1.5
		c0.5,0.1,1,0.1,1.6,0.1c1.2,0,2.4-0.2,3.5-0.6c1.6-0.6,3-1.8,4.2-3.5c1.2-1.8,1.7-3.6,1.6-5.3c-0.1-1.7-0.7-3.3-1.6-4.8
		c-0.9-1.5-2.1-2.8-3.5-4.1c-1.4-1.2-2.8-2.3-4.2-3.2c-1.4-0.9-3-1.8-4.7-2.6c-1.7-0.8-3.4-1.3-5.1-1.6c-1.7-0.2-3.4-0.1-5,0.5
		c-1.6,0.6-3,1.8-4.2,3.5c-1.2,1.8-1.7,3.6-1.6,5.3C40.3,123.5,40.8,125.1,41.8,126.6z M62.7,130.2c-0.3,0.4-0.7,0.6-1.2,0.6
		c-0.7,0-1.5-0.2-2.3-0.5c-0.9-0.3-1.8-0.8-2.8-1.3c-1-0.5-1.9-1.1-2.7-1.6c-0.8-0.5-1.7-1.2-2.6-1.8c-0.9-0.6-1.6-1.3-2.3-2
		c-0.6-0.7-1.1-1.3-1.4-1.9c-0.2-0.5-0.2-1,0-1.4s0.7-0.6,1.2-0.6c0.7,0,1.5,0.2,2.3,0.5c0.9,0.3,1.8,0.7,2.7,1.3
		c1,0.5,1.9,1.1,2.7,1.6c0.8,0.5,1.7,1.1,2.6,1.8c0.9,0.6,1.6,1.3,2.3,2c0.6,0.7,1.1,1.3,1.4,1.9C63,129.4,63,129.8,62.7,130.2z"/>
	<path class="st0" d="M30.6,147.1c1,1.4,2.3,2.6,3.9,3.7c1.5,1.1,3,2,4.5,2.8c1.5,0.8,3.1,1.5,4.9,2.1c1.8,0.6,3.5,1,5.3,1.1
		c0.2,0,0.4,0,0.5,0c1.6,0,3.1-0.3,4.4-1c1.6-0.7,2.9-2,3.8-3.9c1-1.9,1.3-3.7,1.1-5.4c-0.3-1.7-1-3.2-2-4.6c-1-1.4-2.3-2.6-3.9-3.7
		c-1.5-1.1-3-2-4.5-2.8c-1.5-0.8-3.1-1.5-4.9-2.1c-1.8-0.6-3.5-1-5.3-1.1c-1.7-0.1-3.4,0.2-5,0.9c-1.6,0.7-2.8,2-3.8,3.9
		s-1.3,3.7-1.1,5.4C28.9,144.2,29.5,145.7,30.6,147.1z M51.8,148.8c-0.2,0.4-0.6,0.7-1.2,0.7c-0.7,0.1-1.5,0-2.4-0.3
		c-0.9-0.2-1.9-0.6-2.9-1c-1-0.5-2-0.9-2.8-1.4c-0.9-0.5-1.8-1-2.7-1.6c-0.9-0.6-1.8-1.2-2.5-1.8c-0.7-0.6-1.2-1.2-1.5-1.8
		c-0.3-0.5-0.3-0.9-0.1-1.4c0.2-0.4,0.6-0.7,1.2-0.7c0.1,0,0.3,0,0.4,0c0.6,0,1.2,0.1,2,0.3c0.9,0.2,1.9,0.6,2.9,1
		c1,0.4,2,0.9,2.8,1.4c0.9,0.5,1.8,1,2.7,1.5c0.9,0.6,1.8,1.2,2.5,1.8c0.7,0.6,1.2,1.2,1.6,1.8C52,147.9,52.1,148.3,51.8,148.8z"/>
	<polygon class="st1" points="48.9,169.7 46.4,159.2 39.4,160.1 40.7,165.1 20.9,157 18,164 46.5,175.7 	"/>
	<path class="st1" d="M14.3,190.8c1.3,1.2,2.8,2.2,4.5,3c1.7,0.8,3.4,1.4,5,1.9c1.6,0.5,3.4,0.9,5.2,1.2c1,0.2,2,0.2,2.9,0.2
		c0.8,0,1.6-0.1,2.4-0.2c1.7-0.2,3.3-0.9,4.7-1.9c1.4-1,2.4-2.5,3-4.6c0.6-2,0.6-3.9,0-5.5c-0.6-1.6-1.5-3-2.9-4.2
		c-1.3-1.2-2.8-2.1-4.5-2.9c-1.7-0.8-3.4-1.4-5-1.9c-1.6-0.5-3.4-0.9-5.2-1.2c-1.9-0.3-3.7-0.3-5.4-0.1c-1.7,0.2-3.3,0.9-4.7,1.9
		c-1.4,1-2.4,2.5-3,4.6c-0.6,2-0.6,3.9,0,5.5C12,188.2,13,189.6,14.3,190.8z M18.1,183.2c0.1-0.5,0.5-0.8,1-0.9
		c0.5-0.1,1.1-0.2,1.7-0.2c0.2,0,0.4,0,0.6,0c0.9,0.1,1.9,0.2,3,0.5c1.1,0.3,2.1,0.5,3.1,0.8c0.9,0.3,1.9,0.6,3,1
		c1,0.4,2,0.8,2.8,1.3c0.8,0.5,1.4,1,1.9,1.5c0.4,0.4,0.5,0.9,0.3,1.3c-0.1,0.5-0.5,0.8-1,0.9c-0.7,0.2-1.5,0.2-2.4,0.2
		c-0.9-0.1-2-0.2-3-0.5c-1.1-0.3-2.1-0.5-3-0.8h0c-0.9-0.3-1.9-0.6-3-1c-1-0.4-1.9-0.8-2.7-1.3c-0.8-0.5-1.4-1-1.9-1.5
		C18.1,184.1,18,183.7,18.1,183.2z"/>
	<path class="st1" d="M9.3,213.6c1.4,1,3,1.9,4.7,2.5c1.7,0.6,3.5,1.1,5.1,1.5c1.7,0.3,3.4,0.6,5.3,0.7c0.4,0,0.8,0,1.2,0
		c1.5,0,2.9-0.2,4.2-0.5c1.7-0.4,3.2-1.2,4.5-2.3c1.3-1.1,2.2-2.8,2.6-4.8s0.3-3.9-0.5-5.5c-0.7-1.5-1.8-2.8-3.2-3.9
		c-1.4-1-3-1.9-4.8-2.5c-1.7-0.6-3.5-1.1-5.1-1.4c-1.7-0.3-3.4-0.6-5.3-0.7c-1.9-0.1-3.7,0-5.4,0.4c-1.7,0.4-3.2,1.2-4.5,2.3
		c-1.3,1.1-2.2,2.8-2.6,4.8c-0.4,2.1-0.3,3.9,0.5,5.5C6.8,211.3,7.9,212.6,9.3,213.6z M12.4,205.7c0.1-0.5,0.4-0.8,0.9-1
		c0.6-0.2,1.4-0.4,2.3-0.4c0.2,0,0.3,0,0.5,0c0.8,0,1.7,0.1,2.5,0.2c1.1,0.2,2.1,0.3,3.1,0.5c1,0.2,2,0.4,3,0.7c1.1,0.3,2,0.6,2.9,1
		c0.8,0.4,1.5,0.8,2,1.3c0.4,0.4,0.6,0.8,0.5,1.3c-0.1,0.5-0.4,0.8-0.9,1c-0.6,0.2-1.4,0.4-2.4,0.4c-1,0-2,0-3-0.2
		c-1.1-0.2-2.1-0.3-3.1-0.5c-1-0.2-2-0.4-3.1-0.7c-1.1-0.3-2-0.6-2.9-1c-0.8-0.4-1.5-0.8-2-1.3C12.4,206.6,12.3,206.2,12.4,205.7z"
		/>
	<path class="st2" d="M6.5,236.8c1.5,0.9,3.1,1.6,5,2.1c1.8,0.5,3.6,0.8,5.2,1c1.2,0.1,2.5,0.2,3.9,0.2c0.5,0,1,0,1.5,0
		c1.9-0.1,3.7-0.4,5.3-0.9c1.7-0.6,3.1-1.5,4.3-2.7c1.2-1.2,1.9-2.9,2.1-5.1c0.2-2.1-0.1-3.9-1-5.4c-0.9-1.4-2.1-2.6-3.6-3.6
		c-1.5-0.9-3.1-1.6-5-2.1c-1.8-0.5-3.6-0.8-5.2-1c-1.7-0.2-3.5-0.2-5.3-0.2c-1.9,0.1-3.7,0.4-5.3,0.9c-1.7,0.6-3.1,1.5-4.3,2.7
		c-1.2,1.2-1.9,2.9-2.1,5.1c-0.2,2.1,0.1,3.9,1,5.4C3.8,234.7,5,235.9,6.5,236.8z M8.8,228.6c0.1-0.5,0.3-0.8,0.8-1.1
		c0.6-0.3,1.4-0.5,2.3-0.6c0.9-0.1,1.9-0.2,3-0.1c1.1,0.1,2.2,0.1,3.2,0.2c1,0.1,2,0.3,3.1,0.4c1.1,0.2,2.1,0.4,3,0.8
		c0.9,0.3,1.6,0.7,2.1,1.1c0.4,0.4,0.6,0.8,0.6,1.2c-0.1,0.5-0.3,0.8-0.8,1.1c-0.6,0.3-1.4,0.5-2.3,0.6c-0.9,0.1-2,0.1-3.1,0.1
		c-1.1-0.1-2.2-0.1-3.1-0.2c-1-0.1-2-0.3-3.1-0.4c-1.1-0.2-2.1-0.4-2.9-0.8c-0.9-0.3-1.6-0.7-2.1-1.1C8.9,229.5,8.7,229.1,8.8,228.6
		z"/>
	<path class="st2" d="M6.1,268.8c1.6,0.7,3.3,1.2,5.2,1.4c1.6,0.2,3.2,0.3,4.8,0.3c0.2,0,0.4,0,0.6,0c1.7,0,3.5-0.2,5.3-0.5
		c1.9-0.3,3.6-0.8,5.1-1.6c1.6-0.8,2.9-1.9,3.9-3.2c1-1.4,1.5-3.2,1.5-5.3c0-2.1-0.6-3.9-1.7-5.2c-1-1.3-2.4-2.4-4-3.1
		c-1.6-0.7-3.3-1.2-5.2-1.4c-1.8-0.2-3.6-0.3-5.3-0.3c-1.7,0-3.5,0.2-5.3,0.5c-1.9,0.3-3.6,0.8-5.1,1.6c-1.6,0.8-2.9,1.9-3.9,3.2
		c-1,1.4-1.5,3.2-1.5,5.3c0,2.1,0.6,3.9,1.7,5.2C3.1,267.1,4.5,268.1,6.1,268.8z M17.1,257.7c0.7,0,1.5,0,2.3,0.1
		c1.1,0,2.1,0.2,3,0.4c0.9,0.2,1.7,0.5,2.2,0.8c0.5,0.3,0.7,0.7,0.7,1.2c0,0.5-0.2,0.9-0.7,1.2c-0.6,0.4-1.3,0.7-2.2,0.9
		c-0.9,0.2-1.9,0.4-3,0.5c-1.1,0.1-2.1,0.1-3.1,0.2c-1,0-2,0-3.2,0c-1.1,0-2.1-0.2-3-0.4c-0.9-0.2-1.6-0.5-2.2-0.8
		c-0.5-0.3-0.7-0.7-0.7-1.2c0-0.5,0.2-0.9,0.7-1.2c0.6-0.4,1.3-0.7,2.2-0.9c0.9-0.2,1.9-0.4,3-0.5c1.1-0.1,2.2-0.1,3.2-0.2
		C16.6,257.7,16.9,257.7,17.1,257.7z"/>
	<polygon class="st2" points="33,279.7 25.7,271.8 20.1,275.9 23.6,279.7 2.3,282 3.1,289.6 33.7,286.2 	"/>
	<polygon class="st3" points="36.1,300.4 28.2,293.2 22.9,297.8 26.8,301.2 5.8,305.5 7.3,313 37.4,306.8 	"/>
	<polygon class="st3" points="41.2,320.7 32.6,314.2 27.8,319.3 32,322.4 11.5,328.6 13.7,335.9 43.1,326.9 	"/>
	<path class="st3" d="M38.3,356.8c1.6-0.6,3.2-1.5,4.8-2.4c1.6-1,3-2.1,4.2-3.4c1.2-1.3,2-2.8,2.4-4.4c0.4-1.7,0.3-3.5-0.5-5.5
		c-0.8-2-2-3.4-3.5-4.3c-1.5-0.8-3.1-1.3-4.8-1.4c-1.7-0.1-3.5,0.1-5.3,0.6c-1.8,0.5-3.5,1-5.1,1.7c-1.6,0.6-3.2,1.4-4.8,2.4
		c-1.6,1-3,2.1-4.2,3.4c-1.2,1.3-2,2.8-2.4,4.4c-0.4,1.7-0.3,3.5,0.5,5.5c0.8,2,2,3.4,3.5,4.3c1.5,0.8,3.1,1.3,4.8,1.4
		c0.3,0,0.5,0,0.8,0c1.5,0,3-0.2,4.6-0.6C35,358,36.7,357.4,38.3,356.8z M40.8,346.8c-0.8,0.6-1.7,1.1-2.6,1.6c-1,0.5-2,0.9-2.8,1.3
		c-0.9,0.4-1.9,0.7-3,1.1c-1,0.4-2,0.6-2.9,0.7c-0.9,0.1-1.7,0.2-2.4,0c-0.6-0.1-0.9-0.4-1.1-0.8c-0.2-0.5-0.1-0.9,0.2-1.4
		c0.4-0.6,1-1.1,1.7-1.6c0.8-0.5,1.6-1.1,2.6-1.5c1-0.5,2-0.9,2.9-1.3c0.9-0.4,1.9-0.7,2.9-1.1c1-0.4,2-0.6,3-0.8
		c0.5-0.1,1-0.1,1.4-0.1c0.3,0,0.7,0,1,0.1c0.6,0.1,0.9,0.4,1.1,0.8c0.2,0.5,0.1,0.9-0.2,1.4C42.1,345.7,41.5,346.2,40.8,346.8z"/>
	<polygon class="st4" points="56.9,359.4 47.3,354.6 43.5,360.6 48.2,362.8 29.2,372.7 32.8,379.5 60,365.2 	"/>
	<path class="st4" d="M60.8,395.4c1.4-0.9,2.8-2,4.2-3.2c1.4-1.2,2.6-2.6,3.5-4.1c0.9-1.5,1.5-3.1,1.6-4.8c0.1-1.7-0.4-3.5-1.6-5.3
		c-1.2-1.8-2.6-3-4.2-3.5c-1.6-0.6-3.3-0.7-5-0.5c-1.7,0.2-3.4,0.8-5.1,1.6c-1.7,0.8-3.2,1.7-4.7,2.6c-1.4,0.9-2.8,2-4.2,3.2
		c-1.4,1.2-2.6,2.6-3.5,4.1c-0.9,1.5-1.5,3.1-1.6,4.8c-0.1,1.7,0.4,3.5,1.6,5.3c1.2,1.8,2.6,3,4.2,3.5c1.1,0.4,2.3,0.6,3.5,0.6
		c0.5,0,1,0,1.6-0.1c1.7-0.2,3.4-0.8,5.2-1.5C57.8,397.2,59.4,396.3,60.8,395.4z M47.6,391.7c-0.3-0.4-0.3-0.9,0-1.4
		c0.3-0.6,0.7-1.3,1.4-1.9c0.6-0.7,1.4-1.3,2.3-2c0.9-0.7,1.8-1.3,2.6-1.8c0.8-0.5,1.7-1.1,2.7-1.6c0.9-0.5,1.9-1,2.8-1.3
		c0.9-0.3,1.7-0.5,2.3-0.5c0,0,0,0,0,0c0.5,0,0.9,0.2,1.2,0.6c0.3,0.4,0.3,0.9,0,1.4c-0.3,0.6-0.8,1.3-1.4,1.9
		c-0.7,0.7-1.4,1.4-2.3,2c-0.9,0.7-1.8,1.3-2.6,1.8c-0.8,0.5-1.7,1.1-2.7,1.6c-1,0.5-1.9,1-2.7,1.3c-0.9,0.3-1.6,0.5-2.3,0.5
		C48.2,392.3,47.8,392.1,47.6,391.7z"/>
	<polygon class="st4" points="79.6,394.5 69.2,391.6 66.6,398.1 71.6,399.4 54.8,412.8 59.6,418.7 83.6,399.6 	"/>
	<path class="st5" d="M99.7,430.9c1.1-1.5,1.9-3.1,2.5-4.8c0.6-1.7,0.7-3.3,0.5-5c-0.2-1.7-1.1-3.3-2.7-4.8
		c-1.5-1.5-3.2-2.3-4.9-2.5c-1.7-0.2-3.4,0-5,0.6c-1.6,0.6-3.2,1.5-4.7,2.7c-1.5,1.1-2.8,2.3-4,3.5c-1.2,1.2-2.3,2.6-3.4,4.1
		c-1.1,1.5-2,3.1-2.5,4.7c-0.6,1.7-0.7,3.4-0.5,5c0.2,1.7,1.1,3.3,2.7,4.8c1.5,1.5,3.2,2.3,4.9,2.5c0.4,0,0.8,0.1,1.2,0.1
		c1.3,0,2.5-0.2,3.8-0.7c1.6-0.6,3.2-1.5,4.7-2.6c1.5-1.1,2.8-2.3,4-3.5C97.5,433.7,98.6,432.4,99.7,430.9z M95.6,422.6
		c-0.1,0.7-0.5,1.4-0.9,2.2c-0.5,0.8-1.1,1.6-1.8,2.5c-0.7,0.9-1.4,1.6-2.1,2.3c-0.7,0.7-1.4,1.4-2.3,2.2c-0.8,0.7-1.6,1.4-2.4,1.9
		c-0.8,0.5-1.5,0.8-2.2,1c-0.6,0.1-1,0-1.3-0.3c-0.4-0.3-0.5-0.8-0.3-1.3c0.1-0.7,0.5-1.4,0.9-2.2c0.5-0.8,1.1-1.6,1.8-2.5
		c0.7-0.8,1.4-1.6,2.1-2.3c0.7-0.7,1.4-1.4,2.2-2.2c0.8-0.7,1.6-1.4,2.4-1.9c0.8-0.5,1.5-0.8,2.2-1c0.2,0,0.3-0.1,0.4-0.1
		c0.3,0,0.6,0.1,0.9,0.4C95.6,421.6,95.7,422,95.6,422.6z"/>
	<polygon class="st5" points="114.4,429.9 103.7,429.4 102.6,436.3 107.8,436.5 94.3,453.2 100.2,458 119.5,434.1 	"/>
	<polygon class="st5" points="131.2,442.4 120.5,442.9 120.1,449.9 125.2,449.6 113.4,467.4 119.7,471.6 136.7,446 	"/>
	<path class="st6" d="M154.3,457.1c-0.7-1.6-2-2.9-3.9-3.9c-1.9-1-3.7-1.4-5.4-1.1c-1.7,0.3-3.2,0.9-4.6,2c-1.4,1-2.7,2.3-3.8,3.8
		c-1.1,1.5-2.1,3-2.9,4.5c-0.8,1.5-1.5,3.1-2.2,4.9c-0.7,1.8-1,3.5-1.1,5.3c-0.1,1.8,0.2,3.4,0.9,5c0.7,1.6,2,2.9,3.9,3.9
		c1.5,0.8,2.9,1.2,4.3,1.2c0.4,0,0.7,0,1.1-0.1c1.7-0.3,3.2-0.9,4.6-2c1.4-1,2.7-2.3,3.8-3.8c1.1-1.5,2.1-3,2.9-4.5
		c0.8-1.5,1.5-3.1,2.2-4.9c0.6-1.8,1-3.5,1.1-5.3C155.3,460.3,155,458.6,154.3,457.1z M147.8,460.5c0,0.7-0.1,1.5-0.3,2.4
		c-0.2,0.9-0.6,1.9-1.1,2.9c-0.5,1-0.9,1.9-1.4,2.8c-0.5,0.9-1,1.8-1.6,2.7c-0.6,0.9-1.2,1.7-1.8,2.4c-0.6,0.7-1.2,1.2-1.8,1.5
		c-0.5,0.3-0.9,0.3-1.4,0.1c-0.4-0.2-0.7-0.6-0.7-1.2c0-0.7,0-1.5,0.3-2.4c0.2-0.9,0.6-1.9,1-2.8c0.5-1,0.9-2,1.4-2.8
		c0.5-0.9,1-1.8,1.6-2.7c0.6-0.9,1.2-1.8,1.8-2.5c0.6-0.7,1.2-1.2,1.8-1.5c0.3-0.2,0.5-0.2,0.8-0.2c0.2,0,0.4,0.1,0.6,0.2
		C147.6,459.5,147.8,459.9,147.8,460.5z"/>
	<polygon class="st6" points="157.5,464.8 158.4,471.8 163.4,470.5 155,490.2 162.1,493.2 174,464.9 167.9,462.3 	"/>
	<polygon class="st6" points="177.4,473.1 178.9,479.9 183.7,478.2 177.3,498.6 184.6,500.9 193.8,471.6 187.5,469.6 	"/>
	<polygon class="st7" points="197.9,479.4 200.1,486.1 204.7,484 200.3,504.9 207.7,506.5 214.1,476.4 207.7,475.1 	"/>
	<path class="st7" d="M234.5,480.3c-1.2-1.2-2.9-1.9-5-2.2c-2.1-0.2-3.9,0.1-5.4,0.9c-1.4,0.9-2.7,2.1-3.6,3.5
		c-0.9,1.5-1.6,3.1-2.1,5c-0.5,1.8-0.8,3.6-1,5.2c-0.2,1.7-0.3,3.5-0.2,5.3c0,1.9,0.3,3.7,0.9,5.3c0.6,1.7,1.5,3.1,2.7,4.3
		c1.2,1.2,2.9,1.9,5,2.2c0.5,0.1,0.9,0.1,1.3,0.1c1.5,0,2.9-0.3,4.1-1c1.4-0.9,2.7-2.1,3.6-3.5c0.9-1.5,1.6-3.1,2.1-4.9
		c0.5-1.8,0.8-3.5,1-5.2c0.2-1.7,0.3-3.5,0.2-5.3c-0.1-1.9-0.4-3.7-0.9-5.3C236.6,482.9,235.7,481.4,234.5,480.3z M230.4,491.2
		c-0.1,1.1-0.2,2.2-0.3,3.1h0c-0.1,1-0.3,2-0.5,3.1c-0.2,1.1-0.5,2.1-0.8,2.9c-0.3,0.9-0.7,1.6-1.1,2.1c-0.4,0.4-0.8,0.6-1.3,0.6
		c-0.5-0.1-0.8-0.3-1.1-0.8c-0.3-0.6-0.5-1.4-0.6-2.3c-0.1-0.9-0.1-1.9-0.1-3c0.1-1.1,0.1-2.2,0.3-3.2c0.1-1,0.3-2,0.5-3.1
		c0.2-1.1,0.5-2.1,0.8-3c0.3-0.9,0.7-1.6,1.1-2.1c0.3-0.4,0.7-0.6,1.1-0.6c0.1,0,0.1,0,0.2,0c0.5,0.1,0.8,0.3,1.1,0.8
		c0.3,0.6,0.5,1.4,0.6,2.3C230.5,489,230.5,490.1,230.4,491.2z"/>
	<path class="st7" d="M266.7,485c-0.8-1.6-1.9-2.9-3.2-3.9c-1.4-1-3.2-1.5-5.3-1.5c-2.1,0-3.9,0.6-5.2,1.7c-1.3,1-2.4,2.4-3.1,4
		c-0.7,1.6-1.2,3.3-1.4,5.2c-0.2,1.8-0.3,3.6-0.3,5.3c0,1.7,0.2,3.5,0.5,5.3c0.3,1.9,0.8,3.6,1.6,5.1c0.8,1.6,1.9,2.9,3.2,3.9
		c1.3,1,3,1.5,5.1,1.5c0.1,0,0.1,0,0.2,0c2.1,0,3.9-0.6,5.2-1.7c1.3-1,2.4-2.4,3.1-4c0.7-1.6,1.2-3.3,1.4-5.2
		c0.2-1.8,0.3-3.6,0.3-5.3c0-1.7-0.2-3.5-0.5-5.3C268,488.3,267.4,486.6,266.7,485z M257.4,504c-0.4-0.6-0.7-1.3-0.9-2.2
		c-0.2-0.9-0.4-1.9-0.5-3c-0.1-1.1-0.1-2.2-0.2-3.2c0-1,0-2,0.1-3.1c0.1-1.1,0.2-2.1,0.4-3c0.2-0.9,0.5-1.7,0.8-2.2
		c0.3-0.5,0.7-0.7,1.2-0.7c0,0,0,0,0,0c0.5,0,0.9,0.2,1.2,0.7c0.4,0.6,0.7,1.3,0.9,2.2c0.2,0.9,0.4,1.9,0.5,3
		c0.1,1.1,0.1,2.1,0.2,3.1c0,1,0,2.1-0.1,3.2c-0.1,1.1-0.2,2.1-0.4,3c-0.2,0.9-0.5,1.6-0.8,2.2c-0.3,0.5-0.7,0.7-1.2,0.7
		C258.1,504.7,257.7,504.5,257.4,504z"/>
	<polygon class="st8" points="278.1,479.2 270.1,486.4 274.2,492.1 278,488.6 280.1,509.9 287.7,509.1 284.6,478.5 	"/>
	<polygon class="st8" points="298.8,476.2 291.5,484.1 296.1,489.4 299.5,485.5 303.7,506.6 311.2,505.1 305.2,474.9 	"/>
	<polygon class="st8" points="319.1,471.3 312.6,479.8 317.7,484.7 320.7,480.5 326.8,501 334.1,498.9 325.4,469.4 	"/>
	<path class="st9" d="M355.2,474.5L355.2,474.5c-0.6-1.6-1.4-3.2-2.4-4.8c-1-1.6-2.1-3-3.3-4.2c-1.3-1.2-2.8-2-4.4-2.5
		c-1.7-0.5-3.5-0.3-5.5,0.5c-2,0.8-3.4,1.9-4.3,3.4c-0.9,1.5-1.3,3.1-1.4,4.8c-0.1,1.7,0.1,3.5,0.5,5.3c0.4,1.8,1,3.5,1.6,5.1
		c0.6,1.6,1.4,3.2,2.3,4.8c0.9,1.6,2.1,3.1,3.3,4.2c1.3,1.2,2.8,2,4.4,2.5c0.6,0.2,1.2,0.3,1.9,0.3c1.1,0,2.3-0.3,3.6-0.8
		c2-0.8,3.4-1.9,4.3-3.4c0.9-1.5,1.3-3.1,1.4-4.8c0.1-1.7-0.1-3.5-0.5-5.4C356.4,477.7,355.8,476,355.2,474.5z M341.4,471
		c0.1-0.6,0.4-0.9,0.8-1.1c0.2-0.1,0.3-0.1,0.5-0.1c0.3,0,0.6,0.1,0.9,0.3c0.6,0.4,1.1,1,1.6,1.7c0.5,0.8,1.1,1.7,1.5,2.6
		c0.5,1,0.9,2,1.3,2.9c0.4,0.9,0.7,1.9,1.1,3c0.3,1,0.6,2,0.7,2.9c0.1,0.9,0.1,1.7,0,2.4c-0.1,0.6-0.4,0.9-0.8,1.1
		c-0.5,0.2-0.9,0.1-1.4-0.2c-0.6-0.4-1.1-1-1.6-1.7c-0.5-0.8-1.1-1.6-1.5-2.6c-0.5-1-0.9-2-1.3-2.9c-0.4-0.9-0.7-1.9-1.1-2.9
		c-0.3-1-0.6-2-0.7-3C341.3,472.5,341.3,471.7,341.4,471z"/>
	<polygon class="st9" points="357.9,455.9 353.1,465.5 359,469.3 361.2,464.6 371.1,483.6 377.8,480.1 363.7,452.8 	"/>
	<path class="st9" d="M396.5,456.9c-0.8-1.7-1.6-3.3-2.5-4.7v0c-0.9-1.4-2-2.9-3.2-4.3c-1.2-1.4-2.6-2.6-4.1-3.5
		c-1.5-0.9-3.1-1.5-4.8-1.6c-1.7-0.1-3.5,0.4-5.3,1.5c-1.8,1.1-3,2.5-3.6,4.2c-0.6,1.6-0.7,3.3-0.5,5c0.2,1.7,0.7,3.4,1.5,5.2
		c0.8,1.7,1.6,3.3,2.5,4.7c0.9,1.4,2,2.9,3.2,4.3c1.2,1.4,2.6,2.6,4,3.5c1.5,0.9,3.1,1.5,4.8,1.6c0.2,0,0.4,0,0.6,0
		c1.5,0,3.1-0.5,4.7-1.5c1.8-1.1,3-2.5,3.6-4.2c0.6-1.6,0.7-3.3,0.5-5C397.8,460.4,397.3,458.6,396.5,456.9z M390.8,464.2
		c0,0.6-0.2,1-0.6,1.2c-0.4,0.3-0.9,0.3-1.4,0c-0.6-0.3-1.3-0.8-1.9-1.4c-0.7-0.6-1.3-1.4-2-2.3c-0.7-0.9-1.3-1.8-1.8-2.6
		c-0.5-0.8-1.1-1.7-1.6-2.7c-0.5-0.9-1-1.9-1.3-2.8c-0.3-0.9-0.5-1.7-0.5-2.3c0-0.6,0.2-1,0.6-1.2c0.2-0.1,0.4-0.2,0.7-0.2
		c0.2,0,0.4,0.1,0.7,0.2c0.6,0.3,1.3,0.8,1.9,1.4c0.7,0.7,1.3,1.4,2,2.3c0.7,0.9,1.3,1.8,1.8,2.6c0.5,0.8,1.1,1.7,1.6,2.7
		c0.5,0.9,1,1.9,1.3,2.8C390.6,462.8,390.8,463.5,390.8,464.2z"/>
	<path class="st10" d="M414.6,443c-0.9-1.6-1.9-3.1-3-4.4c-1-1.3-2.3-2.7-3.6-3.9c-1.4-1.3-2.8-2.3-4.4-3.1
		c-1.6-0.8-3.2-1.2-4.9-1.2c-1.7,0-3.4,0.7-5.1,2s-2.7,2.8-3.2,4.5c-0.4,1.6-0.4,3.3,0,5c0.4,1.7,1.1,3.4,2,5c0.9,1.6,1.9,3.1,3,4.4
		c1,1.3,2.2,2.7,3.6,4c1.4,1.3,2.8,2.4,4.4,3.1c1.5,0.8,3.2,1.2,4.8,1.2c0,0,0.1,0,0.1,0c1.7,0,3.4-0.7,5.1-2s2.7-2.8,3.2-4.5
		c0.4-1.6,0.4-3.3,0-5C416.2,446.3,415.5,444.6,414.6,443z M403.5,440.9c0.7,0.8,1.4,1.6,2,2.4c0.6,0.8,1.2,1.6,1.9,2.6
		c0.6,0.9,1.1,1.8,1.5,2.6c0.4,0.8,0.6,1.6,0.7,2.3c0.1,0.6-0.1,1-0.5,1.3c-0.4,0.3-0.8,0.4-1.4,0.2c-0.6-0.2-1.3-0.6-2-1.2
		c-0.7-0.6-1.5-1.3-2.2-2.1c-0.7-0.8-1.4-1.6-2-2.4c-0.6-0.8-1.2-1.6-1.8-2.5c-0.6-0.9-1.1-1.8-1.5-2.6c-0.4-0.8-0.6-1.6-0.7-2.3
		c-0.1-0.6,0.1-1,0.5-1.3c0.2-0.2,0.5-0.3,0.8-0.3c0.2,0,0.4,0,0.6,0.1c0.6,0.2,1.3,0.6,2.1,1.2
		C402.1,439.4,402.8,440.1,403.5,440.9z"/>
	<path class="st10" d="M437.3,421c-1.1-1.5-2.3-2.8-3.5-4l0,0c-1.2-1.2-2.6-2.3-4.1-3.5c-1.5-1.1-3.1-2-4.7-2.5
		c-1.7-0.6-3.3-0.8-5-0.5c-1.7,0.2-3.3,1.1-4.8,2.6c-1.5,1.5-2.4,3.1-2.6,4.8c-0.2,1.7,0,3.4,0.6,5c0.6,1.6,1.5,3.2,2.6,4.7
		c1.1,1.5,2.3,2.8,3.5,4c1.2,1.2,2.6,2.4,4.1,3.5c1.5,1.1,3.1,2,4.7,2.6c1.2,0.4,2.4,0.6,3.6,0.6c0.5,0,0.9,0,1.4-0.1
		c1.7-0.2,3.3-1.1,4.8-2.6c1.5-1.5,2.4-3.1,2.6-4.8c0.2-1.7,0-3.4-0.6-5C439.3,424.1,438.4,422.5,437.3,421z M433,430.7
		c-0.4,0.4-0.8,0.5-1.3,0.3c-0.7-0.1-1.4-0.5-2.2-0.9c-0.8-0.5-1.6-1.1-2.4-1.8c-0.8-0.7-1.6-1.4-2.3-2.1c-0.7-0.7-1.4-1.4-2.1-2.3
		c-0.7-0.8-1.3-1.6-1.9-2.4c-0.5-0.8-0.8-1.5-1-2.2c-0.1-0.6,0-1,0.3-1.3c0.3-0.3,0.6-0.4,0.9-0.4c0.1,0,0.3,0,0.4,0
		c0.7,0.2,1.4,0.5,2.2,0.9c0.8,0.5,1.6,1.1,2.5,1.8c0.8,0.7,1.6,1.4,2.3,2.1c0.7,0.7,1.4,1.5,2.2,2.3c0.7,0.8,1.3,1.6,1.8,2.4
		c0.5,0.8,0.8,1.5,1,2.2C433.4,430,433.3,430.4,433,430.7z"/>
	<polygon class="st10" points="428.9,398.8 428.3,409.6 435.2,410.7 435.4,405.6 452,419.1 456.8,413.2 433.1,393.8 	"/>
	<polygon class="st11" points="445.1,376.7 441.5,382.1 441.9,392.9 448.9,393.4 448.6,388.2 466.4,400.2 470.6,393.9 445.6,377 	
		"/>
	<polygon class="st11" points="452.4,364.3 453.8,375 460.8,374.8 460.1,369.7 478.9,380 482.6,373.3 455.6,358.6 	"/>
	<path class="st12" d="M489.2,347.1c-1.1-1.3-2.5-2.4-4.1-3.4c-1.6-1-3.2-1.8-4.7-2.5c-1.6-0.7-3.3-1.3-5-1.7
		c-1.8-0.5-3.6-0.7-5.3-0.6c-1.8,0.1-3.4,0.5-4.9,1.3c-1.5,0.8-2.7,2.3-3.5,4.2c-0.8,2-1.1,3.8-0.6,5.5c0.4,1.6,1.2,3.1,2.4,4.4
		c1.1,1.3,2.5,2.4,4.2,3.4c1.6,1,3.2,1.8,4.7,2.5c1.6,0.7,3.3,1.3,5,1.7c1.6,0.4,3.2,0.7,4.8,0.7c0.2,0,0.4,0,0.5,0
		c1.8-0.1,3.4-0.5,4.9-1.3c1.5-0.8,2.7-2.3,3.5-4.2c0.8-2,1.1-3.8,0.6-5.5C491.1,349.9,490.3,348.4,489.2,347.1z M484.6,354.2
		c-0.2,0.5-0.6,0.7-1.1,0.8c-0.7,0.1-1.5,0.1-2.4-0.1c-0.9-0.2-1.9-0.4-2.9-0.8c-1-0.4-2-0.8-2.9-1.2c-0.9-0.4-1.8-0.8-2.8-1.3
		c-1-0.5-1.8-1-2.6-1.6c-0.7-0.5-1.3-1.1-1.7-1.7c-0.3-0.5-0.4-0.9-0.2-1.4c0.2-0.5,0.6-0.7,1.1-0.8c0.3,0,0.6-0.1,0.9-0.1
		c0.5,0,1,0,1.5,0.1c0.9,0.2,1.9,0.4,2.9,0.8c1,0.4,2,0.8,2.9,1.1c0.9,0.4,1.9,0.8,2.9,1.3c1,0.5,1.8,1,2.6,1.6
		c0.7,0.5,1.3,1.1,1.7,1.7C484.7,353.3,484.8,353.8,484.6,354.2z"/>
	<path class="st13" d="M496.6,324.9c-1.3-1.2-2.8-2.2-4.4-3c-1.7-0.8-3.3-1.5-4.9-2c-1.6-0.5-3.4-0.9-5.2-1.2
		c-1.9-0.3-3.7-0.4-5.4-0.1c-1.7,0.2-3.3,0.8-4.7,1.8c-1.4,1-2.5,2.5-3.1,4.5c-0.7,2-0.7,3.9-0.1,5.5c0.6,1.6,1.5,3,2.8,4.2
		c1.3,1.2,2.8,2.2,4.5,3c1.7,0.8,3.3,1.5,4.9,2s3.4,0.9,5.2,1.3c1.1,0.2,2.2,0.3,3.3,0.3c0.7,0,1.4,0,2.1-0.1
		c1.7-0.2,3.3-0.8,4.7-1.8c1.4-1,2.5-2.5,3.1-4.5c0.7-2,0.7-3.9,0.1-5.5C498.9,327.6,497.9,326.1,496.6,324.9z M492.7,332.5
		c-0.2,0.5-0.5,0.8-1,0.9c-0.7,0.2-1.5,0.2-2.4,0.1c-0.9-0.1-1.9-0.2-3-0.5c-1.1-0.3-2.1-0.6-3-0.9c-0.9-0.3-1.9-0.7-2.9-1.1
		c-1-0.4-1.9-0.8-2.7-1.3c-0.8-0.5-1.4-1-1.8-1.5c-0.4-0.4-0.5-0.9-0.3-1.3c0.2-0.5,0.5-0.8,1-0.9c0.5-0.1,1-0.2,1.6-0.2
		c0.3,0,0.5,0,0.8,0c0.9,0.1,2,0.3,3,0.5c1.1,0.3,2.1,0.6,3,0.9h0c0.9,0.3,2,0.7,3,1.1c1,0.4,1.9,0.8,2.7,1.3c0.8,0.5,1.4,1,1.8,1.5
		C492.8,331.6,492.9,332,492.7,332.5z"/>
	<polygon class="st13" points="474.7,305.9 479,315.7 485.7,313.6 483.6,308.9 504.5,313.6 506.1,306.1 476.1,299.5 	"/>
	<polygon class="st14" points="478.4,285.3 483.6,294.7 490,292 487.5,287.5 508.7,290.2 509.7,282.6 479.2,278.8 	"/>
	<path class="st15" d="M510,249.8c-1-1.3-2.4-2.4-4-3.1c-1.6-0.7-3.3-1.2-5.2-1.4c-1.8-0.2-3.6-0.3-5.3-0.3c-1.7,0-3.5,0.2-5.3,0.5
		c-1.9,0.3-3.6,0.8-5.1,1.6c-1.6,0.8-2.9,1.9-3.9,3.2c-1,1.4-1.5,3.2-1.5,5.3c0,2.1,0.6,3.9,1.7,5.2c1,1.3,2.4,2.4,4,3.1
		c1.6,0.7,3.3,1.2,5.2,1.4c1.6,0.2,3.2,0.3,4.8,0.3c0.2,0,0.4,0,0.5,0c1.7,0,3.5-0.2,5.3-0.5c1.9-0.3,3.6-0.8,5.1-1.6
		c1.6-0.8,2.9-1.9,3.9-3.2c1-1.4,1.5-3.2,1.5-5.3C511.6,252.9,511,251.2,510,249.8z M492.6,257.8c-1.1-0.1-2.1-0.2-3-0.4
		c-0.9-0.2-1.7-0.5-2.2-0.8c-0.5-0.3-0.7-0.7-0.7-1.2c0-0.5,0.2-0.9,0.7-1.2c0.6-0.4,1.3-0.7,2.2-0.9c0.9-0.2,1.9-0.4,3-0.5
		c1.1-0.1,2.2-0.1,3.1-0.2c1,0,2,0,3.2,0.1c1.1,0.1,2.1,0.2,3,0.4c0.9,0.2,1.6,0.5,2.2,0.8c0.5,0.3,0.7,0.7,0.7,1.2
		c0,0.5-0.2,0.9-0.7,1.2c-0.6,0.4-1.3,0.7-2.2,0.9c-0.9,0.2-1.9,0.4-3,0.5c-1.1,0.1-2.2,0.1-3.2,0.2
		C494.7,257.9,493.6,257.9,492.6,257.8z"/>
	<polygon class="st15" points="479.3,235.6 486.5,243.6 492.2,239.5 488.7,235.7 510,233.7 509.3,226.1 478.7,229 	"/>
	<polygon class="st16" points="476.5,214.8 484.3,222.2 489.7,217.6 485.8,214.1 506.9,210.1 505.5,202.6 475.3,208.4 	"/>
	<path class="st17" d="M488.5,178.2c-1.8,0.3-3.6,0.6-5.2,1.1c-1.6,0.5-3.3,1.1-5,1.9c-1.7,0.8-3.2,1.8-4.5,2.9
		c-1.3,1.2-2.3,2.5-2.9,4.1c-0.6,1.6-0.6,3.4,0,5.5c0.6,2,1.6,3.6,3,4.6c1.4,1,2.9,1.6,4.7,1.9c0.9,0.1,1.7,0.2,2.6,0.2
		c0.9,0,1.8-0.1,2.7-0.2c1.8-0.3,3.6-0.6,5.2-1.1c1.6-0.5,3.3-1.1,5-1.8c1.7-0.8,3.2-1.7,4.5-2.9c1.3-1.2,2.3-2.5,2.9-4.1
		c0.6-1.6,0.6-3.4,0-5.5c-0.6-2-1.6-3.6-3-4.6c-1.4-1-2.9-1.6-4.7-1.9C492.2,177.9,490.4,177.9,488.5,178.2z M494.6,188
		c-0.5,0.5-1.1,1-1.9,1.4c-0.8,0.5-1.7,0.9-2.8,1.2c-1,0.4-2.1,0.7-3,1c-0.9,0.3-1.9,0.5-3,0.8c-1.1,0.2-2.1,0.4-3,0.4
		c-0.9,0-1.7,0-2.4-0.2c-0.5-0.2-0.9-0.5-1-0.9c-0.1-0.5,0-0.9,0.4-1.3c0.5-0.5,1.1-1,1.9-1.5c0.8-0.5,1.8-0.9,2.8-1.3
		c1-0.4,2-0.7,3-1c1-0.3,2-0.5,3.1-0.8c1.1-0.2,2.1-0.4,3-0.4c0.9,0,1.7,0,2.4,0.2c0.5,0.2,0.9,0.5,1,0.9
		C495,187.1,494.9,187.5,494.6,188z"/>
	<polygon class="st17" points="465.1,174.7 474.1,180.4 478.5,174.9 474.1,172.2 494,164.4 491.2,157.3 462.7,168.6 	"/>
	<polygon class="st17" points="456.6,155.6 466.1,160.4 470,154.5 465.4,152.3 484.5,142.6 481,135.8 453.6,149.7 	"/>
	<path class="st18" d="M453.2,119.5c-1.4,0.9-2.9,2-4.3,3.2c-1.4,1.2-2.6,2.6-3.6,4c-0.9,1.5-1.5,3.1-1.7,4.8
		c-0.2,1.7,0.3,3.5,1.5,5.3c1.1,1.8,2.5,3,4.1,3.6c1.2,0.4,2.4,0.6,3.6,0.6c0.5,0,0.9,0,1.4-0.1c1.7-0.2,3.5-0.7,5.2-1.5
		c1.7-0.8,3.3-1.6,4.7-2.5c1.4-0.9,2.9-2,4.3-3.2c1.4-1.2,2.6-2.6,3.6-4c0.9-1.5,1.5-3.1,1.7-4.8c0.2-1.7-0.3-3.5-1.5-5.3
		c-1.1-1.8-2.5-3-4.1-3.6c-1.6-0.6-3.3-0.8-5-0.5c-1.7,0.2-3.5,0.7-5.2,1.5C456.3,117.7,454.7,118.6,453.2,119.5z M466.4,123.4
		c0.3,0.4,0.3,0.9,0,1.4c-0.3,0.6-0.8,1.3-1.4,1.9c-0.6,0.7-1.4,1.3-2.3,2c-0.9,0.6-1.8,1.2-2.6,1.8c-0.8,0.5-1.7,1.1-2.7,1.6
		c-1,0.5-1.9,0.9-2.8,1.3c-0.9,0.3-1.7,0.5-2.3,0.5c0,0,0,0,0,0c-0.6,0-1-0.2-1.2-0.6c-0.3-0.4-0.3-0.9,0-1.4
		c0.3-0.6,0.8-1.3,1.4-1.9c0.7-0.7,1.4-1.3,2.3-2c0.9-0.7,1.8-1.2,2.6-1.8c0.8-0.5,1.8-1.1,2.7-1.6c1-0.5,1.9-0.9,2.8-1.2
		c0.9-0.3,1.6-0.4,2.3-0.4C465.8,122.7,466.2,122.9,466.4,123.4z"/>
	<polygon class="st18" points="434.4,120.1 444.7,123.1 447.4,116.7 442.5,115.3 459.4,102.2 454.8,96.2 430.4,114.9 	"/>
	<path class="st19" d="M418.3,79.4c-1.2,1.2-2.4,2.6-3.5,4c-1.1,1.5-2,3.1-2.6,4.7c-0.6,1.7-0.8,3.3-0.6,5c0.2,1.7,1.1,3.3,2.6,4.8
		c1.5,1.5,3.1,2.4,4.8,2.6c0.5,0.1,0.9,0.1,1.4,0.1c1.2,0,2.4-0.2,3.7-0.7c1.6-0.6,3.2-1.5,4.7-2.6c1.5-1.1,2.8-2.3,4-3.5
		c1.2-1.2,2.4-2.6,3.5-4c1.1-1.5,2-3.1,2.6-4.7c0.6-1.7,0.8-3.3,0.6-5c-0.2-1.7-1.1-3.3-2.6-4.8c-1.5-1.5-3.1-2.4-4.8-2.6
		c-1.7-0.2-3.4,0-5,0.6c-1.6,0.6-3.2,1.4-4.7,2.6C420.9,77,419.5,78.2,418.3,79.4L418.3,79.4z M418.8,91.8c0.2-0.7,0.5-1.4,1-2.2
		c0.5-0.8,1.1-1.6,1.8-2.4c0.7-0.8,1.5-1.6,2.1-2.3v0c0.7-0.7,1.5-1.4,2.3-2.2c0.8-0.7,1.6-1.3,2.4-1.8c0.8-0.5,1.5-0.8,2.2-0.9
		c0.2,0,0.3-0.1,0.4-0.1c0.4,0,0.7,0.1,0.9,0.4c0.4,0.4,0.5,0.8,0.3,1.3c-0.2,0.7-0.5,1.4-0.9,2.2c-0.5,0.8-1.1,1.6-1.8,2.4
		c-0.7,0.8-1.5,1.6-2.2,2.3c-0.7,0.7-1.5,1.4-2.3,2.1c-0.8,0.7-1.6,1.3-2.4,1.8c-0.8,0.5-1.5,0.8-2.2,1c-0.6,0.1-1,0-1.3-0.3
		C418.8,92.8,418.7,92.3,418.8,91.8z"/>
	<polygon class="st20" points="400.1,84.2 410.8,84.8 412,77.9 406.9,77.7 420.6,61.2 414.7,56.3 395.1,80 	"/>
	<polygon class="st21" points="383.5,71.5 394.2,71.1 394.8,64.1 389.6,64.4 401.7,46.7 395.4,42.4 378.1,67.7 	"/>
	<path class="st22" d="M361,46.2c-0.7,1.8-1.1,3.5-1.2,5.2c-0.1,1.8,0.2,3.4,0.8,5c0.7,1.6,2,2.9,3.8,3.9c1.5,0.8,3,1.3,4.4,1.3
		c0.3,0,0.7,0,1-0.1c1.7-0.2,3.2-0.9,4.7-1.9c1.4-1,2.7-2.3,3.8-3.8c1.1-1.5,2.1-3,2.9-4.5c0.8-1.5,1.6-3.1,2.2-4.8
		c0.7-1.8,1.1-3.5,1.2-5.2c0.1-1.8-0.2-3.4-0.8-5c-0.7-1.6-2-2.9-3.8-3.9c-1.9-1-3.7-1.4-5.4-1.2c-1.7,0.2-3.2,0.9-4.7,1.9
		c-1.4,1-2.7,2.3-3.8,3.8c-1.1,1.5-2.1,3-2.9,4.5C362.4,42.9,361.7,44.5,361,46.2z M367.2,53.1c0-0.7,0.1-1.5,0.3-2.4
		c0.3-0.9,0.6-1.9,1.1-2.9c0.5-1,1-1.9,1.4-2.8l0,0c0.5-0.9,1-1.8,1.6-2.7c0.6-0.9,1.2-1.7,1.8-2.4c0.6-0.7,1.2-1.2,1.8-1.5
		c0.3-0.1,0.5-0.2,0.8-0.2c0.2,0,0.4,0.1,0.6,0.2c0.4,0.2,0.7,0.6,0.7,1.2c0,0.7-0.1,1.5-0.3,2.3c-0.2,0.9-0.6,1.8-1.1,2.8
		c-0.5,1-1,1.9-1.4,2.8c-0.5,0.8-1,1.7-1.6,2.7c-0.6,0.9-1.2,1.7-1.8,2.4c-0.6,0.7-1.2,1.2-1.8,1.5c-0.5,0.3-0.9,0.3-1.4,0
		C367.4,54.1,367.2,53.7,367.2,53.1z"/>
	<path class="st23" d="M340.3,42.7c0,1.8,0.5,3.4,1.3,4.9c0.8,1.5,2.2,2.7,4.2,3.6c1.3,0.6,2.6,0.9,3.8,0.9c0.6,0,1.1-0.1,1.7-0.2
		c1.6-0.4,3.1-1.2,4.5-2.3c1.3-1.1,2.5-2.5,3.4-4.1c1-1.6,1.8-3.2,2.5-4.7c0.7-1.6,1.3-3.2,1.8-5c0.5-1.8,0.7-3.6,0.7-5.3
		c0-1.8-0.5-3.4-1.3-4.9c-0.8-1.5-2.2-2.7-4.2-3.6c-1.9-0.9-3.8-1.1-5.4-0.7c-1.6,0.4-3.1,1.2-4.5,2.3c-1.3,1.1-2.5,2.5-3.5,4.1
		c-1,1.6-1.8,3.2-2.5,4.7c-0.7,1.5-1.3,3.2-1.8,5C340.5,39.2,340.3,41,340.3,42.7z M355.9,28.2c0.5,0.2,0.7,0.6,0.8,1.1
		c0.1,0.7,0.1,1.5-0.1,2.4c-0.2,0.9-0.4,1.9-0.8,2.9c-0.4,1-0.8,2-1.2,2.9c-0.4,0.9-0.8,1.8-1.3,2.8c-0.5,1-1,1.8-1.6,2.6
		c-0.6,0.7-1.1,1.3-1.7,1.7c-0.5,0.3-0.9,0.4-1.4,0.2c-0.5-0.2-0.7-0.6-0.8-1.1c-0.1-0.7-0.1-1.5,0.1-2.4c0.2-0.9,0.4-1.9,0.8-2.9
		c0.4-1,0.8-2,1.2-2.9c0.4-0.9,0.9-1.9,1.4-2.9c0.5-1,1-1.8,1.6-2.6c0.5-0.7,1.1-1.3,1.7-1.7C355,28,355.4,28,355.9,28.2z"/>
	<path class="st24" d="M320.1,35.8c0.2,1.7,0.8,3.3,1.7,4.7c1,1.4,2.5,2.5,4.5,3.1c1.1,0.4,2.1,0.5,3.1,0.5c0.8,0,1.6-0.1,2.4-0.4
		c1.6-0.6,3-1.5,4.2-2.8c1.2-1.3,2.2-2.7,3-4.4c0.8-1.7,1.5-3.3,2-4.9c0.5-1.6,1-3.3,1.3-5.2c0.3-1.8,0.4-3.7,0.2-5.4
		c-0.2-1.7-0.8-3.3-1.7-4.7c-1-1.4-2.5-2.5-4.5-3.1c-2-0.7-3.9-0.7-5.5-0.2c-1.6,0.6-3,1.5-4.2,2.8c-1.2,1.3-2.2,2.7-3.1,4.4
		c-0.8,1.7-1.5,3.3-2.1,4.9v0c-0.5,1.6-1,3.4-1.3,5.2C320,32.2,319.9,34.1,320.1,35.8z M335.1,20.9c0.2,0.7,0.2,1.5,0.1,2.4
		c-0.1,0.9-0.3,1.9-0.5,3c-0.3,1.1-0.6,2.1-0.9,3c-0.3,0.9-0.7,1.9-1.1,2.9c-0.4,1-0.9,1.9-1.4,2.7c-0.5,0.8-1,1.4-1.5,1.8
		c-0.4,0.4-0.9,0.5-1.3,0.3c-0.5-0.2-0.8-0.5-0.9-1c-0.2-0.7-0.2-1.5-0.1-2.4c0.1-0.9,0.3-2,0.5-3c0.3-1.1,0.6-2.1,0.9-3
		c0.3-0.9,0.7-1.9,1.1-3c0.4-1,0.9-1.9,1.4-2.7c0.5-0.8,1-1.4,1.5-1.8c0.4-0.4,0.9-0.5,1.3-0.3C334.7,20,335,20.3,335.1,20.9z"/>
	<path class="st25" d="M315.7,34.5c1.1-1.4,1.9-2.9,2.6-4.7c0.7-1.7,1.2-3.4,1.6-5.1c0.4-1.6,0.7-3.4,0.8-5.3
		c0.2-1.9,0.1-3.7-0.3-5.4c-0.4-1.7-1.1-3.2-2.2-4.5c-1.1-1.3-2.7-2.2-4.8-2.7c-2.1-0.5-3.9-0.4-5.5,0.4c-1.5,0.7-2.9,1.8-3.9,3.1
		c-1.1,1.4-2,2.9-2.6,4.7c-0.7,1.7-1.2,3.4-1.6,5.1c-0.4,1.6-0.6,3.4-0.8,5.3c-0.2,1.9,0,3.7,0.3,5.4c0.4,1.7,1.1,3.2,2.2,4.5
		c1.1,1.3,2.7,2.2,4.8,2.7c0.8,0.2,1.6,0.3,2.4,0.3c1.1,0,2.2-0.2,3.1-0.6C313.3,37,314.6,35.9,315.7,34.5z M311.9,13.6
		c0.5,0.1,0.8,0.4,1,1c0.2,0.6,0.3,1.4,0.4,2.3c0,0.9-0.1,1.9-0.3,3c-0.2,1.1-0.4,2.1-0.6,3.1c-0.2,0.9-0.5,2-0.8,3
		c-0.3,1-0.7,2-1.1,2.9c-0.4,0.8-0.9,1.5-1.3,2c-0.4,0.4-0.8,0.5-1.3,0.4c-0.5-0.1-0.8-0.4-1-1c-0.2-0.6-0.3-1.4-0.3-2.4
		c0-0.9,0.1-2,0.3-3c0.2-1.1,0.4-2.1,0.6-3.1v0c0.2-0.9,0.5-2,0.8-3.1c0.3-1,0.7-2,1.1-2.8c0.4-0.8,0.9-1.5,1.3-2
		c0.3-0.3,0.6-0.5,1-0.5C311.7,13.6,311.8,13.6,311.9,13.6z"/>
	<polygon class="st26" points="296.3,28.7 293.7,22.2 289.2,24.7 292,3.5 284.4,2.5 280.4,33 286.9,33.8 	"/>
	<path class="st27" d="M251.6,30.7c1.3,1.1,3.1,1.6,5.2,1.7c0.1,0,0.1,0,0.2,0c2,0,3.7-0.5,5.1-1.5c1.4-1,2.4-2.3,3.2-3.9
		c0.8-1.6,1.3-3.3,1.6-5.1c0.3-1.8,0.4-3.6,0.5-5.3c0-1.7-0.1-3.5-0.3-5.3c-0.2-1.9-0.7-3.6-1.4-5.2c-0.7-1.6-1.8-2.9-3.1-4
		c-1.3-1.1-3.1-1.6-5.2-1.7c-2.1,0-3.9,0.5-5.3,1.5c-1.4,1-2.4,2.3-3.2,3.9c-0.8,1.5-1.3,3.3-1.6,5.1c-0.3,1.8-0.5,3.6-0.5,5.3
		c0,1.7,0.1,3.5,0.3,5.3c0.2,1.9,0.7,3.6,1.4,5.2C249.3,28.3,250.3,29.7,251.6,30.7z M259.6,19.5c-0.1,1.1-0.2,2.1-0.5,3
		c-0.2,0.9-0.5,1.6-0.9,2.2c-0.3,0.5-0.7,0.7-1.2,0.7c-0.5,0-0.9-0.2-1.2-0.7c-0.4-0.6-0.6-1.3-0.8-2.2c-0.2-0.9-0.3-1.9-0.4-3
		c-0.1-1.1-0.1-2.2-0.1-3.1c0-1,0.1-2.1,0.2-3.2c0.1-1.1,0.2-2.1,0.5-3c0.2-0.9,0.5-1.6,0.9-2.2c0.3-0.5,0.7-0.7,1.2-0.7
		c0,0,0,0,0,0c0.5,0,0.9,0.2,1.2,0.7c0.4,0.6,0.6,1.3,0.8,2.2c0.2,0.9,0.3,1.9,0.4,3c0.1,1.1,0.1,2.2,0.1,3.2
		C259.7,17.4,259.6,18.4,259.6,19.5z"/>
	<polygon class="st28" points="237.5,23.1 235.6,1.8 228,2.5 230.7,33.1 237.2,32.5 245.3,25.4 241.3,19.7 	"/>
	<polygon class="st29" points="219.3,22.1 215.8,25.8 212,4.8 204.5,6.1 210,36.4 216.5,35.2 223.9,27.4 	"/>
	<path class="st29" d="M199.8,37.8c1-1.3,1.7-2.9,2-4.6c0.3-1.7,0.3-3.5,0-5.4c-0.3-1.8-0.6-3.6-1.1-5.2c-0.5-1.6-1.1-3.3-1.8-5
		c-0.8-1.7-1.7-3.3-2.8-4.6c-1.2-1.3-2.5-2.3-4.1-2.9c-1.6-0.6-3.4-0.7-5.5-0.1c-2,0.6-3.6,1.6-4.6,2.9c-1,1.3-1.7,2.9-2,4.6
		c-0.3,1.7-0.3,3.5-0.1,5.4c0.2,1.8,0.6,3.6,1.1,5.2c0.5,1.6,1.1,3.3,1.8,5c0.8,1.7,1.7,3.2,2.9,4.6c1.2,1.3,2.5,2.3,4.1,2.9
		c0.8,0.3,1.7,0.5,2.7,0.5c0.9,0,1.8-0.1,2.8-0.4C197.2,40.1,198.8,39.2,199.8,37.8z M193.3,34.1c-0.5,0.1-0.9,0-1.3-0.4
		c-0.5-0.5-1-1.1-1.4-1.9c-0.5-0.8-0.9-1.8-1.2-2.8c-0.4-1-0.7-2-0.9-3c-0.3-0.9-0.5-2-0.8-3.1c-0.2-1.1-0.4-2.1-0.4-3
		c0-0.9,0-1.7,0.2-2.4c0.2-0.5,0.5-0.9,0.9-1c0.5-0.1,0.9,0,1.3,0.4c0.5,0.5,1,1.1,1.4,1.9c0.5,0.8,0.9,1.7,1.2,2.8
		c0.4,1,0.7,2.1,1,3c0.3,0.9,0.5,2,0.7,3c0.2,1.1,0.4,2.1,0.4,3c0,0.9,0,1.7-0.2,2.4C194.1,33.6,193.8,33.9,193.3,34.1z"/>
	<polygon class="st29" points="176.6,32.9 173.8,37.3 166.1,17.3 159,20 170.1,48.7 176.2,46.3 182,37.3 	"/>
	<polygon class="st30" points="157,54.7 162,45.2 156.1,41.3 153.8,45.9 144.3,26.7 137.4,30.1 151.2,57.6 	"/>
	<polygon class="st31" points="138.7,64.8 142.8,54.8 136.6,51.5 134.7,56.3 123.4,38.1 116.9,42.2 133.2,68.3 	"/>
	<path class="st32" d="M100.2,66.7c0.9,1.6,1.9,3.1,2.9,4.5c1,1.4,2.2,2.7,3.5,4c1.3,1.3,2.8,2.4,4.3,3.2c1.6,0.8,3.2,1.2,4.9,1.2
		c0,0,0,0,0,0c1.7,0,3.4-0.6,5.1-1.9c1.7-1.3,2.8-2.8,3.2-4.4c0.4-1.6,0.5-3.3,0.1-5c-0.4-1.7-1-3.4-1.9-5c-0.9-1.6-1.9-3.1-2.9-4.5
		c-1-1.4-2.2-2.7-3.5-4c-1.3-1.3-2.8-2.4-4.3-3.2c-1.6-0.8-3.2-1.2-4.9-1.2c-1.7,0-3.4,0.6-5.1,1.9c-1.7,1.3-2.8,2.8-3.2,4.4
		c-0.4,1.6-0.5,3.3-0.1,5C98.6,63.4,99.3,65.1,100.2,66.7z M116.8,72.2c-0.4,0.3-0.8,0.4-1.4,0.1c-0.6-0.2-1.3-0.7-2-1.2
		c-0.7-0.6-1.5-1.3-2.2-2.1c-0.7-0.8-1.4-1.7-2-2.4c-0.6-0.8-1.2-1.7-1.8-2.6c-0.6-0.9-1.1-1.8-1.5-2.7c-0.4-0.8-0.6-1.6-0.6-2.3
		c-0.1-0.6,0.1-1,0.5-1.3c0.4-0.3,0.8-0.3,1.4-0.1c0.6,0.2,1.3,0.7,2,1.2c0.7,0.6,1.4,1.3,2.2,2.1c0.7,0.8,1.4,1.7,2,2.5
		c0.6,0.8,1.2,1.6,1.8,2.5c0.6,0.9,1.1,1.8,1.5,2.7c0.4,0.8,0.6,1.6,0.7,2.3C117.3,71.5,117.2,71.9,116.8,72.2z"/>
	<animateTransform attributeType="xml" attributeName="transform" type="rotate" from="0 256 256" to="360 256 256" dur="2.0s" repeatCount="indefinite"/>
</g>
</svg>
