<svg version="1.1" id="Layer_1" xmlns="http://www.w3.org/2000/svg" xmlns:xlink="http://www.w3.org/1999/xlink" x="0px" y="0px"
	 viewBox="0 0 512 512" style="enable-background:new 0 0 512 512;" xml:space="preserve">
<path d="M27.11,137.11c-15.68,0-27.36-13.12-27.11-27.11l1.13-61.08C1.72,21.74,23.93,0,51.12,0h409.68
	c27.2,0,49.4,21.74,49.99,48.93l1.2,61.08c0.26,13.98-11.08,27.11-27.11,27.11s-27.11-13.08-27.11-27.11
	c0-54.64-0.59-54.64-84.36-54.64h-90.06v286.25c0,100.82,0.03,115.48,73.46,115.48c14.46,0,27.45,11.36,27.45,27.45
	S371.29,512,356.82,512H155.1c-14.88,0-27.45-11.6-27.45-27.45s13.4-27.45,27.45-27.45c72.54,0,73.33-15.21,73.33-115.48V55.37
	h-90.32c-83.9,0-83.9,0.58-83.9,54.64C54.21,123.75,42.79,137.11,27.11,137.11z"/>
</svg>
