<?xml version="1.0" encoding="utf-8"?>
<!-- Generator: Adobe Illustrator 22.0.1, SVG Export Plug-In . SVG Version: 6.00 Build 0)  -->
<svg version="1.1" id="Layer_3" xmlns="http://www.w3.org/2000/svg" xmlns:xlink="http://www.w3.org/1999/xlink" x="0px" y="0px"
	 viewBox="0 0 512 512" enable-background="new 0 0 512 512" xml:space="preserve">
<g>
	<g>
		<path d="M500.004,512H391.663c-3.535,0-6.89-1.559-9.169-4.26l-25.38-30.081l-25.38,30.081c-2.28,2.701-5.634,4.26-9.169,4.26
			h-108.34c-4.661,0-8.9-2.7-10.871-6.923c-1.971-4.223-1.317-9.206,1.676-12.779l81.84-97.655l-29.64-35.416
			c-30.521,13.841-67.034,20.849-108.707,20.849H11.996C5.371,380.077,0,374.706,0,368.08V11.997C0,5.371,5.371,0,11.996,0h136.528
			c41.024,0,77.653,7.597,108.871,22.58c31.691,15.211,56.608,37.304,74.061,65.665c17.407,28.287,26.232,61.902,26.232,99.991
			c0,38.006-7.154,70.973-21.279,98.145l20.653,24.384l19.431-23.203c2.28-2.722,5.648-4.294,9.197-4.294h109.195
			c4.665,0,8.906,2.704,10.876,6.933c1.969,4.229,1.307,9.216-1.695,12.786l-77.101,91.658l82.215,97.632
			c3.006,3.569,3.669,8.557,1.701,12.788C508.912,509.294,504.669,512,500.004,512z M397.238,488.007h76.981l-72.109-85.632
			c-3.759-4.464-3.761-10.984-0.005-15.449l67.013-79.666h-77.826l-24.98,29.83c-2.272,2.713-5.625,4.284-9.164,4.294
			c-0.011,0-0.022,0-0.033,0c-3.526,0-6.875-1.551-9.154-4.243l-35.215-41.577c-3.304-3.901-3.772-9.468-1.168-13.866
			c14.676-24.782,22.118-56.227,22.118-93.462c0-33.583-7.629-62.967-22.673-87.417c-15.001-24.376-36.537-43.423-64.009-56.609
			c-27.952-13.415-61.088-20.217-98.489-20.217H23.993v332.091h124.532c41.841,0,77.638-7.532,106.398-22.388
			c4.988-2.576,11.099-1.349,14.705,2.959l42.091,50.294c3.731,4.458,3.729,10.949-0.005,15.405l-71.782,85.653h77.06l30.955-36.688
			c2.28-2.702,5.634-4.26,9.169-4.26c3.535,0,6.89,1.559,9.169,4.26L397.238,488.007z M156.677,267.992h-23.944
			c-6.625,0-11.996-5.371-11.996-11.996V124.04c0-6.625,5.371-11.996,11.996-11.996h23.944c24.142,0,43.385,6.689,57.196,19.882
			c13.959,13.352,21.034,32.296,21.034,56.311c0,25.726-6.722,45.646-19.978,59.207C201.598,261.078,182,267.992,156.677,267.992z
			 M144.73,243.999h11.948c37.509,0,54.237-17.198,54.237-55.764c0-17.455-4.455-30.201-13.62-38.967
			c-9.318-8.903-22.607-13.233-40.617-13.233H144.73V243.999z"/>
	</g>
</g>
</svg>
