<?xml version="1.0" encoding="utf-8"?>
<!-- Generator: Adobe Illustrator 22.1.0, SVG Export Plug-In . SVG Version: 6.00 Build 0)  -->
<svg version="1.1" id="Layer_1" xmlns="http://www.w3.org/2000/svg" xmlns:xlink="http://www.w3.org/1999/xlink" x="0px" y="0px"
	 viewBox="0 0 512 512" style="enable-background:new 0 0 512 512;" xml:space="preserve">
<path d="M190.7,320.9c11.9,11.9,25.7,19.9,41.4,24.1c15.8,4.2,31.5,4.2,47.3,0c15.8-4.2,29.6-12.3,41.4-24.1
	c11.9-11.9,19.9-25.7,24.1-41.4c4.2-15.8,4.2-31.5,0-47.3c-4.2-15.8-12.3-29.6-24.1-41.4c-11.9-11.9-25.7-19.9-41.4-24.1
	c-15.8-4.2-31.5-4.2-47.3,0c-15.8,4.2-29.6,12.3-41.4,24.1c-11.9,11.9-19.9,25.7-24.1,41.4c-4.2,15.8-4.2,31.5,0,47.3
	C170.8,295.3,178.9,309.1,190.7,320.9z M241,248.1c1.8-3.8,5.4-9.5,10.6-17c5.3-7.5,9.2-13.5,11.9-18c4.3-7.5,7.7-15.4,10-23.8
	c0.8-2.3,2.3-4,4.4-4.9c2.1-0.9,4.2-0.9,6.4,0c2.2,0.9,3.6,2.5,4.3,4.9c2.5,8.3,5.8,16.4,10,24c2.7,4.5,6.6,10.5,11.9,17.9
	c5.3,7.4,8.8,13.1,10.6,16.9c3,6.2,4.5,12.6,4.5,19.3c0,8-2,15.4-6,22.3c-4,6.8-9.4,12.3-16.3,16.3c-6.8,4-14.3,6-22.3,6
	s-15.4-2-22.3-6c-6.8-4-12.3-9.4-16.3-16.3c-4-6.8-6-14.3-6-22.3C236.5,260.9,238,254.4,241,248.1z M64.5,401.3l58.2,33.6
	l-37.5,37.5c-3.5,3.5-7.6,5.2-12.6,5.2c-4.9,0-9.1-1.7-12.6-5.2l-20.7-20.7c-3.5-3.5-5.2-7.6-5.2-12.6c0-4.9,1.7-9.1,5.2-12.6
	L64.5,401.3z M477.9,128v256L256.2,512l-133.5-77.1l33.2-33.2c3.5-3.5,5.2-7.6,5.2-12.6v-11.8c27.6,21.7,59.2,32.6,94.7,32.6
	c28.1,0,53.9-6.9,77.3-20.7c23.4-13.8,42.1-32.4,55.9-55.9c13.8-23.4,20.7-49.2,20.7-77.3s-6.9-53.9-20.7-77.3
	c-13.8-23.4-32.4-42.1-55.9-55.9c-23.4-13.8-49.2-20.7-77.3-20.7s-53.9,6.9-77.3,20.7c-23.4,13.8-42.1,32.4-55.9,55.9
	s-20.7,49.2-20.7,77.3c0,35.5,10.9,67.1,32.6,94.7h-11.8c-4.9,0-9.1,1.7-12.6,5.2l-45.5,45.5l-30-17.3V128L256.2,0L477.9,128z
	 M289.2,245.6c0-0.5-0.2-0.9-0.5-1.3c-0.4-0.4-0.8-0.5-1.3-0.5h-10.4v-10.4c0-0.5-0.2-0.9-0.5-1.3c-0.4-0.4-0.8-0.5-1.3-0.5h-8.5
	c-0.5,0-0.9,0.2-1.3,0.5s-0.5,0.8-0.5,1.3v10.4h-10.4c-0.5,0-0.9,0.2-1.3,0.5c-0.4,0.4-0.5,0.8-0.5,1.3v8.5c0,0.5,0.2,0.9,0.5,1.3
	c0.4,0.4,0.8,0.5,1.3,0.5h10.4v10.4c0,0.5,0.2,0.9,0.5,1.3s0.8,0.5,1.3,0.5h8.5c0.5,0,0.9-0.2,1.3-0.5c0.4-0.4,0.5-0.8,0.5-1.3
	v-10.4h10.4c0.5,0,0.9-0.2,1.3-0.5c0.4-0.4,0.5-0.8,0.5-1.3V245.6z"/>
</svg>
