{
  "$schema": "../../node_modules/ng-packagr/ng-package.schema.json",
  "dest": "../../dist/style",
  "lib": {
    "entryFile": "./src/index.ts",
    "styleIncludePaths": ["../style"]
  },
  "whitelistedNonPeerDependencies": [
    "."
  ],
  "assets": ["src/core.scss"]
}
