<?xml version="1.0" encoding="utf-8"?>
<svg version="1.1" id="Layer_6" xmlns="http://www.w3.org/2000/svg" xmlns:xlink="http://www.w3.org/1999/xlink" x="0px" y="0px"
	 viewBox="0 0 512 512" style="enable-background:new 0 0 512 512;" xml:space="preserve">
<style type="text/css">
	.st0{fill:none;}
</style>
<g>
	<rect id="_x3C_512x512square_x3E__00000133491112168722962610000014829750519924122272_" class="st0" width="512" height="512"/>
	<path id="_x3C_CompoundPath_x3E_" d="M14.6,343.8h43.9V65.8c0-8.1,6.6-14.6,14.6-14.6h29.3c8.1,0,14.6,6.6,14.6,14.6v277.9h43.9
		c13,0,19.5,15.8,10.3,25l-73.1,87.8c-2.7,2.6-6.3,4.3-10.3,4.3s-7.7-1.7-10.3-4.3L4.3,368.8C-4.9,359.6,1.6,343.8,14.6,343.8z
		 M197.3,407.7c0,20.5,16.6,37.1,37.1,37.1h240.4c20.5,0,37.1-16.6,37.1-37.1V215.8H197.3V407.7z M246.8,277.7
		c0-6.8,5.6-12.4,12.4-12.4h74.3c6.8,0,12.4,5.6,12.4,12.4V352c0,6.8-5.6,12.4-12.4,12.4h-74.3c-6.8,0-12.4-5.6-12.4-12.4V277.7z
		 M512,153.9V191H197.3v-37.1c0-20.5,16.6-37.1,37.1-37.1h37.1V79.6c0-6.8,5.6-12.4,12.4-12.4h24.8c6.8,0,12.4,5.6,12.4,12.4v37.1
		h67.1V79.6c0-6.8,5.6-12.4,12.4-12.4h24.8c6.8,0,12.4,5.6,12.4,12.4v37.1h37.1C495.4,116.7,512,133.4,512,153.9z"/>
</g>
</svg>
