{
    "wstl": {
        "title": "HEA Server Organization",
        "actions": [
            {
                "name": "heaserver-organizations-organization-duplicate",
                "type": "safe",
                "target": "item",
                "prompt": "Duplicate"
            },
            {
                "name": "heaserver-organizations-organization-get-open-choices",
                "description": "Open this organization",
                "type": "safe",
                "action": "read",
                "target": "item read cj",
                "prompt": "Open"
            },
            {
                "name": "heaserver-organizations-organization-get-self",
                "description": "View this organization",
                "type": "safe",
                "action": "read",
                "target": "item read cj",
                "prompt": "View"
            },
            {
                "name": "heaserver-organizations-account-get-actual",
                "description": "View the actual account object",
                "type": "safe",
                "action": "read",
                "target": "item read cj",
                "prompt": "View actual"
            },
            {
                "name": "heaserver-organizations-member-get-self",
                "description": "View this member",
                "type": "safe",
                "action": "read",
                "target": "item read cj",
                "prompt": "View"
            },
            {
                "name": "heaserver-organizations-organization-get-members",
                "description": "View this organization's members",
                "type": "safe",
                "action": "read",
                "target": "item read cj",
                "prompt": "View"
            },
            {
                "name": "heaserver-organizations-organization-get-memberseditor",
                "description": "Edit this organization's membership",
                "type": "safe",
                "action": "read",
                "target": "item read cj",
                "prompt": "Members editor"
            },
            {
                "name": "heaserver-organizations-organization-get-recently-accessed-objects",
                "description": "View recently accessed objects in the organization's accounts",
                "type": "safe",
                "action": "read",
                "target": "item read cj",
                "prompt": "Recently Accessed Objects"
            },
            {
                "name": "heaserver-organization-recentlyaccessed-get-actual",
                "type": "safe",
                "action": "read",
                "target": "item read cj",
                "prompt": "Get actual"
            },
            {
                "name": "heaserver-organizations-organization-get-properties",
                "description": "View and edit this Organization's properties",
                "type": "unsafe",
                "target": "item cj-template",
                "action": "update",
                "prompt": "Properties",
                "inputs": [
                    {
                        "name": "id",
                        "prompt": "Id",
                        "readOnly": true,
                        "hea": {
                            "display": false
                        }
                    },
                    {
                        "name": "display_name",
                        "prompt": "Name",
                        "required": true
                    },
                    {
                        "name": "name",
                        "prompt": "Name",
                        "required": false,
                        "hea": {
                            "display": false
                        }
                    },
                    {
                        "name": "type",
                        "readOnly": true,
                        "required": true,
                        "value": "heaobject.organization.Organization",
                        "hea": {
                            "display": false
                        }
                    },
                    {
                        "name": "type_display_name",
                        "prompt": "Type",
                        "readOnly": true,
                        "required": true,
                        "value": "Organization"
                    },
                    {
                        "name": "description",
                        "prompt": "Description",
                        "type": "textarea"
                    },
                    {
                        "name": "mime_type",
                        "prompt": "MIME type",
                        "readOnly": true,
                        "hea": {
                            "display": false
                        }
                    },
                    {
                        "hea": {
                            "cardinality": "multiple",
                            "optionsFromUrl": {
                                "path": "accounts/",
                                "value": "id",
                                "text": "display_name"
                            }
                        },
                        "name": "account_ids",
                        "prompt": "Accounts",
                        "type": "select"
                    },
                    {
                        "name": "principal_investigator_id",
                        "prompt": "Principal Investigator",
                        "type": "select",
                        "hea": {
                            "optionsFromUrl": {
                                "path": "people/?excludesystem=yes",
                                "value": "id",
                                "text": "display_name"
                            }
                        }
                    },
                    {
                        "hea": {
                            "cardinality": "multiple",
                            "optionsFromUrl": {
                                "path": "people/?excludesystem=yes",
                                "value": "id",
                                "text": "display_name"
                            }
                        },
                        "name": "admin_ids",
                        "prompt": "Admins",
                        "type": "select"
                    },
                    {
                        "hea": {
                            "cardinality": "multiple",
                            "optionsFromUrl": {
                                "path": "people/?excludesystem=yes",
                                "value": "id",
                                "text": "display_name"
                            }
                        },
                        "name": "manager_ids",
                        "prompt": "Managers",
                        "type": "select"
                    },
                    {
                        "hea": {
                            "cardinality": "multiple",
                            "optionsFromUrl": {
                                "path": "people/?excludesystem=yes",
                                "value": "id",
                                "text": "display_name"
                            }
                        },
                        "name": "member_ids",
                        "prompt": "Members",
                        "type": "select"
                    },
                    {
                        "hea": {
                            "cardinality": "multiple",
                            "optionsFromUrl": {
                                "path": "people/?excludesystem=yes",
                                "value": "id",
                                "text": "display_name"
                            }
                        },
                        "name": "collaborator_ids",
                        "prompt": "Collaborators",
                        "type": "select",
                        "readOnly": true
                    },
                    {
                        "name": "owner",
                        "prompt": "Owner",
                        "required": true,
                        "type": "select",
                        "hea": {
                            "optionsFromUrl": {
                                "path": "people/",
                                "value": "id",
                                "text": "display_name"
                            }
                        }
                    },
                    {
                        "name": "created",
                        "prompt": "Created",
                        "readOnly": true,
                        "hea": {
                            "type": "datetime"
                        }
                    },
                    {
                        "name": "modified",
                        "prompt": "Modified",
                        "readOnly": true,
                        "hea": {
                            "type": "datetime"
                        }
                    },
                    {
                        "name": "source",
                        "prompt": "Source",
                        "readOnly": true,
                        "value": "Internal",
                        "hea": {
                            "display": false
                        }
                    },
                    {
                        "hea": {
                            "section": "shares",
                            "sectionPrompt": "Shares",
                            "optionsFromUrl": {
                                "path": "people/",
                                "value": "id",
                                "text": "display_name"
                            },
                            "display": false
                        },
                        "name": "user",
                        "prompt": "User",
                        "required": true,
                        "type": "select"
                    },
                    {
                        "hea": {
                            "section": "shares",
                            "cardinality": "multiple",
                            "display": false
                        },
                        "name": "permissions",
                        "prompt": "Permissions",
                        "type": "select",
                        "suggest": [
                            {"value":  "COOWNER", "text":  "Co-owner"},
                            {"value":  "CREATOR", "text":  "Creator"},
                            {"value":  "DELETER", "text":  "Deleter"},
                            {"value":  "EDITOR", "text":  "Editor"},
                            {"value":  "SHARER", "text":  "Sharer"},
                            {"value":  "VIEWER", "text":  "Viewer"},
                            {"value":  "CHECK_DYNAMIC", "text": "Uses member info"}
                        ]
                    },
                    {
                        "hea": {
                            "section": "shares",
                            "display": false
                        },
                        "name": "type",
                        "prompt": "Type",
                        "required": true,
                        "readOnly": true,
                        "value": "heaobject.root.ShareImpl"
                    },
                    {
                        "hea": {
                            "cardinality": "multiple",
                            "optionsFromUrl": {
                                "path": "groups/",
                                "value": "id",
                                "text": "display_name"
                            }
                        },
                        "name": "admin_group_ids",
                        "prompt": "Admin groups",
                        "type": "select"
                    },
                    {
                        "hea": {
                            "cardinality": "multiple",
                            "optionsFromUrl": {
                                "path": "groups/",
                                "value": "id",
                                "text": "display_name"
                            }
                        },
                        "name": "manager_group_ids",
                        "prompt": "Manager groups",
                        "type": "select"
                    },
                    {
                        "hea": {
                            "cardinality": "multiple",
                            "optionsFromUrl": {
                                "path": "groups/",
                                "value": "id",
                                "text": "display_name"
                            }
                        },
                        "name": "member_group_ids",
                        "prompt": "Member groups",
                        "type": "select"
                    }
                ]
            },
            {
                "name": "heaserver-organizations-organization-edit-membership",
                "description": "View and edit this Organization's membership",
                "type": "unsafe",
                "target": "item cj-template",
                "action": "update",
                "prompt": "Membership",
                "inputs": [
                    {
                        "name": "id",
                        "prompt": "Id",
                        "readOnly": true,
                        "hea": {
                            "display": false
                        }
                    },
                    {
                        "name": "display_name",
                        "prompt": "Name",
                        "required": true,
                        "readOnly": true,
                        "hea": {
                            "display": false
                        }
                    },
                    {
                        "name": "name",
                        "prompt": "Name",
                        "required": false,
                        "hea": {
                            "display": false
                        }
                    },
                    {
                        "name": "type",
                        "prompt": "Type",
                        "readOnly": true,
                        "required": true,
                        "value": "heaobject.organization.Organization",
                        "hea": {
                            "display": false
                        }
                    },
                    {
                        "name": "description",
                        "prompt": "Description",
                        "type": "textarea",
                        "hea": {
                            "display": false
                        }
                    },
                    {
                        "name": "mime_type",
                        "prompt": "MIME type",
                        "readOnly": true,
                        "hea": {
                            "display": false
                        }
                    },
                    {
                        "hea": {
                            "cardinality": "multiple",
                            "optionsFromUrl": {
                                "path": "accounts/",
                                "value": "id",
                                "text": "display_name"
                            },
                            "display": false
                        },
                        "name": "account_ids",
                        "prompt": "Accounts",
                        "type": "select",
                        "readOnly": true
                    },
                    {
                        "name": "principal_investigator_id",
                        "prompt": "Principal Investigator",
                        "type": "select",
                        "hea": {
                            "optionsFromUrl": {
                                "path": "people/?excludesystem=yes",
                                "value": "id",
                                "text": "display_name"
                            }
                        }
                    },
                    {
                        "hea": {
                            "cardinality": "multiple",
                            "optionsFromUrl": {
                                "path": "people/?excludesystem=yes",
                                "value": "id",
                                "text": "display_name"
                            }
                        },
                        "name": "admin_ids",
                        "prompt": "Admins",
                        "type": "select"
                    },
                    {
                        "hea": {
                            "cardinality": "multiple",
                            "optionsFromUrl": {
                                "path": "people/?excludesystem=yes",
                                "value": "id",
                                "text": "display_name"
                            }
                        },
                        "name": "manager_ids",
                        "prompt": "Managers",
                        "type": "select"
                    },
                    {
                        "hea": {
                            "cardinality": "multiple",
                            "optionsFromUrl": {
                                "path": "people/?excludesystem=yes",
                                "value": "id",
                                "text": "display_name"
                            }
                        },
                        "name": "member_ids",
                        "prompt": "Members",
                        "type": "select"
                    },
                    {
                        "hea": {
                            "cardinality": "multiple",
                            "optionsFromUrl": {
                                "path": "people/?excludesystem=yes",
                                "value": "id",
                                "text": "display_name"
                            }
                        },
                        "name": "collaborator_ids",
                        "prompt": "Collaborators",
                        "type": "select",
                        "readOnly": true
                    },
                    {
                        "name": "owner",
                        "prompt": "Owner",
                        "required": true,
                        "type": "select",
                        "hea": {
                            "optionsFromUrl": {
                                "path": "people/",
                                "value": "id",
                                "text": "display_name"
                            },
                            "display": false
                        }
                    },
                    {
                        "name": "created",
                        "prompt": "Created",
                        "readOnly": true,
                        "hea": {
                            "type": "datetime"
                        },
                        "display": false
                    },
                    {
                        "name": "modified",
                        "prompt": "Modified",
                        "readOnly": true,
                        "hea": {
                            "type": "datetime"
                        },
                        "display": false
                    },
                    {
                        "name": "source",
                        "prompt": "Source",
                        "hea": {
                            "display": false
                        }
                    },
                    {
                        "hea": {
                            "section": "shares",
                            "sectionPrompt": "Shares",
                            "optionsFromUrl": {
                                "path": "people/",
                                "value": "id",
                                "text": "display_name"
                            },
                            "display": false
                        },
                        "name": "user",
                        "prompt": "User",
                        "required": true,
                        "type": "select"
                    },
                    {
                        "hea": {
                            "section": "shares",
                            "cardinality": "multiple",
                            "display": false
                        },
                        "name": "permissions",
                        "prompt": "Permissions",
                        "type": "select",
                        "suggest": [
                            {"value":  "COOWNER", "text":  "Co-owner"},
                            {"value":  "CREATOR", "text":  "Creator"},
                            {"value":  "DELETER", "text":  "Deleter"},
                            {"value":  "EDITOR", "text":  "Editor"},
                            {"value":  "SHARER", "text":  "Sharer"},
                            {"value":  "VIEWER", "text":  "Viewer"},
                            {"value":  "CHECK_DYNAMIC", "text": "Uses member info"}
                        ]
                    },
                    {
                        "hea": {
                            "section": "shares",
                            "display": false
                        },
                        "name": "type",
                        "prompt": "Type",
                        "required": true,
                        "readOnly": true,
                        "value": "heaobject.root.ShareImpl"
                    },
                    {
                        "hea": {
                            "cardinality": "multiple",
                            "optionsFromUrl": {
                                "path": "groups/",
                                "value": "id",
                                "text": "display_name"
                            },
                            "display": false
                        },
                        "name": "admin_group_ids",
                        "prompt": "Admin groups",
                        "type": "select"
                    },
                    {
                        "hea": {
                            "cardinality": "multiple",
                            "optionsFromUrl": {
                                "path": "groups/",
                                "value": "id",
                                "text": "display_name"
                            },
                            "display": false
                        },
                        "name": "manager_group_ids",
                        "prompt": "Manager groups",
                        "type": "select"
                    },
                    {
                        "hea": {
                            "cardinality": "multiple",
                            "optionsFromUrl": {
                                "path": "groups/",
                                "value": "id",
                                "text": "display_name"
                            },
                            "display": false
                        },
                        "name": "member_group_ids",
                        "prompt": "Member groups",
                        "type": "select"
                    }
                ]
            },
            {
                "name": "heaserver-organizations-organization-duplicate-form",
                "description": "Duplicate this organization",
                "type": "unsafe",
                "target": "item cj-template",
                "action": "update",
                "prompt": "Duplicate",
                "inputs": [
                    {
                        "name": "display_name",
                        "prompt": "Name",
                        "required": true
                    },
                    {
                        "name": "description",
                        "hea": {
                            "display": false
                        }
                    },
                    {
                        "name": "mime_type",
                        "prompt": "MIME type",
                        "hea": {
                            "display": false
                        }
                    },
                    {
                        "hea": {
                            "display": false
                        },
                        "name": "aws_account_ids"
                    },
                    {
                        "name": "principal_investigator_id",
                        "hea": {
                            "display": false
                        }
                    },
                    {
                        "hea": {
                            "display": false
                        },
                        "name": "admin_ids"
                    },
                    {
                        "hea": {
                            "display": false
                        },
                        "name": "manager_ids"
                    },
                    {
                        "hea": {
                            "display": false
                        },
                        "name": "member_ids"
                    },
                    {
                        "name": "owner",
                        "hea": {
                            "display": false
                        }
                    },
                    {
                        "name": "created",
                        "hea": {
                            "display": false
                        }
                    },
                    {
                        "name": "modified",
                        "hea": {
                            "display": false
                        }
                    },
                    {
                        "name": "source",
                        "hea": {
                            "display": false
                        }
                    },
                    {
                        "hea": {
                            "section": "shares",
                            "display": false
                        },
                        "name": "user"
                    },
                    {
                        "hea": {
                            "section": "shares",
                            "display": false
                        },
                        "name": "permissions"
                    }
                ]
            },
            {
                "name": "heaserver-organizations-organization-open-awsaccounts",
                "description": "Open AWS accounts",
                "type": "safe",
                "action": "read",
                "target": "item read cj",
                "prompt": "Open"
            },
            {
                "name": "heaserver-organizations-awsaccount-get-open-choices",
                "description": "Open this AWS account",
                "type": "safe",
                "action": "read",
                "target": "item read cj",
                "prompt": "Open"
            }
        ]
    }
}
