{
  "wstl": {
    "actions": [
      {
        "name": "data-adapter-list",
        "description": "List data adapters",
        "type": "safe",
        "action": "read",
        "target": "list app cj",
        "prompt": "List"
      }
    ]
  }
}
