{
  "wstl": {
    "actions": [
      {
        "name": "data-adapter-search",
        "description": "Search data adapters",
        "type": "safe",
        "action": "read",
        "target": "list cj",
        "prompt": "Search",
        "inputs": [
        {
          "name": "keywords",
          "prompt": "Keywords",
          "value": "",
          "required": true
        },
          {
          "name": "match-case",
          "prompt": "Match case?",
          "value": "",
          "required": true,
          "suggest": [{"value":"true"},{"value":"false"}]
        }
        ]
      }
    ]
  }
}
