{
  "wstl": {
    "actions": [
      {
        "name": "data-adapter-open",
        "description": "Open this data adapter",
        "type": "safe",
        "action": "read",
        "target": "item href cj",
        "prompt": "Open"
      }
    ]
  }
}
