{
    "wstl": {
        "title": "Registry components",
        "actions": [
            {
                "name": "component-get-open-choices",
                "type": "safe",
                "target": "item read cj",
                "prompt": "Open as..."
            },
            {
                "name": "component-open-default",
                "type": "safe",
                "target": "item read cj",
                "prompt": "Open"
            },
            {
                "name": "component-duplicate",
                "type": "safe",
                "target": "item",
                "prompt": "Duplicate"
            },
            {
                "name": "component-get-properties",
                "description": "View and edit this component's properties",
                "type": "unsafe",
                "target": "item cj-template",
                "action": "update",
                "prompt": "Properties",
                "inputs": [
                    {
                        "name": "id",
                        "prompt": "Id",
                        "readOnly": true
                    },
                    {
                        "name": "display_name",
                        "prompt": "Name",
                        "required": true
                    },
                    {
                        "name": "description",
                        "prompt": "Description",
                        "type": "textarea"
                    },
                    {
                        "name": "base_url",
                        "prompt": "Base URL",
                        "required": true,
                        "hea": {
                            "type": "url"
                        }
                    },
                    {
                        "hea": {
                            "section": "resources",
                            "sectionPrompt": "Resources"
                        },
                        "name": "resource_type_name",
                        "prompt": "Type name",
                        "required": true
                    },
                    {
                        "hea": {
                            "section": "resources"
                        },
                        "name": "base_path",
                        "prompt": "Base path",
                        "required": true
                    },
                    {
                        "hea": {
                            "section": "resources"
                        },
                        "name": "file_system_name",
                        "prompt": "File system name",
                        "required": true
                    },
                    {
                        "hea": {
                            "section": "resources"
                        },
                        "name": "file_system_type",
                        "prompt": "File system type",
                        "required": true
                    },
                    {
                        "hea": {
                            "section": "resources"
                        },
                        "name": "resource_type_name",
                        "prompt": "Resource type name",
                        "required": true
                    },
                    {
                        "name": "owner",
                        "prompt": "Owner",
                        "required": true,
                        "type": "select",
                        "readOnly": true,
                        "hea": {
                            "optionsFromUrl": {
                                "path": "/people/",
                                "value": "name",
                                "text": "display_name"
                            }
                        }
                    },
                    {
                        "name": "created",
                        "prompt": "Created",
                        "readOnly": true,
                        "hea": {
                            "type": "datetime"
                        }
                    },
                    {
                        "name": "modified",
                        "prompt": "Modified",
                        "readOnly": true,
                        "hea": {
                            "type": "datetime"
                        }
                    },
                    {
                        "name": "source",
                        "prompt": "Source"
                    },
                    {
                        "hea": {
                            "section": "shares",
                            "sectionPrompt": "Shares",
                            "optionsFromUrl": {
                                "path": "/people/",
                                "value": "name",
                                "text": "display_name"
                            }
                        },
                        "name": "user",
                        "prompt": "User",
                        "required": true,
                        "type": "select"
                    },
                    {
                        "hea": {
                            "section": "shares",
                            "cardinality": "multiple"
                        },
                        "name": "permissions",
                        "prompt": "Permissions",
                        "type": "select",
                        "suggest": [
                            {"value":  "COOWNER", "text":  "Co-owner"},
                            {"value":  "CREATOR", "text":  "Creator"},
                            {"value":  "DELETER", "text":  "Deleter"},
                            {"value":  "EDITOR", "text":  "Editor"},
                            {"value":  "SHARER", "text":  "Sharer"},
                            {"value":  "VIEWER", "text":  "Viewer"}
                        ]
                    }
                ]
            },
            {
                "name": "component-duplicate-form",
                "description": "Duplicate this component",
                "type": "unsafe",
                "target": "item cj-template",
                "action": "append",
                "prompt": "Duplicate",
                "inputs": [
                    {
                        "name": "display_name",
                        "prompt": "Name",
                        "required": true
                    },
                    {
                        "name": "description",
                        "hea": {
                            "display": false
                        }
                    },
                    {
                        "name": "base_url",
                        "hea": {
                            "display": false
                        }
                    },
                    {
                        "hea": {
                            "section": "resources",
                            "display": false
                        },
                        "name": "resource_type_name"
                    },
                    {
                        "hea": {
                            "section": "resources",
                            "display": false
                        },
                        "name": "base_path"
                    },
                    {
                        "hea": {
                            "section": "resources",
                            "display": false
                        },
                        "name": "file_system_name"
                    },
                    {
                        "hea": {
                            "section": "resources",
                            "display": false
                        },
                        "name": "file_system_type"
                    },
                    {
                        "hea": {
                            "section": "resources",
                            "display": false
                        },
                        "name": "resource_type_name"
                    },
                    {
                        "name": "owner",
                        "hea": {
                            "display": false
                        }
                    },
                    {
                        "name": "created",
                        "hea": {
                            "display": false
                        }
                    },
                    {
                        "name": "modified",
                        "hea": {
                            "display": false
                        }
                    },
                    {
                        "name": "source",
                        "hea": {
                            "display": false
                        }
                    },
                    {
                        "hea": {
                            "section": "shares",
                            "display": false
                        },
                        "name": "user"
                    },
                    {
                        "hea": {
                            "section": "shares",
                            "display": false
                        },
                        "name": "permissions"
                    }
                ]
            },
            {
                "name": "heaserver-organizations-organization-duplicate",
                "type": "safe",
                "target": "item",
                "prompt": "Duplicate"
            },
            {
                "name": "heaserver-organizations-organization-get-open-choices",
                "description": "Open this organization",
                "type": "safe",
                "action": "read",
                "target": "item read cj",
                "prompt": "Open"
            },
            {
                "name": "heaserver-organizations-organization-get-properties",
                "description": "View and edit this Organization's properties",
                "type": "unsafe",
                "target": "item cj-template",
                "action": "update",
                "prompt": "Properties",
                "inputs": [
                    {
                        "name": "id",
                        "prompt": "Id",
                        "readOnly": true
                    },
                    {
                        "name": "display_name",
                        "prompt": "Name",
                        "required": true
                    },
                    {
                        "name": "description",
                        "prompt": "Description",
                        "type": "textarea"
                    },
                    {
                        "name": "owner",
                        "prompt": "Owner",
                        "type": "select",
                        "hea": {
                            "optionsFromUrl": {
                                "path": "/people/",
                                "value": "name",
                                "text": "display_name"
                            }
                        }
                    },
                    {
                        "name": "created",
                        "prompt": "Created",
                        "readOnly": true,
                        "hea": {
                            "type": "datetime"
                        }
                    },
                    {
                        "name": "modified",
                        "prompt": "Modified",
                        "readOnly": true,
                        "hea": {
                            "type": "datetime"
                        }
                    },
                    {
                        "name": "source",
                        "prompt": "Source"
                    },
                    {
                        "hea": {
                            "section": "shares",
                            "sectionPrompt": "Shares",
                            "optionsFromUrl": {
                                "path": "/people/",
                                "value": "name",
                                "text": "display_name"
                            }
                        },
                        "type": "select",
                        "name": "user",
                        "prompt": "User"
                    },
                    {
                        "hea": {
                            "section": "shares",
                            "multiple": true
                        },
                        "name": "permissions",
                        "prompt": "Permissions",
                        "type": "select",
                        "suggest": [
                            {"value":  "COOWNER", "text":  "Co-owner"},
                            {"value":  "CREATOR", "text":  "Creator"},
                            {"value":  "DELETER", "text":  "Deleter"},
                            {"value":  "EDITOR", "text":  "Editor"},
                            {"value":  "SHARER", "text":  "Sharer"},
                            {"value":  "VIEWER", "text":  "Viewer"}
                        ]
                    }
                ]
            },
            {
                "name": "heaserver-organizations-organization-duplicate-form",
                "description": "Duplicate this organization",
                "type": "unsafe",
                "target": "item cj-template",
                "action": "update",
                "prompt": "Duplicate",
                "inputs": [
                    {
                        "name": "display_name",
                        "prompt": "Name",
                        "required": true
                    },
                    {
                        "name": "source",
                        "hea": {
                            "display": false
                        }
                    },
                    {
                        "name": "description",
                        "hea": {
                            "display": false
                        }
                    },
                    {
                        "name": "owner",
                        "hea": {
                            "display": false
                        }
                    },
                    {
                        "name": "created",
                        "hea": {
                            "display": false
                        }
                    },
                    {
                        "name": "modified",
                        "hea": {
                            "display": false
                        }
                    },
                    {
                        "hea": {
                            "section": "shares",
                            "display": false
                        },
                        "name": "user"
                    },
                    {
                        "hea": {
                            "section": "shares",
                            "display": false
                        },
                        "name": "permissions"
                    }
                ]
            },
            {
                "name": "heaserver-organizations-organization-open-aws-accounts",
                "description": "Open AWS accounts",
                "type": "safe",
                "action": "read",
                "target": "item read cj",
                "prompt": "Open"
            },
            {
                "name": "heaserver-organizations-aws-account-get-open-choices",
                "description": "Open this AWS account",
                "type": "safe",
                "action": "read",
                "target": "item read cj",
                "prompt": "Open"
            }
        ]
    }
}
