{
  "wstl": {
    "content": [
      {
        "name": "homeLink",
        "description" : "View the home page",
        "type": "safe",
        "action": "read",
        "kind": "",
        "target": "list menu",
        "prompt": "Home"
      },
      {
        "name": "searchForm",
        "description" : "Search for content",
        "type": "safe",
        "action": "read",
        "kind": "search",
        "target": "list form",
        "prompt": "Search",
        "inputs": [
          {
            "name": "text",
            "prompt": "Search Text",
            "value": "Danny",
            "required" : true
          },
          {
            "name": "external",
            "prompt": "External Search?",
            "value": "",
            "required": true,
            "suggest": [{"value":"true"},{"value":"false"}]
          }
        ]
      }
    ],
    "data": [
      {
        "id": "1a14qx7qc81",
        "title": "Danny Boy"
      },
      {
        "id": "1q2w3e43r",
        "title": "Danny Tremane"
      },
      {
        "id": "azsxdcfvgb",
        "title": "Danny Two-Shoes"
      }

    ]
  }
}