{
    "$schema": "http://json-schema.org/draft-07/schema#",
    "$id": "https://gitlab.com/huntsman-cancer-institute/risr/hea/hea-json-schemas/-/raw/master/cjtemplate.json",
    "type": "object",
    "properties": {
        "template": {
            "type": "object",
            "properties": {
                "data": {
                    "type": "array",
                    "items": {
                        "type": "object",
                        "properties": {
                            "name": {
                                "type": "string"
                            },
                            "value": {}
                        },
                        "required": [
                            "name"
                        ]
                    }
                }
            }
        }
    },
    "required": [
        "template"
    ]
}