{
  "email": "Andrew.Post@hci.utah.edu",
  "project_name": "HEA Something Microservice",
  "project_slug": "heaserver-somethings",
  "project_short_description": "the HEA something service",
  "heaserver_package_name": "something",
  "heaobject_module_name": "something",
  "heaobject_class_name": "Something"
}
