*** Life<Cell> 10x10 ***

Generation = 0, Population = 15.
-------0--
0---------
----------
-----00---
-----0--0-
-0--------
-------0--
-0----0---
0--0------
-000------

Generation = 1, Population = 32.
0-----0-0-
-0-----0--
0----00---
----0-100-
-0--01-0-0
0-0--0-00-
--------0-
--00-0----
-0-10-0---
-1--0-----

Generation = 2, Population = 39.
-----0-0-0
0-0--00---
-----1-00-
00-01--11-
---0--0---
-0-0-1----
0--0----10
--1-0---0-
010--0-0--
0*0-100---

Generation = 3, Population = 43.
0-0-010---
---0011000
-000-*0--0
11--*----0
0-0-----0-
--------00
---1-0-0-1
--*0----1-
-*11010---
-.--*11---

Generation = 4, Population = 38.
---0-*--00
000-1-----
-----.----
--0-*-1--1
10-00--010
0-00-1----
---*-----*
--.1--0---
0***1*-00-
-.0-.*-0--

Generation = 5, Population = 51.
00--0.0011
1-10----00
00---*0--0
1--0*----*
-1-----1--
10110-000-
0--*000-1.
00.-----10
1*..-*0-10
0.1-.*-1--

Generation = 6, Population = 49.
-1---.1-*-
--*1-1---1
11---*10--
*101*-111.
1*-----*-0
-1-*-1-1-0
-0-.1--0-.
1-*10--0*-
*.*.1*10--
1.-0.*1--0

Generation = 7, Population = 38.
0--0-.--.-
10**-*10--
--0--.*--0
.---*0--*.
-.--01-.11
---.0----1
-1-.*-0--.
*0*-1--1*0
*.*.-.*--0
**--..--0-

Generation = 8, Population = 47.
1--10.10.-
--.*-**101
1-1-0..---
.-01*--1*.
-.-01-0.--
-1-*--0--*
-*-.*---1*
*1*-*00**-
..**1..-11
**--..11--

Generation = 9, Population = 39.
-10-1.--.1
--*.-..*-*
--*-1..--0
.1-*.0-*..
-.-1--1.11
1*-*0111-*
-.-.*----*
**.1.--..0
....-..0-*
.*-0..**-0

Generation = 10, Population = 42.
1*---.-0**
--*.-...-*
--*0-.*-01
.-0*.-1*.*
1*0--1*.*-
*.-*1-**0*
-.-..-001*
...-.--..-
**..-.*1-*
..--..**-1

*** Life<Cell> 10x10 ***

Generation = 0, Population = 13.
----------
-0--0-0--0
--------0-
---------0
--------00
-----0----
---0------
----------
-----00---
------0---

Generation = 1, Population = 34.
-0--0-0--0
0-00---0--
-0--0-00-0
--------01
-----0-01-
---00-0-00
--0-00----
---0-00---
----01-0--
------10--

Generation = 2, Population = 35.
--------0-
--110-010-
------1-01
-0--0000--
---0--01*0
---1---0-1
-0----0-00
-----11---
----1--10-
----0-*-0-

Generation = 3, Population = 46.
--000-0-10
-0*-1---1-
-000-----*
0-0-1---0-
-001----.-
-00*0-01--
0-00--101-
-0---*---0
---0*-0*-0
---01-.010

Generation = 4, Population = 32.
---------1
0-.-*001*0
---10---0*
-----0-0--
----0-01.-
---.1-----
-------1*-
-----*1--1
-00-.11*0-
--0--0*---

Generation = 5, Population = 49.
0---0000-*
-0.-*---.1
0-0*-010-*
---01-01-1
---1101-.-
---.*00-0-
----00-**-
-00-0*-00-
01-0**-.1-
--101-.-1-

Generation = 6, Population = 43.
---0---1-.
0-*-.0--.-
-01.-1*--*
0--1--1--*
--0--1*-*0
---..--111
-000111..0
--101.--11
1---..1.-0
0-*1--.0*0

Generation = 7, Population = 55.
0---000-1.
-0*-*1-1.1
01-*0-*00.
--0-10-1-*
00--1**1.1
-0-..-0***
0111*-*..-
0--1-.-0**
*1--*.-.1-
1-.*1-.1*-

Generation = 8, Population = 46.
--00-111-.
0-*1.--*.-
1--.1-.-1*
-0-1*---0*
1--1-..*.-
0--..-1..*
-*-**-*..-
-0-*1*-1**
**00*.-.--
*-.*-0.**0

Generation = 9, Population = 42.
00---*--1.
1-*-.1-*.1
*-1.*1.--*
0---*0---*
*-0*-..*.-
1--**0**..
-*-*.1*..-
--1.-.1**.
*.--..-.--
*-.*1-..*1

Generation = 10, Population = 42.
-1--0.1--.
-0*1.--..*
*-*..*.01*
-0--.-110.
*-1.1..**1
*--..1.*..
-*1*.-..*-
0--.-*-*..
.*00..1.-0
.0..*0...*

*** Life<Cell> 10x10 ***

Generation = 0, Population = 11.
-------0--
----------
--0-0-----
---0------
--------0-
--------0-
-------0-0
---0------
--0-------
--------0-

Generation = 1, Population = 25.
------0-0-
--0-0--0--
-0-0-0----
--------0-
---0---010
--------1-
---0--0-0-
----0--0-0
-0------0-
--0----0-0

Generation = 2, Population = 34.
--0-00-0-0
---0------
0-0-0-000-
-0---0--1-
--0-0-01-1
------0---
--0--0-01-
-0---0----
0---0--0-0
---0--0-0-

Generation = 3, Population = 45.
-0-011----
0-0-000-00
-0-0-01--0
--0-0-00*-
-----0-*1-
----0-1010
---00101*0
-----10-00
--------0-
0-0--0-0--

Generation = 4, Population = 30.
--01*---00
--------1-
------*-01
---0---1.-
--0-0--.*-
----1-----
--011*-*.1
---0---01-
0-0---0-1-
---00-----

Generation = 5, Population = 46.
-01-.1-0-1
--000-00-0
---0-0.0-*
--------.0
-0-010-..1
-------010
-01***-*.-
0-01-1----
---000-0*0
0--1100-0-

Generation = 6, Population = 47.
01--*-01-*
---11-11--
---10-.1-*
-0--0--1.-
0--1-10..-
--0---1---
-1*..*-*.1
-0-*--0-10
---11101*1
-00-*1101-

Generation = 7, Population = 50.
1*1-*----.
000-*--*1-
-00-10.--.
--001--**0
----1*-*.-
0-1--0*--0
0-.*.*-*.*
010*-11--1
----**-*.-
0111.**1--

Generation = 8, Population = 46.
-.--.1-10.
--1-*-1.*0
--11*1*--*
----*00**1
0----.0*.-
1----1.011
--.*..-*.*
---*0**01*
---1..-**1
1--*.*.-1-

Generation = 9, Population = 34.
-.1-.-0*-*
-0*1.-*..-
-0--.*.-0.
0-0-.1-..-
10--1.-..-
*0-01-.1--
0-.*..-...
--0*-*.-*.
0-0-..-..-
-11.*..-*-

Generation = 10, Population = 36.
-**-.1-*-.
0-.*.-*.*0
-111***1-.
1--0**0..-
*---**-..-
.----1.-1-
1-....-...
-1-*-..0..
-0--*.-..-
-*-*...1.0

*** Life<Cell> 10x10 ***

Generation = 0, Population = 13.
0---------
-0--------
00------0-
---0----0-
-0--------
---0------
0---------
---------0
-----0----
----0-----

Generation = 1, Population = 32.
----------
010-----0-
1-00---010
0-0-0--010
0-0-----0-
000-0-----
-0-0-----0
0----0--0-
------0--0
---0------

Generation = 2, Population = 35.
000-----0-
--------1-
-011--0---
---0-00---
-0-0----1-
-1-0-0--00
010--0----
---00--0-0
0--0---0--
--0-0-0--0

Generation = 3, Population = 54.
1-10---010
0--0--00*0
11--0-101-
-----1-01-
01--0-00*-
--01-100-1
1*10-1000-
-0--1-01--
-0-10--10-
00-0----0-

Generation = 4, Population = 34.
*-*-0---*-
---1-0--.-
-*1--0--*-
----0--1*0
1*------.-
-1--0--1--
*.*-0---1-
---0*0-*0-
-----0---0
1--1----10

Generation = 5, Population = 52.
.-.0---0.0
010-010-.-
1.*--11-*-
0-00--0**1
**0-----.0
0*-1110---
.**0---0*0
0--1.--*--
0----10101
-00-00-0*-

Generation = 6, Population = 40.
.0*--0--.-
---11*--*0
-..---*0*-
-0110--..-
..-000-0.1
-.----1-0-
...1-1--*1
1--**0-.0-
1-01----1*
-11-1-0-.-

Generation = 7, Population = 48.
.1*--10-.0
-1-*-*--*1
-..---*-*-
01-*--0..1
..--110-*-
-.--11-111
...*0*-0**
*0-..-0*-0
*0--0101-*
-*-1---0.0

Generation = 8, Population = 46.
.-*-0-10*1
0*0.-*00*-
1*.---*-*0
1*-.---.*-
..---*-0.1
-.--**1---
...*1.01..
*-0*.0-.0-
.10-1-1*-*
-*---0-1.1

Generation = 9, Population = 36.
.-*--1-1.*
-.-*-.-1.1
*..---*0.1
-*1.-10..1
..---*0-*-
-.--..-1-1
..*.-.-*..
.0-..-0.--
*--1--**1*
1*----0*.*

Generation = 10, Population = 39.
.1.-0--*..
0.-.1.--.-
.**1--.-.-
-**.0-1..*
..0-1*-0*1
-.0-..-*1-
....-.-**.
.--..01.00
*10-11..-*
-*11-0-..*

*** Life<Cell> 10x10 ***

Generation = 0, Population = 11.
---0------
----------
-----0---0
----------
-0--------
----0----0
----0---0-
-0--------
--0-------
--------0-

Generation = 1, Population = 32.
--0-0-----
---0-0---0
----0-0-0-
-0---0---0
0-0-0----0
-0-010----
-0-010-0--
0---0---0-
---0----0-
--0----0-0

Generation = 2, Population = 27.
-0-0-----0
----------
-0-------0
----0----1
---010--01
-10---00-0
-1--------
---01---10
0-------1-
-0----0-0-

Generation = 3, Population = 47.
0---0---0-
---0------
0-0-0---01
-0--1-----
-0-1*1--1*
0-1-1-1101
0*-01-000-
0001*0-0-1
---00-00--
--0--0--10

Generation = 4, Population = 36.
-0---0-0-0
----0----0
-0-010-01*
-1--------
-10*.*---*
1----0-*--
1.--*0---0
-1--.1--1-
000---1---
-0------*1

Generation = 5, Population = 45.
0-0------1
----10----
01-1*1-1-*
0---1--00-
---.*.001.
*-10---.0-
**-0*100--
0*--**-0--
1-10---0-0
-1----00.*

Generation = 6, Population = 43.
---000--0-
-00---00--
-*-*.--*1.
1------1--
--0.**11**
*1*-10-.11
..0-.*----
1.-1..0-11
*-*1-0---1
---0-01-..

Generation = 7, Population = 42.
-0-1-1---1
0-101-1-0-
-*0..--.*.
--0010--01
--1.*.-*.*
.-*--1-.--
*.1-.*----
*.0*.*--*-
.-**-11--*
0--1--*0..

Generation = 8, Population = 36.
--0*0-----
---1*0--1-
-.1..10.*.
--1-*10---
-1-...1..*
.1*0-*1.-1
..--.*0-0-
..1..*-0.-
.0..-----.
-1-*0-*1..

Generation = 9, Population = 38.
-01.----0-
--1-.--0*0
-.*..*-...
--*-**1101
0*1...-*..
.-*1-.*.-*
.*-0..-0--
..-..*0-.-
.1.*011--.
0*-.1-.*..

Generation = 10, Population = 50.
01-.----1-
---1.011*1
-**.**-...
1-*-**-*-*
1.*.*.1..*
*1.-1.**1.
..11**0-00
..-*..--.-
****1*---.
1*0**-*...

*** Life<Cell> 10x10 ***

Generation = 0, Population = 6.
--0-------
-0------0-
----------
----------
----------
--0-------
----------
----------
----------
-0-------0

Generation = 1, Population = 16.
---0----0-
0------0-0
-0------0-
----------
--0-------
-0-0------
--0-------
----------
-0-------0
0-0-----0-

Generation = 2, Population = 17.
0-0-0-----
---0--0---
--0-------
-00-----0-
----------
0---0-----
----------
-00------0
----------
-0-0---0--

Generation = 3, Population = 41.
---0-00---
0-0--0-0--
--1---0-0-
01-0---0-0
000-0---0-
-0-0-0----
000-0----0
0110----0-
--00---0-0
0---0-0-0-

Generation = 4, Population = 16.
0-----1---
--1-01----
--*-------
----------
--1-------
0-----0-00
----------
-*-------0
----------
-00----0--

Generation = 5, Population = 40.
-00-0--0--
00*-1*----
-0.000----
----------
00-0--0-00
-00--0--11
00----0-0-
0.1-----0-
--0----0-0
0110--0-0-

Generation = 6, Population = 40.
----1-1-0-
1-.0*.00--
-1.11-0---
0---000-00
1-1-0-----
011-0-00*-
--0-------
1.*0--0-1-
----------
1-*100-0--

Generation = 7, Population = 42.
0---*-*0-0
--*-..11--
0-*-*0--00
1-0-1---11
-0*----0-0
--*-1-1-.1
----0--0--
-**100---0
----00000-
--.--1--0-

Generation = 8, Population = 32.
-000.-*---
-0.0*.----
1-*-*1----
*1--*----*
-1*0----0-
--*-*--0.*
-0------0-
1.*-------
-00-------
--.--*--10

Generation = 9, Population = 39.
0---*0.0--
-1.-..1---
*-*1.*0--0
*-0-*----.
--.10----0
-1.0.01-.*
--0-0-----
-.*1----1-
-1-0-0--00
-1.-0.00*1

Generation = 10, Population = 48.
---0.1*-0-
1-*0..*--0
*1****-00-
.-1-.-0--.
11.---0-01
0-.1.1*0..
--1---0-00
-*.--0-0*-
0*010---1-
1**--*1-.-

*** Life<Cell> 10x10 ***

Generation = 0, Population = 14.
--------0-
---------0
----------
0--------0
-00-------
--------0-
----------
--0-00----
0---0-0---
------0---

Generation = 1, Population = 32.
-------0--
----------
0---------
--0-----0-
-110----00
-00----0-0
--0-00--0-
00---1----
-0001010--
0---0010--

Generation = 2, Population = 39.
------0-0-
0------0--
-00-----0-
0-1----01-
0--10-----
0-1-000--1
001-1-0---
1-000--00-
0---*-*-0-
--0--1*-0-

Generation = 3, Population = 59.
0----0-0-0
--0-----0-
01-0---010
10*-0-01-0
-11*--0000
-0*01--00-
1-*0-01-00
-0--1101-0
10--*0*0-0
00-0-**-10

Generation = 4, Population = 27.
-00-0---0-
-----0-010
--------*-
--.----*--
-*-.00--1-
--.-*-0-11
--.-------
11------0-
-10-.-.-0-
----0..0*-

Generation = 5, Population = 43.
011-----1-
-00----1-1
-----0-0.-
-0.-000*1-
0.1.-1--*-
-0.0*0---*
10.-1-1--0
*------110
--10.-.--0
-000-..1*0

Generation = 6, Population = 38.
1*-0------
---0-00*1-
--0--10-.0
--.01--.-0
-.-.0---*-
01.1.----*
--*-*0----
*-001--*-1
1---.-.-0-
011-0..**-

Generation = 7, Population = 42.
*.-100001-
00-1--1**-
-1-0----.1
--.1--0.-1
0.-.11-0*0
1**-.0---.
--.-.110--
.-----0.1-
---0*-.01-
--*--..**0

Generation = 8, Population = 42.
**1---11-0
-------..-
-*--0--0.*
10**---*--
1.1**-01*-
-*.1.---1.
10.-.-*1--
.--01-1.*1
---1.0*-*-
-1.-0..*.1

Generation = 9, Population = 55.
.**1-0**--
0-0-0-1*.-
-*---101*.
-1..1--.-1
*.-.*-1**0
1..**--0*.
*-.-*1**00
.10-*1-.**
-11*.1*0.0
0-.--****-

Generation = 10, Population = 44.
.***01.*1-
--11--*..-
-*--0*1**.
-*..*--.1*
**-.*-*..-
-*.*.-01..
*-*-.*..--
*--0.*1...
--**.*.-.1
--*00*..*-

*** Life<Cell> 10x10 ***

Generation = 0, Population = 11.
--------0-
----------
----------
0--------0
-------0--
-----0----
----------
--0------0
-0-0-0----
---------0

Generation = 1, Population = 28.
-------0-0
--------0-
0--------0
-0-----00-
0----00-00
----0-00--
--0--0---0
-----0--0-
0-0---0---
-0-0-0--0-

Generation = 2, Population = 31.
------0-0-
0--------0
-------00-
0-0--0-1-0
-----1---1
0-00---1--
-0-0-1-0--
0---01-0--
-0---0-0--
--0----0-0

Generation = 3, Population = 47.
0----0----
-0----000-
--0--00-10
---001-*01
---00*0-0*
-01-0-0*00
0-010*--0-
-0--1*--0-
-----1--00
---0-001--

Generation = 4, Population = 19.
----0--00-
-----0----
--------*-
----1*-.-*
-0---.--1.
-1-----.--
-----.----
-----.00--
-0-0-----1
--0----*-0

Generation = 5, Population = 41.
---0--0110
------00--
----0--0.-
-0-0*.0.0*
010-0.-0-.
0*1----.0-
-0---.00--
-0-0-.1100
0-0-0-0-0*
------0.-1

Generation = 6, Population = 48.
--0-00-*-1
---000-1-0
-0--1001.0
-101*.-.1.
---01*--1*
-.-00-0.-0
---1-.--00
-10--.**1-
-0-0---0-.
0-0-001*-*

Generation = 7, Population = 40.
-0-0---.-*
-0-1-10---
01-0*1--.1
0--*..0.*.
-1-1-.-0-*
-.11-0-*0-
-0-*-*----
0-10-.*.--
-1---10--.
-0-01--*-.

Generation = 8, Population = 43.
01-1000.1.
----0-11--
---1.-0-.-
110*.*-***
--0-1.-1-*
-***-1-*1-
---.-*-00-
--*-1.*.--
-*---*---.
01-1*--.0.

Generation = 9, Population = 49.
1*-*1--.-.
00-111**--
01-*.-11.1
*-1..*0*.*
01---*0--*
0***0*-.--
-0-.-*0--0
--.--.**1-
-*-00*--0.
1--**--.-.

Generation = 10, Population = 36.
-*-*--0.-.
11-**-.*00
1-0*.1**.*
.--.*.-..*
1-01-.--1.
-..*-.0.--
-1-*-.----
--*01...--
-.--1*--1.
--0*.--.0.

*** Life<Cell> 10x10 ***

Generation = 0, Population = 5.
---------0
--0-------
----------
------0---
----------
----------
----------
-------0--
----------
-0--------

Generation = 1, Population = 17.
--0-----0-
-0-0-----0
--0---0---
-----0-0--
------0---
----------
-------0--
------0-0-
-0-----0--
0-0-------

Generation = 2, Population = 16.
-------0--
0---0-0---
---------0
--0-0---0-
----------
------00--
----------
-0---0---0
----------
-0-0---0--

Generation = 3, Population = 39.
0---0---0-
-0-0-----0
0-0---0---
-0---0-0--
--0-0-000-
-----0110-
-0---000-0
0-0-0-0-0-
---0-0-0-0
0---0-0-0-

Generation = 4, Population = 18.
-----0-0--
0-0---0---
---------0
--0----1--
---------0
-00-------
----------
-0-0--1--0
----------
-0---0-0--

Generation = 5, Population = 41.
0-0-0-0-0-
---0-----0
0-----000-
-0-0--0-0-
-0-----00-
0110-----0
--00--0--0
0---00-00-
---0-000-0
0-0-0---0-

Generation = 6, Population = 26.
---0------
-------00-
-----0----
-1--001--0
-------1--
1**-0-11-1
---------1
-0001---10
----------
---0--0---

Generation = 7, Population = 52.
--0-0--00-
---0-00110
-0---1-000
0-0011*-0-
0-0--00*0-
**.---*--*
0--0--00--
01--*0-0*-
-00-0-0-00
--0-00-0--

Generation = 8, Population = 22.
-0-0------
-0--0-----
----------
11----.---
-01----.--
*.*0--.1-.
-00------1
----*1--.-
---------1
--1--10--0

Generation = 9, Population = 37.
01--------
010--0----
0---0-----
*-----.---
0------.--
*..10-.-0.
-1--00-00-
-100.*1-.-
--0-0-0-0*
-0-00*1001

Generation = 10, Population = 39.
-----0----
1*10--0---
--00------
*1--1-.---
-0-00--.0-
**.*--.-1.
-*-0--01-1
0-11..--.0
-01-1--0-*
0-111.*-1-

*** Life<Cell> 10x10 ***

Generation = 0, Population = 8.
0---------
--0-------
------0---
----------
---------0
----------
---00-----
-----0----
-----0----
----------

Generation = 1, Population = 25.
-00-------
00-0--0---
--0--0-0--
------0--0
--------0-
---00----0
--011-----
---0-10---
----010---
-----0----

Generation = 2, Population = 24.
--1---0---
1---0-----
0---0---00
--0-------
---00-00-0
-----0----
-01---0--0
---1---0--
----1--0--
-----1----

Generation = 3, Population = 52.
00-000-0--
*000100-00
100010-011
00----000-
---11011--
-000--00--
01*-----0-
-0-----100
------010-
------00--

Generation = 4, Population = 23.
--1-1-0--0
.-1---1---
*-11*-----
-----0----
0------*--
--1-------
1-.---001-
-1-------1
-0---1----
-----1----

Generation = 5, Population = 44.
-0*---100-
.0---0*0-0
.---*-0---
--00--00--
-00--01.0-
-0-0--0-0-
--.--01-*-
-*0--101--
010-1*0--0
-0--0*0---

Generation = 6, Population = 47.
0-*0---11-
.1---1.-0-
.01-*0-0-1
---1--11--
0--111*.10
011-00---0
--.11-*0*0
-.-1-*-*-1
1----.1-0-
-1-0-.-0-0

Generation = 7, Population = 48.
-0*1101*-0
**10-*.01-
.-*1*-011-
00-*00----
1---**..*-
--*-1-000-
11.---.1.1
0.0*0*-.-*
-----.---0
----0.--0-

Generation = 8, Population = 40.
--.*-1-*1-
*.-1-..1--
.0.-.-1*-1
-10.---1--
*-0-....*0
--.-*011--
-*.1-0.*.*
1.1*-.0.0*
1-00-*---1
---0-.-0--

Generation = 9, Population = 47.
0-..---**0
..1*1..--0
*1.1.0**--
---.---*--
.011.*..*1
01*-*1----
-*.*11...*
*.-.0*-*1*
*--1-.-1-*
0--10.0-00

Generation = 10, Population = 54.
-0.*1-1.*-
*.****.--1
.*.*.1**11
0-0*---*-0
*-**.**.**
1-.-.*1-0-
1...-*...*
**-.-*-*-*
*10*1.-*-.
110-1.-01-

*** Life<Cell> 10x10 ***

Generation = 0, Population = 11.
----0-----
----------
----------
-0--0-----
---------0
----------
----------
---0---0--
----0--0-0
-00-------

Generation = 1, Population = 33.
---0-0----
----0-----
-0--0-----
0-00-0---0
-0--0---0-
---------0
---0---0--
--0---0100
-00--001--
01100--0-0

Generation = 2, Population = 29.
--0-0-0---
-0--1-----
----1----0
--11--0---
-------0-0
-0-00--0--
----0--1--
--1------1
--1--11*--
1**-1--1--

Generation = 3, Population = 53.
----1--0--
0--0-00--0
-00-*00-0-
-0**-0----
-00-0--1--
0--1-00-00
-00-100*00
-0*0000-0-
0--0-*-*00
***----*0-

Generation = 4, Population = 29.
0-------00
----------
----.-----
01..-1-00-
-----0---0
-00-------
-------.--
--.11----1
10110*1.-1
***--00*--

Generation = 5, Population = 52.
-0-----011
0-------00
00--.0-00-
1*..0*-11-
0-0-0101--
0111-0---0
-0001--.-0
00.---0-0*
-1**1.-*0*
*..---1*00

Generation = 6, Population = 51.
--0---01*-
10---0-01-
1-0-*1--1-
*.**-.0*-0
--10-----0
-*---1-001
0111*-0.--
11.--0-1-.
1-****1.-.
.**010*.1-

Generation = 7, Population = 46.
0--0--1**1
-10--10-*0
-010*--0*-
....-*1*11
0---010---
-.1---01--
----*--.00
*-.-11--0.
*-....-.0.
.*.1*1**-0

Generation = 8, Population = 49.
----1--..-
---0-*--.-
1-*-*10-.0
.**.0.*.**
-0101*1100
0.-1---*-1
0-11*-0.-1
.1.1-*01-.
*-.*..1.1*
...**-**1-

Generation = 9, Population = 39.
-------..-
1----.--.0
-0*0.*-0*1
*...-.....
--*1*.**11
1.1-010.0-
11*-.01.0*
*-.-1.-*-*
.-.*..-.-*
...**-*.--

Generation = 10, Population = 42.
0------..1
--00-.-0.1
11*1..-1*-
....0*....
-0*-*.*.**
*.-1-*1.-1
*-*1.--.-*
*-*--*-*0*
.-.*.*1.1.
...**-..-0

*** Life<Cell> 10x10 ***

Generation = 0, Population = 5.
---0------
----------
----------
-0--------
----------
----------
--0-------
----------
----------
-0-0------

Generation = 1, Population = 15.
--0-0-----
---0------
-0--------
0-0-------
-0--------
--0-------
-0-0------
--0-------
-0-0------
0---0-----

Generation = 2, Population = 14.
-0-0-0----
-0--------
---0------
---0------
--0-------
-0--------
0---0-----
-0-0------
--0-------
-----0----

Generation = 3, Population = 21.
01----0---
010--0----
-0010-----
---10-----
----------
----0-----
-0---0----
--0-------
-----0----
--0-0-0---

Generation = 4, Population = 14.
-------0--
----------
--1*------
-0---0----
---0------
-0-0------
0-----0---
---0------
----------
-0---0-0--

Generation = 5, Population = 32.
------0-0-
--00---0--
--*.00----
0---0-0---
--0100----
---10-0---
-----0-0--
0-0-0-0---
-0-0-0-0--
0-0-0---0-

Generation = 6, Population = 34.
--00-0-0-0
-1-1-0----
00*.-1-0--
-0-----0--
001*-10---
----------
0-000---0-
-0-0---0--
0-----0---
-0-0-----0

Generation = 7, Population = 40.
--1--1----
-*-*--0--0
1-..0*-10-
0-01---10-
11-.-*1---
-0--000-0-
-01110---0
0-01------
-0---0---0
----0-0-0-

Generation = 8, Population = 22.
----0----0
-*0*-0----
*-..1*0---
-01*-----0
---*-.----
----------
--***-----
----------
---0------
-0-0-0----

Generation = 9, Population = 38.
-11-----0-
-*-*-1---0
*0..**11-0
-1-*-00-0-
-1-*0.---0
--0-0-----
-0.*.0----
--0-0-----
-00100----
0--1--0---

Generation = 10, Population = 40.
0-*--1-0--
-.0*0*-0-1
*1.*..**01
---*---1-0
1*1.-.1---
-0--1----0
0-...-0---
-01-10----
-11*11----
---*---0--

*** Life<Cell> 10x10 ***

Generation = 0, Population = 9.
----------
----0-----
---0------
---0------
----------
-------0--
---00----0
------0---
----------
---0------

Generation = 1, Population = 30.
----0-----
-----0----
--01------
--010-----
---0---0--
---00-0-00
--0110000-
---000-0-0
---0--0---
--0-0-----

Generation = 2, Population = 33.
---0------
--00--0---
-0---0----
-0--10-0--
----0----0
---1-01--1
-01--111-0
---11--10-
---10----0
-0-0-00---

Generation = 3, Population = 49.
---10-0---
--1-0--0--
01-1-1-0--
0101----00
-0--100001
-0--0---0-
01*1--*-01
-0------10
-00*--00--
0--10110-0

Generation = 4, Population = 20.
---*------
0---1--10-
---*0--1-0
------00--
----------
----1----1
1-.*-1.-1-
--0-------
---*------
------*---

Generation = 5, Population = 40.
0-0.---00-
-0-0*00-1-
0-0*-1--0-
---1101-00
----1-00-1
0---------
-1.*1-.1--
00-1-0--1-
---.0-0---
---1-1.0--

Generation = 6, Population = 43.
-0-*00-1-0
0---.111-0
-11.--01--
0---*1-0--
0---*0-10*
---1--1--1
1*.**-.---
1--*-----0
00-*----0-
--0-0-*-0-

Generation = 7, Population = 49.
---.--0*-1
-010.-**-1
0**.01-*00
1-01*-1--0
10--.-0--*
-00*1----*
-*.**1.---
-00*------
-10*--001-
0--1--.-10

Generation = 8, Population = 40.
-00.-0-*-*
--*1*-..1-
-...-*-.-1
----*1*---
--0-.0110*
-1-.--1-0.
1....*.--1
111.-0011-
--1.001---
---*0-.--1

Generation = 9, Population = 37.
01-.---.0.
--*-*1*.-1
-...0.-.--
--01*-.-0-
---0*---1*
---.-0*01.
*.*..*.11-
---*-11-*-
0-*.-1--10
---*--.-1-

Generation = 10, Population = 44.
1*-.000.-.
0-.-*-..--
-.*.-.0.01
-11*.1.01-
----.-1-**
0-0*--.1*.
.......-*1
--1*-**1.-
--**0*-0*1
0--.01.0*-

*** Life<Cell> 10x10 ***

Generation = 0, Population = 11.
----------
-------00-
-0--------
0--------0
--0-------
---0------
--0-------
-0--------
-0--------
---------0

Generation = 1, Population = 26.
-------00-
-0----0110
--0----000
--0-----0-
00-------0
--0-0-----
----------
01--------
010------0
-0------0-

Generation = 2, Population = 27.
-0--------
0----01---
--10------
0-10----10
110-0-----
0----0---0
000-0-----
---------0
--10------
-1-----0--

Generation = 3, Population = 43.
--0--00---
--0001*1--
-0--000-00
10*----0*1
*--0----0-
-0--0-0-0-
--1-------
01-00---0-
--*10--0-0
0--0--0-0-

Generation = 4, Population = 29.
-01-------
----1-.*-0
-11--1----
-1*-00-1.-
*1----0---
--------10
00----0---
1*---0----
--.--0----
-1-1-0-0--

Generation = 5, Population = 41.
01*00--0-0
---0--..--
0--00*0--0
-*.-1-0-.-
*---0---00
-------0*1
--1----000
-*0-01----
0-*10-00--
0----1--0-

Generation = 6, Population = 50.
1-*1100---
-0--11*.--
--1-1.-00-
1*.--011*-
.--0100---
0-0-0-0-.*
--*0000-1-
-.10-*--00
11*---11--
1101-----0

Generation = 7, Population = 56.
-1*-*1-0--
--0-**..1-
01--*.0--0
***01-***1
*1-1*11-00
--1----0..
00.111--*0
1.*-0.0--1
-*.1--**--
-*1*0-000-

Generation = 8, Population = 39.
1**-*-----
001-...*--
--1-..1-01
...1*0...*
*---.-----
-0-0----..
-1.***--*-
*..-1.1--*
-..*00..-0
1*-*1--110

Generation = 9, Population = 41.
-.*-.1-0--
-1*0...*-0
0-*-**-01-
...**1..**
.---.1---0
-1-1-0--..
-*.*.*-0.-
..*0-.-0-*
-**.-1**--
*.-*--0*--

Generation = 10, Population = 42.
-**-.--100
-*.1.*.*1-
-1.-.*---1
...*.*.*.*
.1--.-1--1
0*-*--00..
0*.*..-1*0
...-1*---.
-*..0*..00
.*-.1--*1-

*** Life<Cell> 10x10 ***

Generation = 0, Population = 7.
---0------
----------
---0------
----------
-0-0-----0
----------
0---------
-----0----
----------
----------

Generation = 1, Population = 19.
--0-0-----
----------
--0-0-----
-0-------0
0---0---0-
00-0-----0
-0---0----
0---0-0---
-----0----
----------

Generation = 2, Population = 19.
-0---0----
----------
-----0---0
----------
10---0-0-0
-----0----
0100-----0
---0---0--
0---------
-----0----

Generation = 3, Population = 41.
0-0-0-0---
-0-------0
----0-0-0-
00-----0--
*10-01----
--000100--
1---00-00-
-0-10-0-00
-0-0-0-0--
0---0-0---

Generation = 4, Population = 19.
-0-----0-0
----------
0--0---0--
-----0----
**-0------
----------
--001-----
-1-------1
-1-1-----0
-----0----

Generation = 5, Population = 43.
0-0---0---
00-0-----0
-00-000-0-
-0--0-00--
..--01----
000-0-----
--1-*0---0
0*--0---0*
0*--00--01
-0-00-0--0

Generation = 6, Population = 42.
10---0-0-0
-----0----
-110---0--
01-0---1--
*.001*-0--
1----1---0
-1*-*10--1
-.-1-0-0-.
-.0-11-0-*
-1-1-0-0-1

Generation = 7, Population = 52.
*10-01----
0-00010--0
----00010-
-----00-0-
*.11-*-100
*--00--001
-**0.-1-0*
-*0---010.
-.--**---.
0-0-01-1-*

Generation = 8, Population = 33.
*--0-----0
10--------
0-1-------
0-00-1----
.**-1*0---
*-011----*
-..-*1*-1.
0*--0----*
0.-1*.--0.
---------.

Generation = 9, Population = 41.
*-0-0---0-
*1-0-----0
-1*--0----
11110*----
*..--.11-0
.0--*1---.
-.*-.-.--*
-*0---0-0*
1*0**.-0-.
0--10---0.

Generation = 10, Population = 42.
*1-0-1-0--
*----1----
0*.0-10--0
-**--*-1-0
*..1-.**--
.--1.*-0-.
-.*0.1.--*
-.1-00-11*
-.1.**--0*
1----1---.

*** Life<Cell> 10x10 ***

Generation = 0, Population = 13.
----------
----0-0--0
----------
-0--------
-0--------
--0------0
0--------0
--0----0--
----------
--0-0-----

Generation = 1, Population = 34.
----0-0--0
---0---00-
-0--0-0--0
010-------
01-------0
0--0----01
-0-----001
00-0--0-00
----0--0--
-0---0----

Generation = 2, Population = 33.
----------
-00-0-0110
-1--------
--100-0---
1--0-----1
100-0----*
010----1-*
1----0----
0--------0
0-0---00--

Generation = 3, Population = 61.
-00-0-0000
0-1---1--1
0*00---000
0-*11--0-0
*-010-0-0*
*1-0-0-00*
1*-0000--.
--0-0-00--
-00--0000-
1--0-01100

Generation = 4, Population = 36.
-1--------
1---00*11-
1.-------1
-1.--0-1--
*1---0---.
.-0--1-11*
-.0-11-10.
10101-1---
-1--------
------**11

Generation = 5, Population = 48.
--0-00000-
*--01-*-*-
**--0-0---
0*.-11--00
*---0-0-0.
.-10----**
1.-0--0--*
*1*--0--0-
-*-00--000
-0---0.*-*

Generation = 6, Population = 59.
01-0--1--0
*--1*0.1*1
..0--010-1
1..1**01-1
*-0-10---.
.1*----1**
*.011--10*
**.0----10
-.01100-1-
1100--**1*

Generation = 7, Population = 45.
-*-1-----1
*---.-.-.*
.*-001*10-
*.**..1--*
*111----0*
**.--10-.*
*.-**10--.
*..-101-*-
-.-----0-0
*-1---*.**

Generation = 8, Population = 49.
-.--0---0*
*0--.0*1.*
**0---*-11
*.....*-0*
.**-10-01*
...----1**
*.0*.-110.
...--1-0*-
-*0-100--1
.--0-0.***

Generation = 9, Population = 45.
0.-1--1-1*
*---.1**..
..10--.1-*
*..*..*11.
.*.-*10--.
...001-*..
..1..-*-1.
...0-*--.-
0.11*-101*
.1--01.***

Generation = 10, Population = 48.
1.0-0-*0*.
.01-**...*
.**-01.-1.
.*.*...**.
..*1.*-01.
..*11--*..
..-..1*1-.
.*.11*10.0
-***.-*1**
.----*...*

*** Life<Cell> 10x10 ***

Generation = 0, Population = 5.
0---------
----------
----------
----------
0---------
----0-----
-------0--
-------0--
----------
----------

Generation = 1, Population = 17.
-0--------
0---------
----------
0---------
-0--0-----
0--0-0-0--
----0-010-
------010-
-------0--
----------

Generation = 2, Population = 16.
--0-------
----------
----------
----0-----
0-0----0--
--0---01--
0----0---0
----00---0
-------1--
-------0--

Generation = 3, Population = 42.
-0-0------
--0-------
----0-----
0-00-0-0--
--100--10-
-010--1-00
-00--1-101
0--01-0101
----000*00
------010-

Generation = 4, Population = 19.
0-0-0-----
----0-----
0------0--
-------1--
0-*-1-----
0-------1-
---0-----*
---1-----*
0------.--
----0--*--

Generation = 5, Population = 46.
----10----
--0010-0--
-0--0-010-
--0-0-0*0-
1-.--0-10-
10100--1--
0-010----*
0-0*1---0.
-0-00--.-0
0--0-00.0-

Generation = 6, Population = 49.
--0---00--
--1---01--
0-0--0---0
0---10-.10
*-.01-0*-0
*-*1--1*-0
-01-11-1-.
10-.*0-1-*
0-01--0*0-
--01011.--

Generation = 7, Population = 46.
-010-0--0-
00-0----00
1-10-1-1-1
-00----**1
*0*--0-.0-
*0.-0--.-1
0--1--0-0.
--0..-0-0.
10--00-.1-
00-*---.0-

Generation = 8, Population = 33.
------001-
----1-----
*------*--
0-1---0*.-
.-.0--0*10
.-.---1*1-
1----11-1*
---**-1--*
----11-.-0
---.-1-.10

Generation = 9, Population = 42.
----101-*0
0--0-00-0-
.01-0--*0-
1----0-..1
.-.-101.*1
.-.1--*.*1
-0-1-**1-*
1-0*.-*1-*
-------.--
---.-*1.*-

Generation = 10, Population = 41.
0---*1--*1
-------1--
*1*0-1-*--
--1-11-..*
.-.-*1-..*
.0**-0...*
--1--*.-1*
-01**-.--.
1-01-1-.10
---.0.*..0

*** Life<Cell> 10x10 ***

Generation = 0, Population = 10.
----------
--------0-
-0------0-
---0------
----------
-0----0---
----------
-----0---0
-----0----
0---------

Generation = 1, Population = 37.
--------0-
-0-----010
0-00---010
-00-0---0-
-0-0--0---
0-0--0-0--
-0---00--0
----010-0-
0---010--0
-0---0----

Generation = 2, Population = 26.
-0------1-
---0--0---
---1--0---
-----00-1-
-1------0-
----01--00
-----1----
00-0--1--0
---0---0--
--0--1---0

Generation = 3, Population = 57.
0-00--00-0
-00100101-
--0*0--01-
-0-001--*0
0-0-0-00--
-0-01-00-1
00-0-*--0-
11-10---0-
00-101--0-
-0--0-000-

Generation = 4, Population = 36.
-0------1-
-1--1-*---
-0-.10--*-
-----*-0.1
-----0----
010--1--0-
-1---*--1-
**-*-1-0-0
-1---*---0
-10-111--0

Generation = 5, Population = 58.
010-0-00-0
0-01*0.0--
010.----*-
-0---*--*-
010-0-0000
1*101-0011
0--00*0-*-
**-.----01
---1-.-00-
0-1-***001

Generation = 6, Population = 51.
---0101---
--1-*1.1-0
-*-.1---*0
0-0--*--.-
---010-1--
*.*1*111--
-1--1.-0.0
**0*011-1*
-1---*--10
---0***11*

Generation = 7, Population = 59.
---1*1*--0
---1.-.-11
-*0.*0--*-
-0--0*00*1
--0-*10*0-
.***.*-*11
0*00-.01.1
*.-*1**0-.
-*--0.0-*1
-111***-**

Generation = 8, Population = 43.
--0-*-.0-1
-1-*.-*1--
0*1..---.0
01001.11.*
-110.-1.10
*.....-.*-
-.11-.-*.*
*.-.*..--*
-*-1-.-0.-
0---*.*-**

Generation = 9, Population = 38.
---1.1*1--
-*-*.1*-1-
-.-.*---.1
---1**-*.*
0-*-*1*.--
......1..1
-***-.0..*
.*0.*..-1.
0*--0*--.-
----...1*.

Generation = 10, Population = 41.
-10*.-.*--
0.-*.-.1--
-.-..000.*
0--*..1.*.
--.0.*.*--
....*.-*.*
0*.*-*1***
..-.*..0-.
1*-1-*00*-
01--...*..

*** Life<Cell> 10x10 ***

Generation = 0, Population = 5.
--0-------
----------
----------
--------0-
0---------
----------
-0--------
----0-----
----------
----------

Generation = 1, Population = 18.
-0-0------
--0-------
--------0-
0------0-0
-0------0-
00--------
0-0-0-----
-0-0-0----
----0-----
----------

Generation = 2, Population = 18.
0-0-0-----
--------0-
0-0-------
------0---
010-------
----0---0-
1--0------
--0---0---
-0--------
----0-----

Generation = 3, Population = 34.
-----0--0-
----0--0-0
---0--0-0-
-0---0-0--
1-100-0-0-
-00--0-0-0
-0----0-0-
0----0-0--
0---0-0---
-0-0-0----

Generation = 4, Population = 10.
------0---
----------
-00-------
--------0-
----1-----
----------
-1---0----
1---------
1---------
----0-----

Generation = 5, Population = 32.
-----0-0--
-00---0---
0110----0-
-00-0--0-0
---0-0--0-
-0--00----
--0-0-0---
*----0----
*0--0-----
0--0-0----

Generation = 6, Population = 28.
-00-0-0-0-
--------0-
1--1--0---
------0---
-----10---
0-------0-
1---1--0--
*-0-0-----
*10--0----
1-0-0-0---

Generation = 7, Population = 54.
011-----10
00000--010
-11-00100-
0--0---0--
1---1*-00-
10--000--0
-100*00---
*01-1--0--
*-100-----
*01--0-0--

Generation = 8, Population = 21.
-*--0-----
----------
1---------
1---0---0-
-----.0-1-
----1-----
1*1-.1---0
*1*-----0-
.-*-------
*-------0-

Generation = 9, Population = 44.
0.10-0----
00--0-----
*1--0---0-
*0-0-00010
1----*--*0
1000--0-00
-.-0.-0---
**.0-0-0--
*-*0------
.01----0-0

Generation = 10, Population = 35.
1.*10-0---
1---1---1-
.*1-1-1-1-
.---0-----
-11-1*0-.1
----1-1---
-.--.-1-00
**.---0-0-
*-.-00---0
.1----0---

*** Life<Cell> 10x10 ***

Generation = 0, Population = 14.
0---------
---0------
--0-------
---00-----
-----00--0
-0-0-00---
-------0--
0---------
----------
----------

Generation = 1, Population = 24.
-0-0------
0---0-----
-0-00-----
---11-0--0
-0-----00-
0--------0
00-0-0--0-
-0-----0--
0---------
----------

Generation = 2, Population = 30.
----------
-0-010----
----100--0
--0-------
--000--110
10-0-0-00-
------0---
0100-00---
-------0--
0---------

Generation = 3, Population = 46.
-0-000----
0--1*----0
-00--1100-
-01--0000-
0--11-0-*1
*1010-0---
--0--01-0-
1--1-1----
-000-0--0-
-0-----0--

Generation = 4, Population = 38.
----110--0
-0--.000--
------*1--
-------11-
100--0-1**
*-1*-0-0-0
--10-----0
--0*------
-----10--0
01-0-00---

Generation = 5, Population = 51.
-0-0**--0-
0-0-*---00
-0----.*--
001--0-*--
----11-*.*
*1*.-1-10-
00*100-001
-1-*010---
000-0--00-
1*-----0-0

Generation = 6, Population = 54.
--01**001-
---1*----1
010-11**-0
11*1-1-*10
---1**-*..
**..0--*-0
--.*111-1*
1--.-*10-0
--101---1-
-.--0-010-

Generation = 7, Population = 45.
-01*.*--*-
000-.0---*
-*---*.*0-
-*.---0.--
----.*-*.*
..*.-1-*01
-0.***--**
-10.0.*1-1
00*----0*-
-.0-1-1--0

Generation = 8, Population = 43.
--***.00.-
1---.-000*
-.--1*.*1-
1..--1-.10
-00-.*0*.*
..**---*1*
01....-0..
-*-.1.*--*
11.0--0-.0
1.1-------

Generation = 9, Population = 40.
00.*.*--.0
-001.---1*
-.-0**..*0
-*.----.--
-1--**-...
*..*01-.-*
1-.*..-1.*
1.0.-**-0.
--.--110.1
*.----1--0

Generation = 10, Population = 42.
1-.**.0-*1
---*.--0-.
-*--*...*-
1.*1---.10
-*0-.*0...
****1-0.1.
-1**..--.*
**-.1*.--*
--.-1--1.*
..----*-01

*** Life<Cell> 10x10 ***

Generation = 0, Population = 15.
0------0-0
-----0----
--0-------
----------
-------00-
----0--0--
-0--------
--0---0---
----0-----
--0-0-----

Generation = 1, Population = 39.
-0---00---
0-0-0-00-0
-0-0-0----
--0----00-
----0-0-10
-0-0-001--
0---0-00--
---000-0--
---0100---
-0--10----

Generation = 2, Population = 30.
-----1---0
---0---1--
----0---00
----00-1--
-00--01--1
-----1---0
---01--10-
0-0----10-
-00---1---
0-0-------

Generation = 3, Population = 48.
---00-000-
--0--00---
----1--011
-000--0---
0110-1*-1*
-000-*-1-1
0--1*-0---
-01-0----0
0110-0--0-
-010--0---

Generation = 4, Population = 40.
---111--10
-0--01-1-0
-0----01-*
--1---1---
1--1--.0**
0-110.--0*
-00-.0----
0---1-0---
1---1--0--
--*-1--00-

Generation = 5, Population = 53.
-00**-0-*-
010---0*0-
01--1----.
0----0*10-
*11*--.1.*
10-*1.---*
01--.---00
1-10*0----
*110-0-1--
00.-*00-10

Generation = 6, Population = 48.
--1*.-10*0
-----1-.-0
1--0-----.
-010-1**1-
.*-*-1.*.*
*11**.-1-*
1---.0-11-
---1.-0100
.**---1--0
--.-*110*1

Generation = 7, Population = 44.
-0*..-*-*-
0-0-0--*-1
---11-011.
---1--.**-
..-.0*...*
**-*.*0-0*
*-0-.-0*-0
10--.--*1-
..*-1--10-
-0.0.-*-*-

Generation = 8, Population = 45.
-1**.1.0*-
-110110.--
1-----1--*
--1*01...-
..-*1*...*
**1*..-11*
.---.--.-1
-11-.--.--
*.*0-0--10
0-*-.1.0*1

Generation = 9, Population = 44.
0-...*.1.0
--*1-*-.01
-----0*11.
00*.1-*..-
..1.***..*
.*-*..0*-*
*--1.--.-*
-*--.0-.1-
*..1-11---
1-*-***1.-

Generation = 10, Population = 48.
-1..*.*-.1
01.*-*-.--
11-1--.--*
1-*.*-..*0
*.*.*...*.
.*1*..-*-*
*10**00*-*
1*1-.1-.--
*.*-1*--1-
*-.0*..*.-

*** Life<Cell> 10x10 ***

Generation = 0, Population = 8.
00--------
-----0----
----------
----------
--0-------
----------
-----0----
0--0------
----------
--------0-

Generation = 1, Population = 27.
110--0----
00--0-0---
-----0----
--0-------
-0-0------
--0--0----
0--00-0---
-00-00----
0--0----0-
-------0-0

Generation = 2, Population = 27.
-*10------
---0---0--
000-------
-----0----
0---00----
0--0------
--01---0--
011--1--0-
-----0----
0--0--0-0-

Generation = 3, Population = 43.
1.--0--0--
0-010-0-0-
1-1--0-0--
-00--10---
10--1-0---
10-1-0-0--
----000---
1---0*0--0
-00001----
-00-0----0

Generation = 4, Population = 27.
**1-10----
-----0---0
*0---1----
0--0------
-1----1---
-----1--0-
-0-------0
--1-1.-00-
--1-------
0--01---0-

Generation = 5, Population = 47.
.**-*-0--0
--0---0-0-
*1100*0--0
100-010---
--00---00-
----0--0--
0---00-00-
--*--.011-
00*----0--
-0-1*0-0-0

Generation = 6, Population = 52.
.**-.-10--
00-------0
**--1.10--
-11--*--00
1--110--10
1-0-1-0-0-
-001-101-0
--*01*1--0
11.-01---0
-10**1-1--

Generation = 7, Population = 52.
***0.0*100
-1--0---0-
..-0-**1--
1-*-0.----
*-0**--0*-
*01-*-1010
-1-----*01
11.1*.--1-
*-.01*-001
---*.---00

Generation = 8, Population = 47.
***1*1*-11
-*-1-0-01-
.*---***--
*-*-1.0-0-
*11.*0--.-
*1-1*-*---
0--1---.--
--.-.*-1-0
*-.1**-1--
0-0*.1----

Generation = 9, Population = 46.
**.*.**1-*
-.0*0-----
**-0-...0-
*-*-*.10-0
.*-..11-.-
.-1-.1.0--
1-0*-10.-1
--.-.*-*--
.1*-.*-*01
1-1*.*01--

Generation = 10, Population = 53.
.*.*.***-.
-.1.1-0010
*.-11*.*--
*-*0*.-10-
.*1**--0*0
.-*-.-.-10
---*-*1*0-
11.1.*1*--
.**-.*0.-*
-1-***---0

*** Life<Cell> 10x10 ***

Generation = 0, Population = 5.
--0-------
----------
----------
--------0-
----------
------0---
---0-0----
----------
----------
----------

Generation = 1, Population = 13.
-0-0------
--0-------
--------0-
-------0-0
------0-0-
---0---0--
--0-------
---0-0----
----------
----------

Generation = 2, Population = 15.
0-0-0-----
--------0-
--0-------
----------
---0-0----
----0-----
-0-0-0-0--
------0---
---0-0----
----------

Generation = 3, Population = 28.
-----0--0-
0---0--0-0
-0-0----0-
--00-0----
--0-0-0---
-0-0-0-0--
0---0-0-0-
-0---0----
--0-------
---0-0----

Generation = 4, Population = 15.
0-----0---
------0---
--01-0----
----0---0-
--1-------
--0-------
-0-----0-0
--------0-
----------
------0---

Generation = 5, Population = 33.
-0---010--
0-00--10--
-01*0---0-
-------0-0
-0*00---0-
--10---0-0
0-----0-0-
-0--------
------0-0-
-----0-0--

Generation = 6, Population = 30.
---001*-0-
----------
-1*.1000--
------0---
01.110-0-0
0---------
--00-0-0--
--0-------
-0-----0-0
----0-0---

Generation = 7, Population = 41.
--01--.--0
-000---00-
0*..*-110-
0-00-010-0
-*.*-10---
1-1-0----0
00-1----0-
--1--0---0
0---0-----
-0-0-----0

Generation = 8, Population = 20.
----0-.0--
--1-------
-...*0----
1-1-0---0-
0...1-----
*-----0---
-1---0-0-0
------0---
--0-------
--------0-

Generation = 9, Population = 37.
--01-1.-0-
-0-0-0-0--
0*..*11-0-
*------0-0
-..**10-0-
*---0----0
--0-0-----
-01------0
-0-0--0-0-
--0----0-0

Generation = 10, Population = 40.
--1--**--0
-1110-1-0-
-**.***---
*--0--1---
-..**-10-0
.01---0---
0-1-10----
0---0-0---
01--00-0-0
--------0-

*** Life<Cell> 10x10 ***

Generation = 0, Population = 11.
--0-------
-0--------
-0--0-----
--0----0--
-0--------
----------
----------
----------
------00-0
---0------

Generation = 1, Population = 29.
---0------
01--0-----
01-0-0-0--
-0-00-0-0-
0------0--
-0--------
----------
------00-0
---0-011--
--0-0-00-0

Generation = 2, Population = 31.
000-------
--00---0--
-*-1--0---
01--10---0
-0-00-----
--0----0--
-0----00-0
---0------
----01-*0-
-0-0-0----

Generation = 3, Population = 47.
1------0--
01--0---0-
-*0*-----0
1*00-1--0-
-101---0-0
-0--0--100
0--0-01---
-00--00-00
-0-01--.10
0---01000-

Generation = 4, Population = 29.
*---0-0---
-----0----
0.1.-0--0-
*.-1--0--0
-*1--001-1
-1-0------
-0--0-----
--10------
-101-1-.*-
----------

Generation = 5, Population = 49.
.0-0-0-0--
--0--1--0-
1*-.01-0--
*.0-111--1
-**1011*-*
0-0--001-0
01-0-0----
-0---0--0-
0*1---1..0
-000-1--0-

Generation = 6, Population = 43.
.-0--1----
01----00-0
-.1.-*0--0
*.11*--00*
0..-1--.-*
1-10-11--1
--0----000
0--001-0--
1.---1-**-
--11---0--

Generation = 7, Population = 50.
.--00--0-0
1*0--1-1-1
-.*.-*-0--
..--*--1-*
-..1*-1*-*
*--10**---
-1100-----
10-1----00
**1--*-**0
00**0101--

Generation = 8, Population = 37.
.0-11-01-1
**---*---*
1.**-*--0-
..1-*----.
0..-.1-*-.
.--*-.*--1
0-----1-00
-1-*-1----
..-1-*1..-
-1.*-*---0

Generation = 9, Population = 48.
*1-**11*-*
*.---*-1-*
*.**0*00--
..*1*1-10.
-..1*-1.0.
.-1.0**--*
------*-1-
---.-*0-00
..1--**..0
0-*.-*--0-

Generation = 10, Population = 37.
**-.**-*-.
*.0-0.---.
..*.1.-1-0
.*.-.----.
-..-.-*.1*
.1-.-.*10*
--1-00.-*0
--1.0.1---
.**11....1
--..0*-1--

*** Life<Cell> 10x10 ***

Generation = 0, Population = 15.
0--------0
----0----0
-----0----
-0-----0--
--0---0---
-----0----
-------0-0
----------
-------0--
----00----

Generation = 1, Population = 32.
-0--0---01
0--0----01
-0----00-0
0----0--0-
---0------
--0-0--0-0
-----00---
---------0
----000-0-
---01100--

Generation = 2, Population = 34.
--0--0-0--
-00---0--*
0-00--11-1
---00-----
0----0-000
-0-0------
--0--11---
----0-----
-----1-0--
--01**11--

Generation = 3, Population = 46.
--100-0-01
-11---100.
-0---0-*-*
----1-0-0-
-------1-1
--0-0-0000
-----**0--
--00-000--
--000*010-
-01-**--0-

Generation = 4, Population = 38.
----1-10-*
0---0--1-.
01-----.-*
-0-0-0---0
--0---0*-*
-0---0----
---0-..1-0
-0--01-1--
--111.1*-0
01-1..--10

Generation = 5, Population = 48.
0--0*-*--.
1--010-*0.
--0000-.0.
-10----00-
-0---01.-.
0--00-----
--0--*.*--
0--0-*0-0-
00**-.**01
1*1**.1-*-

Generation = 6, Population = 49.
101-.0*-0.
*1-1--1*-.
0--11-1.-*
0---1--1-0
-1-0-1**0.
---11000--
-0-0-*.*--
1-01-*--1-
11..-...-*
-.*.***1*-

Generation = 7, Population = 39.
-1*-.1*0-.
.-1*--*.-.
--0---*.0.
1--0*-0*01
---1--..1.
--0*--11--
--0-0..*--
*-1--.0---
-*..1...0*
1*...**-*-

Generation = 8, Population = 49.
1**-.**10.
.-**1-..0.
011110*.1*
-1--*--.-*
0-----..**
-0-.-0*---
00-0-*.*0-
.0*1-*--10
1.*.-.*.-*
**...*.-*-

Generation = 9, Population = 48.
***-***--.
.1..-0..-.
1***--.*-*
1*--*-0*0.
-1--01..**
010.1-*--0
1101-*.*--
.-.--*----
*..*-***0*
**.....1.-

Generation = 10, Population = 44.
***-***1-.
.-..-1..-.
-..*-0.*1.
-.--*01.-.
0--11*...*
---.*-*--1
-*1*0*..00
*0.-0*--10
**..-*.*-.
**.....*.0

*** Life<Cell> 10x10 ***

Generation = 0, Population = 7.
----------
----------
----------
---------0
----------
--00-0----
--0-----0-
--0-------
----------
----------

Generation = 1, Population = 19.
----------
----------
---------0
--------0-
--00-0---0
-0-1--0-0-
-0---0-0-0
-010----0-
--0-------
----------

Generation = 2, Population = 27.
----------
---------0
----------
--00-0-0-0
--1-----0-
010*00-0-0
0---0-0---
0-*100----
--1-----0-
--0-------

Generation = 3, Population = 36.
---------0
--------0-
--00-0-0--
-0-1----0-
0--00--0-0
--1.110-0-
---0-----0
1-*-11--0-
00--00-0-0
-010----0-

Generation = 4, Population = 27.
----------
--00-0----
--1-----0-
--0--0-0--
----------
01-.--10-0
0-0-0-0-0-
*0*1--0--0
--1-------
---1-0----

Generation = 5, Population = 40.
--00-0----
-0-1--0-0-
-0-------0
-0110-----
001--00--0
-*-.11-10-
--10---0-0
*-.*-110--
0-*0-00--0
------0---

Generation = 6, Population = 38.
--1-----0-
010*0-----
0---0-0---
-1*-1-0---
1---0-1---
-.1.*-1-10
0-*-----0-
.0..--*-0-
1-*---1-0-
0-11--10-0

Generation = 7, Population = 44.
0-*-0--0-0
--1.-00-0-
10----10--
0*.----0--
---0---000
-.*..-*--1
-0*00--0--
*-*.-1.--0
*0*--0-01-
1--*00-10-

Generation = 8, Population = 27.
--.-----0-
--**-1----
----------
-**1-----0
10--0-----
-*..*1*1-*
-1.-1---0-
*-..-*.---
*-*-------
*--*-----0

Generation = 9, Population = 39.
--.0-0-0-0
-1..--0-0-
-0---0---0
-***----0-
*1--1-10--
-****-**1.
-*.0*00---
*-..-..-0-
*-.--0---0
.0-.0---0-

Generation = 10, Population = 34.
-0.---0-0-
0**.-1-0-0
1--00---0-
-..*-00---
**10*---0-
-....1..*.
-*.-.-----
*-..1.*0--
*-.---1-1-
.-1.---1--

*** Life<Cell> 10x10 ***

Generation = 0, Population = 11.
--00------
---0-0----
----------
----0-----
0-0-------
----------
--------0-
----------
0-0-------
0---------

Generation = 1, Population = 28.
-01-00----
---1--0---
---000----
0-00-0----
---00-----
0-0-----0-
-------0-0
0-0-----0-
1--0------
100-------

Generation = 2, Population = 27.
01*011----
-0-*00-0--
0--1------
--11-10---
--0-1---0-
----0-----
------0---
1---------
--0-0---0-
--1-------

Generation = 3, Population = 53.
1*.1*-00--
010.1---0-
------00--
00--0*100-
-010*-00-0
--00100-0-
0---00-0--
-00-0-0-0-
101--0-0-0
-0*00---0-

Generation = 4, Population = 29.
-..**-11--
-*1.*0-0-0
--0-----0-
1----.--1-
--*1.-1---
0--1-1----
----1---0-
1---1-----
*-*-0-0---
--.-1-----

Generation = 5, Population = 51.
-.***1*-00
0*-.*1010-
0-1100--1-
-0-1-.10*0
-0*-*--00-
-0-*1---0-
----*--0-0
*000-00-0-
.-.----0--
1-.0*00---

Generation = 6, Population = 49.
1***.*.1-1
-.1..-1-1-
1-**1-00--
-1-*0.*1.1
01.-*0--1-
010.*1-01-
0-00.-----
.--1111---
*0.-0-0---
-0.1*-1---

Generation = 7, Population = 40.
****..*-0-
-.-..-*---
-0..--1--0
1*1.1..-.-
-*.-.--0*-
1*-..--1-0
10--.-000-
*0--*--0--
*-.0-0-0--
-1***-*0--

Generation = 8, Population = 46.
.**....--1
0.1..1*110
-1*.10*01-
*.*.-..1*1
0..-.-1-*-
-.0..-----
*10-.01-1-
.-0-*-----
*0.1--0-0-
-****0*-0-

Generation = 9, Population = 47.
.**...*1-*
-.-.*-.**-
1**.*1.-*0
*.**1..-.*
1..-.0-0*-
-.1..1----
.-10.1*--0
.011*-----
*-.*0-1-10
-*.**-*-10

Generation = 10, Population = 39.
......*-0.
0.-.*-...0
-.*..*.-.-
*.*.-.*1.*
*.*1.1-1*-
1***.--110
.-*-.-*01-
.1*-.---0-
*0..1-*---
-.***-.---

*** Life<Cell> 10x10 ***

Generation = 0, Population = 7.
---------0
----------
--0-----0-
-0--------
----------
--00------
----------
--------0-
----------
----------

Generation = 1, Population = 22.
--------0-
--0-----00
---0---0-0
0-------0-
-000------
-0110-----
--00----0-
-------0-0
--------0-
----------

Generation = 2, Population = 19.
--0----01-
-0--------
0---0-0--1
--0-------
--1-----0-
0---10--0-
----------
--00--0---
----------
--------0-

Generation = 3, Population = 59.
---0--01*0
----0-0000
--00---00-
00100-0-00
00*000-010
-011*10010
0-00000-0-
-01100-0--
--00--0-0-
-------0-0

Generation = 4, Population = 25.
--0--0-*.-
--00------
0---0-0-11
-1---0--1-
--.------1
0---.-11--
--1-----1-
-1--1---0-
----------
--00----0-

Generation = 5, Population = 51.
-01-0--..-
00-1-00000
--0--0---*
--1----0*0
00.--000--
-01-.1**-0
0--00-0-*0
0--1-0-010
-0000-----
-0110--0-0

Generation = 6, Population = 39.
--*0--0**0
1---0-----
0-1-01--1.
0-*0----.-
1-.-0-11--
0-*-.-..11
1---1-1-.1
1-----01*-
--1-----0-
0-**-00---

Generation = 7, Population = 55.
00.1-01**1
*0--1-00-0
--*0-*00-.
--*10000.-
-0*---**-1
--.1.-*.*-
-010--*-.*
*11-10--*-
-0*--0--10
--**-1100-

Generation = 8, Population = 43.
--*-01*..-
*--1--1101
0-.--.-11.
--.*-1-1.0
11.00-..1-
--.*.1*.*1
--*---*0**
*-*1*--1*0
--.-----*1
--**------

Generation = 9, Population = 46.
00.11-*.*1
.0-----*1*
10.--.-*-.
-1**0--*.-
**.110..*1
00.*.**..-
10*01-.1..
.-*-.0--.1
0-.-0---.-
-0..0---00

Generation = 10, Population = 47.
1-***-...-
.-011--.**
*1.00.0*-.
0*..--0*.0
...**-.***
11....***1
-1.1*0.-..
*-*-.-01.-
--.01---*-
--..11-011

*** Life<Cell> 10x10 ***

Generation = 0, Population = 8.
--------0-
--------0-
---0----0-
----------
--------0-
----------
----------
-------0--
-----0---0
----------

Generation = 1, Population = 26.
-------010
---0---0-0
--0-0--010
---0------
-------0-0
--------0-
-------0--
-----00-00
----0-000-
-----0---0

Generation = 2, Population = 19.
---0--0---
------0---
-0---00---
--------0-
---0--0-0-
-------0--
-----0--00
-----1---1
---0-----0
-------0--

Generation = 3, Population = 48.
--0-0010--
-0-0---0--
0-0-01-01-
-0-0-0-010
--0-00-010
---0-0--00
----010-1-
---00*0---
--0-00-001
---0--0-00

Generation = 4, Population = 19.
---01---1-
----0-----
----1--1--
-------1--
----11---1
--------1-
---0----*-
---1-.---1
-0-----11-
-------0--

Generation = 5, Population = 48.
--01-0-0-0
-----0-00-
---0*10*1-
-----00*10
---0**00--
---000-0*-
--010--0*-
-00*0.-00-
0-00--0-*-
-0----01--

Generation = 6, Population = 41.
-01*-1-11-
--0---01--
--01.-1.*-
----01-.*1
--0-..1111
---1--01.0
----1-01.0
-1-.-*--11
-----01-*1
---0-0-*--

Generation = 7, Population = 42.
01**--1-*0
---0----0-
-0-**-*.*-
----1*0..-
-0--*.-***
-----01*.-
-0---1--.-
0-0.-.0--*
-0-001*1.-
--0--10*-0

Generation = 8, Population = 37.
1-**11--*1
0------1--
0--*.1*..0
----*.-..1
0-00*.1.*.
-------*.0
----1*01.0
---*0.1-1.
---1-*.-.-
------1*--

Generation = 9, Population = 48.
*-.*-*1-**
-00-0-----
100.***.*1
--00..-***
--1-**-***
0-01-01..1
-----.1-.1
--0*-.*0-.
--0*0*.1.-
---0--*.0-

Generation = 10, Population = 37.
.-**1**-..
0--010----
*11.***..-
0-11..-...
00--.*1...
---*0--..-
0----.--**
-1-.-..-1.
-0-.-*.**-
---1--**-0

*** Life<Cell> 10x10 ***

Generation = 0, Population = 10.
-000---0--
--------0-
-------0--
---------0
----------
----------
-0--------
----------
---0--0---
----------

Generation = 1, Population = 27.
01-10-0---
-000---0-0
------0--0
-------00-
---------0
-0--------
0-0-------
-0-0--0---
--0-00-0--
---0--0---

Generation = 2, Population = 22.
1-0-1----0
------0--1
-000-0-0-1
-------110
-0-----0--
---------0
------0---
----------
----11--0-
----------

Generation = 3, Population = 44.
-----00-01
00-00---0-
01-1--010-
--00-00*--
0-0---01--
-0----000-
-----0-0-0
----000-0-
---0**00-0
----00--0-

Generation = 4, Population = 24.
11-1-11--*
----1-----
--0----*-1
-----1-.--
-01---1*--
--------1-
-0---1-1--
---------0
--01..11--
----------

Generation = 5, Population = 53.
**--1**00.
000---00--
-1-1000.--
-0--0--*-0
01*0--**--
--0--000-0
0-0-0----0
-000-00-0-
-01*..**00
--00--00--

Generation = 6, Population = 40.
*.-1**.11.
--1--01---
--0*1--.-1
---01-0*--
1*.1--..0-
-----11--1
-0-0-1-1-1
----01-010
0--.....11
----00---0

Generation = 7, Population = 50.
..-***.**.
00*01-*-01
-1-.---*0-
00-1--1*-0
*.**-0..--
0---0-*--*
0---0-0*0-
00--1---*1
-0-...**-*
0--0110--1

Generation = 8, Population = 52.
.*-..*****
11.1-0*-1*
0--.1-0.-1
--0*1-**1-
*.**0-.*--
-00-11*--.
---0---.-1
--00*1-0.-
011*..**1*
--01----0*

Generation = 9, Population = 41.
**0.**...*
--*-1-.0-.
1-0.*0-.0*
-0-.*-*.*-
....1-..--
-1----*--.
-0010-0.0-
0---.*01.-
1--..**.**
0---1-0--*

Generation = 10, Population = 45.
.*-.**....
--*--0*--*
-11.*1-.-*
---.*1.**-
....*0.*0-
0*-0-1.01.
----11-.-1
1-00..-*.1
-1-.*...**
10-1-110-*
