20

10 10
7
t 1 7 e
f 2 3 e
h 9 3 n
h 1 2 s
f 4 4 w
h 3 4 e
h 2 3 w
9 8

14 12
7
r 5 4 s
t 12 1 n
f 10 4 s
h 2 1 e
r 12 0 n
h 2 0 w
f 9 11 s
1 2

11 14
3
r 8 3 n
t 6 6 e
t 10 1 w
6 8

14 15
9
t 12 3 s
r 10 8 e
h 1 10 s
f 10 5 s
h 2 10 w
t 4 10 n
r 13 14 s
t 9 1 n
t 5 11 w
5 7

11 14
7
t 1 8 e
r 9 6 e
t 10 7 w
f 8 4 w
t 0 3 n
h 7 6 e
h 5 12 s
1 5

15 12
13
r 12 10 n
r 4 6 n
f 13 6 e
r 4 10 s
t 12 9 e
f 2 0 w
t 2 8 n
f 7 3 w
r 2 8 n
t 8 5 w
r 11 7 e
r 4 1 s
f 6 7 s
6 8

13 11
13
h 11 9 e
r 11 0 w
f 7 8 n
h 0 2 s
h 3 7 e
h 7 7 w
r 5 1 e
r 1 3 s
r 6 10 n
f 10 7 e
t 5 8 w
r 6 3 n
h 12 1 n
6 10

12 12
15
t 4 9 e
h 3 3 e
r 7 0 s
f 3 0 n
t 6 9 w
t 5 8 s
h 5 8 s
h 3 8 s
f 3 7 w
f 7 11 n
f 4 11 e
f 2 3 w
f 4 0 n
f 1 2 e
f 10 1 s
10 2

12 12
1
t 4 3 s
2 1

12 15
13
r 10 11 n
t 4 11 w
r 5 14 n
f 10 2 w
r 1 8 w
f 8 8 s
h 0 7 w
h 4 0 n
f 5 3 e
f 7 4 n
h 7 11 s
t 9 8 s
t 5 13 s
10 1

14 10
11
r 3 1 e
r 1 0 s
f 7 2 e
r 11 8 n
t 11 7 s
t 12 5 w
t 10 0 e
f 3 5 s
h 11 3 s
h 10 4 s
t 1 2 w
1 6

13 15
8
h 3 8 e
h 6 1 n
t 0 1 e
r 8 2 s
f 0 10 n
f 0 1 w
t 11 10 s
h 3 13 n
9 5

12 13
3
h 5 6 n
f 5 6 w
r 2 9 n
5 5

13 15
14
f 3 6 w
t 6 6 s
h 4 10 s
r 12 13 w
r 9 7 n
h 4 4 s
t 8 1 e
t 4 0 s
h 3 9 w
t 4 4 s
r 12 13 n
h 0 3 e
f 3 0 n
t 8 13 s
1 4

12 11
10
t 4 5 w
h 6 7 n
f 4 1 n
f 1 10 e
h 4 2 n
r 8 1 w
f 9 7 n
h 10 3 w
h 8 5 s
t 6 5 s
10 5

11 14
14
h 2 9 s
r 10 11 w
h 6 5 w
r 3 10 s
t 10 5 s
t 3 7 s
r 4 13 e
f 0 2 e
h 6 0 w
t 5 13 n
f 3 12 w
t 5 4 e
t 4 0 w
f 6 3 w
7 1

11 13
5
h 6 7 s
t 9 0 n
h 6 6 n
t 1 4 w
f 1 9 e
4 10

11 14
8
h 6 4 n
r 7 11 n
h 6 1 w
f 2 3 s
h 9 2 n
t 1 10 e
h 9 13 w
r 1 6 n
5 9

12 13
13
t 7 2 w
t 4 0 w
h 4 4 w
r 5 9 w
t 4 7 s
f 8 4 n
h 2 7 e
t 7 10 e
r 5 2 w
r 0 4 s
r 1 0 w
f 1 12 e
t 0 7 e
2 9

14 10
10
h 1 9 e
t 1 9 s
t 9 4 e
t 10 6 w
f 12 3 s
h 5 6 e
f 12 5 n
h 8 6 s
t 9 3 e
r 12 8 e
4 6
