953384 957049 383
643126 911116 525
358275 819904 509
502992 988433 525
646613 919434 525
677519 961096 525
866166 891781 445
868718 957214 507
997307 998309 440
119791 889783 525
375557 978582 525
45216 66980 340
119040 971642 525
212138 815970 509
789532 796349 468
613620 805858 509
102584 959473 525
719848 734317 411
587620 847291 525
948367 969724 414
823128 999532 525
729649 973784 525
195458 396595 443
995912 996023 365
686992 816750 504
258956 384871 441
424469 809812 509
425573 456652 400
484410 926603 525
69732 789511 509
512045 566683 452
71764 468349 449
347025 779558 509
839387 994964 507
713871 977076 525
702791 793743 504
869801 955088 507
937207 952189 507
555813 985511 525
752008 801666 468
978078 981121 427
749884 840348 525
548603 844945 525
576968 602485 434
690507 990341 525
778695 880061 525
217521 282605 443
262105 748717 509
291582 601768 470
807187 960540 525
805232 813033 406
615322 768840 509
440385 685846 509
967674 975533 458
936917 974866 507
476792 750046 509
955571 986824 458
620326 971369 525
839409 881765 432
209306 397061 443
445128 495103 444
301577 921614 525
683017 870355 525
510059 966757 525
98514 862454 525
865430 955914 507
291324 885712 525
476152 693144 509
73301 858361 525
12648 394004 443
892795 987239 507
78498 434567 449
781916 976879 525
162528 646104 509
153599 529793 470
767188 896541 525
11619 14299 276
600730 901931 525
436191 985283 525
90155 579690 470
37890 364847 443
390002 424093 449
840460 945701 507
922749 957587 507
295565 630690 509
813371 930918 525
86246 449051 449
78609 521701 470
661426 893706 525
732530 842570 525
863828 907894 445
225865 320948 443
859479 908465 445
733034 989171 525
442472 616366 470
305313 827344 509
565189 854067 525
232892 597715 470
343094 879709 525
15674 950344 525
698736 784356 504
282130 306442 389
344382 728238 509
276108 291796 389
267466 275666 407
732468 888234 525
668997 670251 336
590255 952133 525
821998 891933 525
763855 996770 525
947329 981122 458
696690 839337 525
51432 134290 354
80346 863966 525
810596 997104 525
236401 849319 525
264639 987547 525
54749 690094 509
382752 930220 525
840155 884119 432
158888 669325 509
13546 577367 470
688178 706464 504
262120 596779 470
526508 609400 452
962834 981098 458
516207 954482 525
769550 902964 525
247203 466402 449
880054 884557 370
201942 829441 509
37190 940384 525
131876 977162 525
583508 614023 434
974365 998067 440
607508 652783 509
92145 760369 509
501097 536485 470
806277 939226 525
662981 865679 525
163899 542212 470
814382 950397 525
212936 715213 509
335996 903841 525
832787 964137 525
363417 430954 449
660287 862981 525
251587 724189 509
102421 442530 449
973413 974642 383
211216 398552 443
443489 996908 525
178820 825953 509
38804 405126 443
259993 577966 470
81124 710540 509
634635 894190 525
50987 938839 525
79745 868474 525
687684 854943 525
760082 956988 525
291670 616202 470
831007 996662 525
243406 921405 525
413303 936477 525
631465 908149 525
821383 986063 525
660442 696985 442
761803 833718 468
437375 626913 509
106220 347296 443
231030 945072 525
794194 973021 525
688854 709884 504
432441 835342 509
366415 656881 509
636376 762942 504
291411 690516 509
833614 969311 525
629325 853721 525
845676 859948 419
234819 493015 449
115235 420021 449
393602 749828 509
523030 915928 525
371424 749144 509
20640 352101 443
233430 333592 407
156712 549401 470
915593 991750 507
564449 895881 525
207392 315883 443
964119 997258 458
117917 926110 525
101850 966905 525
851270 978222 507
31495 360808 443
802830 804749 331
885353 996651 507
783044 959187 525
291542 837360 509
984211 995042 427
954861 958618 352
517901 610845 452
81842 495525 449
928015 942291 507
740349 915223 525
388288 921506 525
420787 643163 509
685281 708233 504
939930 984244 458
803603 839830 525
406344 464254 449
199881 957716 525
261031 323905 407
890427 978592 507
924093 926200 370
113027 364752 443
759753 878731 525
909151 924048 476
649280 882950 525
419999 634130 509
883034 900530 445
805935 891212 525
303280 993257 525
581425 745845 509
633377 677344 442
576297 817356 509
536037 649005 509
814241 917711 525
138286 660903 509
937755 982888 507
192701 561988 470
205918 581199 470
50627 715775 509
924416 997500 507
955283 998150 458
844096 926328 476
300569 331756 384
966264 970467 352
810932 991626 525
951475 977984 458
9631 990609 525
14411 740746 509
256314 430099 449
627442 655868 416
435885 647913 509
698753 703243 411
117271 864820 525
69449 521767 470
