customer_id,account_locator,state,aws_quicksight_username
red_bottle_coffee,QX97365,CA,d@nielhunt.com
red_bottle_coffee,QX97365,IN,d@nielhunt.com
red_bottle_coffee,QX97365,LA,d@nielhunt.com
red_bottle_coffee,QX97365,MO,d@nielhunt.com
red_bottle_coffee,QX97365,NV,d@nielhunt.com
red_bottle_coffee,QX97365,PA,d@nielhunt.com
red_bottle_coffee,QX97365,TN,d@nielhunt.com
specialty_cusines_internal,ZM40239,PA,233783361228
specialty_cusines_internal,ZM40239,FL,233783361228
specialty_cusines_internal,ZM40239,TN,233783361228
specialty_cusines_internal,ZM40239,IN,233783361228
specialty_cusines_internal,ZM40239,MO,233783361228
specialty_cusines_internal,ZM40239,LA,233783361228
specialty_cusines_internal,ZM40239,AZ,233783361228
specialty_cusines_internal,ZM40239,NJ,233783361228
specialty_cusines_internal,ZM40239,NV,233783361228
specialty_cusines_internal,ZM40239,AB,233783361228
specialty_cusines_internal,ZM40239,CA,233783361228
specialty_cusines_internal,ZM40239,ID,233783361228
specialty_cusines_internal,ZM40239,DE,233783361228
specialty_cusines_internal,ZM40239,IL,233783361228
specialty_cusines_internal,ZM40239,TX,233783361228
specialty_cusines_internal,ZM40239,CO,233783361228
specialty_cusines_internal,ZM40239,HI,233783361228
specialty_cusines_internal,ZM40239,WA,233783361228
specialty_cusines_internal,ZM40239,MA,233783361228
specialty_cusines_internal,ZM40239,MI,233783361228
specialty_cusines_internal,ZM40239,XMS,233783361228
specialty_cusines_internal,ZM40239,MT,233783361228
specialty_cusines_internal,ZM40239,VT,233783361228
specialty_cusines_internal,ZM40239,VI,233783361228
specialty_cusines_internal,ZM40239,NC,233783361228
specialty_cusines_internal,ZM40239,UT,233783361228
specialty_cusines_internal,ZM40239,SD,233783361228