name1,name2,goal_diff,score_diff
Arsenal,Crystal Palace,0.5,0.5
Leicester,Everton,0.5,0.5
Man United,Swansea,0.5,0.5
QPR,Hull,0.5,0.5
Stoke,Aston Villa,0.5,0.5
West Brom,Sunderland,0.5,0.5
West Ham,Tottenham,0.5,0.5
Liverpool,Southampton,0.5,0.5
Newcastle,Man City,0.5,0.5
Burnley,Chelsea,0.5,0.5
Aston Villa,Newcastle,0.5254237288135594,0.5344827586206896
Chelsea,Leicester,0.5169491525423728,0.5172413793103449
Crystal Palace,West Ham,0.5,0.5
Everton,Arsenal,0.4915254237288136,0.4827586206896552
Southampton,West Brom,0.4915254237288136,0.4827586206896552
Swansea,Burnley,0.5254237288135594,0.5344827586206896
Hull,Stoke,0.5169491525423728,0.5344827586206896
Sunderland,Man United,0.5084745762711864,0.5172413793103449
Tottenham,QPR,0.5169491525423728,0.5344827586206896
Man City,Liverpool,0.5084745762711864,0.5
Burnley,Man United,0.4830508474576271,0.4827586206896552
Everton,Chelsea,0.4661016949152542,0.46551724137931033
Man City,Stoke,0.5423728813559322,0.5517241379310345
Newcastle,Crystal Palace,0.5084745762711864,0.5172413793103449
QPR,Sunderland,0.4576271186440678,0.46551724137931033
Swansea,West Brom,0.5169491525423728,0.5344827586206896
West Ham,Southampton,0.5169491525423728,0.5172413793103449
Aston Villa,Hull,0.5,0.5
Leicester,Arsenal,0.4745762711864407,0.46551724137931033
Tottenham,Liverpool,0.5508474576271186,0.5344827586206896
Arsenal,Man City,0.4830508474576271,0.5
Chelsea,Swansea,0.5169491525423728,0.5
Crystal Palace,Burnley,0.5,0.5
Liverpool,Aston Villa,0.5,0.4827586206896552
Southampton,Newcastle,0.5254237288135594,0.5172413793103449
Stoke,Leicester,0.5169491525423728,0.5172413793103449
Sunderland,Tottenham,0.4745762711864407,0.46551724137931033
West Brom,Everton,0.5,0.5
Man United,QPR,0.5254237288135594,0.5
Hull,West Ham,0.5084745762711864,0.5172413793103449
Aston Villa,Arsenal,0.5169491525423728,0.5344827586206896
Burnley,Sunderland,0.4830508474576271,0.4827586206896552
Newcastle,Hull,0.4491525423728814,0.46551724137931033
QPR,Stoke,0.4406779661016949,0.4827586206896552
Swansea,Southampton,0.4830508474576271,0.5172413793103449
West Ham,Liverpool,0.4830508474576271,0.4827586206896552
Everton,Crystal Palace,0.5169491525423728,0.5344827586206896
Leicester,Man United,0.4661016949152542,0.5
Man City,Chelsea,0.4491525423728814,0.4482758620689655
Tottenham,West Brom,0.559322033898305,0.5517241379310345
Arsenal,Tottenham,0.5254237288135594,0.5344827586206896
Chelsea,Aston Villa,0.576271186440678,0.5344827586206896
Crystal Palace,Leicester,0.4745762711864407,0.46551724137931033
Hull,Man City,0.4745762711864407,0.4827586206896552
Liverpool,Everton,0.5084745762711864,0.5
Man United,West Ham,0.5,0.4827586206896552
Southampton,QPR,0.6186440677966102,0.5689655172413793
Sunderland,Swansea,0.4745762711864407,0.46551724137931033
West Brom,Burnley,0.4915254237288136,0.5172413793103449
Stoke,Newcastle,0.5423728813559322,0.5172413793103449
Aston Villa,Man City,0.4322033898305085,0.4827586206896552
Hull,Crystal Palace,0.4830508474576271,0.4827586206896552
Leicester,Burnley,0.5508474576271186,0.5517241379310345
Liverpool,West Brom,0.4915254237288136,0.4827586206896552
Sunderland,Stoke,0.4915254237288136,0.4827586206896552
Swansea,Newcastle,0.576271186440678,0.5689655172413793
Chelsea,Arsenal,0.5677966101694916,0.5517241379310345
Man United,Everton,0.5338983050847458,0.5172413793103449
Tottenham,Southampton,0.4491525423728814,0.4482758620689655
West Ham,QPR,0.576271186440678,0.5344827586206896
Arsenal,Hull,0.5169491525423728,0.5172413793103449
Burnley,West Ham,0.423728813559322,0.4482758620689655
Crystal Palace,Chelsea,0.364406779661017,0.3793103448275862
Everton,Aston Villa,0.5169491525423728,0.46551724137931033
Man City,Tottenham,0.5423728813559322,0.5344827586206896
Newcastle,Leicester,0.4491525423728814,0.4482758620689655
Southampton,Sunderland,0.5423728813559322,0.5344827586206896
QPR,Liverpool,0.4067796610169492,0.43103448275862066
Stoke,Swansea,0.4661016949152542,0.46551724137931033
West Brom,Man United,0.4661016949152542,0.46551724137931033
Liverpool,Hull,0.5084745762711864,0.5172413793103449
Southampton,Stoke,0.6271186440677966,0.5517241379310345
Sunderland,Arsenal,0.423728813559322,0.46551724137931033
Swansea,Leicester,0.5254237288135594,0.5172413793103449
West Brom,Crystal Palace,0.5169491525423728,0.5172413793103449
West Ham,Man City,0.4491525423728814,0.4482758620689655
Burnley,Everton,0.423728813559322,0.4482758620689655
Man United,Chelsea,0.3983050847457627,0.39655172413793105
Tottenham,Newcastle,0.5423728813559322,0.5344827586206896
QPR,Aston Villa,0.4661016949152542,0.43103448275862066
Arsenal,Burnley,0.6271186440677966,0.6206896551724138
Chelsea,QPR,0.711864406779661,0.6896551724137931
Everton,Swansea,0.4915254237288136,0.4827586206896552
Hull,Southampton,0.3728813559322034,0.43103448275862066
Leicester,West Brom,0.4745762711864407,0.4827586206896552
Newcastle,Liverpool,0.4491525423728814,0.46551724137931033
Stoke,West Ham,0.4406779661016949,0.4482758620689655
Aston Villa,Tottenham,0.4322033898305085,0.4827586206896552
Man City,Man United,0.5508474576271186,0.5344827586206896
Crystal Palace,Sunderland,0.5508474576271186,0.5
Burnley,Hull,0.3898305084745763,0.41379310344827586
Liverpool,Chelsea,0.364406779661017,0.3620689655172414
Man United,Crystal Palace,0.559322033898305,0.5517241379310345
QPR,Man City,0.3220338983050848,0.3448275862068966
Southampton,Leicester,0.6779661016949152,0.6379310344827587
West Ham,Aston Villa,0.635593220338983,0.5862068965517242
Sunderland,Everton,0.423728813559322,0.4827586206896552
Swansea,Arsenal,0.4661016949152542,0.46551724137931033
Tottenham,Stoke,0.5084745762711864,0.5172413793103449
West Brom,Newcastle,0.5338983050847458,0.5
Arsenal,Man United,0.5254237288135594,0.5172413793103449
Chelsea,West Brom,0.6610169491525424,0.6724137931034483
Everton,West Ham,0.4745762711864407,0.46551724137931033
Leicester,Sunderland,0.5,0.4482758620689655
Man City,Swansea,0.5508474576271186,0.5344827586206896
Newcastle,QPR,0.576271186440678,0.603448275862069
Stoke,Burnley,0.6016949152542372,0.5862068965517242
Crystal Palace,Liverpool,0.4576271186440678,0.4482758620689655
Hull,Tottenham,0.5,0.4827586206896552
Aston Villa,Southampton,0.2542372881355932,0.3448275862068966
Burnley,Aston Villa,0.4915254237288136,0.4827586206896552
Liverpool,Stoke,0.4915254237288136,0.4827586206896552
Man United,Hull,0.559322033898305,0.5862068965517242
QPR,Leicester,0.4576271186440678,0.46551724137931033
Sunderland,Chelsea,0.2796610169491526,0.3103448275862069
Swansea,Crystal Palace,0.559322033898305,0.5689655172413793
West Brom,Arsenal,0.423728813559322,0.4482758620689655
West Ham,Newcastle,0.5423728813559322,0.4827586206896552
Southampton,Man City,0.559322033898305,0.5172413793103449
Tottenham,Everton,0.4661016949152542,0.4827586206896552
Burnley,Newcastle,0.4152542372881356,0.41379310344827586
Crystal Palace,Aston Villa,0.559322033898305,0.5
Leicester,Liverpool,0.4491525423728814,0.43103448275862066
Man United,Stoke,0.5847457627118644,0.5862068965517242
Swansea,QPR,0.6186440677966102,0.603448275862069
West Brom,West Ham,0.4152542372881356,0.41379310344827586
Arsenal,Southampton,0.423728813559322,0.4482758620689655
Chelsea,Tottenham,0.6610169491525424,0.6551724137931034
Everton,Hull,0.5677966101694916,0.5689655172413793
Sunderland,Man City,0.3220338983050848,0.3793103448275862
Hull,West Brom,0.5,0.5
Liverpool,Sunderland,0.5847457627118644,0.5344827586206896
Man City,Everton,0.6271186440677966,0.6206896551724138
Newcastle,Chelsea,0.2966101694915254,0.3275862068965517
QPR,Burnley,0.4915254237288136,0.46551724137931033
Stoke,Arsenal,0.4067796610169492,0.39655172413793105
Tottenham,Crystal Palace,0.5169491525423728,0.5689655172413793
Aston Villa,Leicester,0.5,0.5689655172413793
West Ham,Swansea,0.5084745762711864,0.5172413793103449
Southampton,Man United,0.5508474576271186,0.5
Arsenal,Newcastle,0.559322033898305,0.5
Burnley,Southampton,0.2711864406779661,0.3620689655172414
Chelsea,Hull,0.728813559322034,0.7413793103448276
Crystal Palace,Stoke,0.4830508474576271,0.46551724137931033
Leicester,Man City,0.2542372881355932,0.24137931034482757
Sunderland,West Ham,0.34745762711864403,0.39655172413793105
West Brom,Aston Villa,0.5254237288135594,0.4482758620689655
Man United,Liverpool,0.576271186440678,0.5862068965517242
Swansea,Tottenham,0.5508474576271186,0.5172413793103449
Everton,QPR,0.6016949152542372,0.5689655172413793
Aston Villa,Man United,0.3135593220338983,0.3620689655172414
Hull,Swansea,0.4152542372881356,0.41379310344827586
Man City,Crystal Palace,0.7033898305084746,0.7241379310344828
QPR,West Brom,0.4322033898305085,0.4482758620689655
Southampton,Everton,0.576271186440678,0.5344827586206896
Tottenham,Burnley,0.5932203389830508,0.5862068965517242
West Ham,Leicester,0.6694915254237288,0.7068965517241379
Liverpool,Arsenal,0.3983050847457627,0.43103448275862066
Newcastle,Sunderland,0.5508474576271186,0.5517241379310345
Stoke,Chelsea,0.2796610169491526,0.27586206896551724
Arsenal,QPR,0.6779661016949152,0.6379310344827587
Burnley,Liverpool,0.4067796610169492,0.43103448275862066
Chelsea,West Ham,0.6271186440677966,0.6206896551724138
Crystal Palace,Southampton,0.30508474576271183,0.3620689655172414
Everton,Stoke,0.5423728813559322,0.5344827586206896
Leicester,Tottenham,0.3898305084745763,0.3103448275862069
Man United,Newcastle,0.6440677966101696,0.603448275862069
Sunderland,Hull,0.5,0.5862068965517242
Swansea,Aston Villa,0.6101694915254238,0.5517241379310345
West Brom,Man City,0.2627118644067796,0.2586206896551724
Aston Villa,Sunderland,0.5,0.4827586206896552
Hull,Leicester,0.5677966101694916,0.5862068965517242
Man City,Burnley,0.8305084745762712,0.7931034482758621
Newcastle,Everton,0.4491525423728814,0.5172413793103449
QPR,Crystal Palace,0.4745762711864407,0.5
Southampton,Chelsea,0.4152542372881356,0.3448275862068966
Stoke,West Brom,0.5338983050847458,0.5517241379310345
Tottenham,Man United,0.3813559322033898,0.43103448275862066
West Ham,Arsenal,0.4830508474576271,0.5
Liverpool,Swansea,0.4491525423728814,0.46551724137931033
Aston Villa,Crystal Palace,0.4915254237288136,0.5517241379310345
Hull,Everton,0.4491525423728814,0.4482758620689655
Liverpool,Leicester,0.6271186440677966,0.6724137931034483
Man City,Sunderland,0.7966101694915254,0.7241379310344828
Newcastle,Burnley,0.576271186440678,0.603448275862069
QPR,Swansea,0.3813559322033898,0.3793103448275862
Southampton,Arsenal,0.5508474576271186,0.4827586206896552
Stoke,Man United,0.364406779661017,0.3620689655172414
Tottenham,Chelsea,0.2711864406779661,0.3275862068965517
West Ham,West Brom,0.6440677966101696,0.6551724137931034
Burnley,QPR,0.4830508474576271,0.5
Chelsea,Newcastle,0.7627118644067796,0.7068965517241379
Crystal Palace,Tottenham,0.3983050847457627,0.3275862068965517
Everton,Man City,0.2542372881355932,0.22413793103448276
Leicester,Aston Villa,0.4745762711864407,0.39655172413793105
Sunderland,Liverpool,0.3898305084745763,0.43103448275862066
Swansea,West Ham,0.4491525423728814,0.46551724137931033
West Brom,Hull,0.4661016949152542,0.4827586206896552
Arsenal,Stoke,0.5932203389830508,0.5862068965517242
Man United,Southampton,0.4576271186440678,0.5344827586206896
Aston Villa,Liverpool,0.3813559322033898,0.39655172413793105
Burnley,Crystal Palace,0.4576271186440678,0.5
Leicester,Stoke,0.4322033898305085,0.39655172413793105
Newcastle,Southampton,0.2627118644067796,0.3793103448275862
QPR,Man United,0.2711864406779661,0.27586206896551724
Swansea,Chelsea,0.2796610169491526,0.2931034482758621
Tottenham,Sunderland,0.6186440677966102,0.6206896551724138
Man City,Arsenal,0.6101694915254238,0.6206896551724138
West Ham,Hull,0.6186440677966102,0.6551724137931034
Everton,West Brom,0.5423728813559322,0.5172413793103449
Chelsea,Man City,0.576271186440678,0.5517241379310345
Crystal Palace,Everton,0.4661016949152542,0.5
Hull,Newcastle,0.4915254237288136,0.41379310344827586
Liverpool,West Ham,0.4491525423728814,0.4827586206896552
Man United,Leicester,0.7457627118644068,0.7758620689655172
Stoke,QPR,0.6016949152542372,0.6206896551724138
Sunderland,Burnley,0.5084745762711864,0.5172413793103449
West Brom,Tottenham,0.4067796610169492,0.3448275862068966
Arsenal,Aston Villa,0.7372881355932204,0.6896551724137931
Southampton,Swansea,0.711864406779661,0.6206896551724138
Aston Villa,Chelsea,0.06779661016949151,0.15517241379310343
Everton,Liverpool,0.423728813559322,0.3793103448275862
Leicester,Crystal Palace,0.4406779661016949,0.41379310344827586
Man City,Hull,0.8050847457627119,0.8275862068965517
QPR,Southampton,0.17796610169491528,0.24137931034482757
Swansea,Sunderland,0.576271186440678,0.5862068965517242
Tottenham,Arsenal,0.3813559322033898,0.46551724137931033
Burnley,West Brom,0.4576271186440678,0.4827586206896552
Newcastle,Stoke,0.4661016949152542,0.4827586206896552
West Ham,Man United,0.423728813559322,0.41379310344827586
Arsenal,Leicester,0.7966101694915254,0.7931034482758621
Hull,Aston Villa,0.559322033898305,0.4827586206896552
Liverpool,Tottenham,0.5,0.46551724137931033
Sunderland,QPR,0.559322033898305,0.603448275862069
Chelsea,Everton,0.8050847457627119,0.8103448275862069
Crystal Palace,Newcastle,0.4830508474576271,0.4482758620689655
Man United,Burnley,0.788135593220339,0.7586206896551724
Southampton,West Ham,0.6101694915254238,0.5689655172413793
Stoke,Man City,0.288135593220339,0.3103448275862069
West Brom,Swansea,0.423728813559322,0.3793103448275862
Aston Villa,Stoke,0.3559322033898305,0.3793103448275862
Chelsea,Burnley,0.9491525423728814,0.9137931034482758
Crystal Palace,Arsenal,0.2711864406779661,0.3103448275862069
Hull,QPR,0.5508474576271186,0.5344827586206896
Man City,Newcastle,0.771186440677966,0.7241379310344828
Sunderland,West Brom,0.4661016949152542,0.5
Swansea,Man United,0.2966101694915254,0.3448275862068966
Everton,Leicester,0.6186440677966102,0.6379310344827587
Southampton,Liverpool,0.6186440677966102,0.5344827586206896
Tottenham,West Ham,0.4745762711864407,0.5344827586206896
Burnley,Swansea,0.3728813559322034,0.3448275862068966
Man United,Sunderland,0.771186440677966,0.7241379310344828
Newcastle,Aston Villa,0.6016949152542372,0.6206896551724138
Stoke,Hull,0.5508474576271186,0.603448275862069
West Brom,Southampton,0.2542372881355932,0.3103448275862069
West Ham,Crystal Palace,0.6440677966101696,0.6379310344827587
Arsenal,Everton,0.7033898305084746,0.7068965517241379
Liverpool,Man City,0.3135593220338983,0.3793103448275862
Aston Villa,West Brom,0.3728813559322034,0.39655172413793105
Hull,Sunderland,0.5423728813559322,0.4827586206896552
Southampton,Crystal Palace,0.711864406779661,0.6551724137931034
Liverpool,Burnley,0.7542372881355932,0.7758620689655172
Man City,Leicester,0.9067796610169492,0.9310344827586207
Newcastle,Man United,0.2457627118644068,0.3275862068965517
QPR,Arsenal,0.1610169491525424,0.15517241379310343
Stoke,Everton,0.5254237288135594,0.603448275862069
Tottenham,Swansea,0.5677966101694916,0.5344827586206896
West Ham,Chelsea,0.2627118644067796,0.27586206896551724
QPR,Tottenham,0.288135593220339,0.20689655172413796
Arsenal,West Ham,0.652542372881356,0.6551724137931034
Burnley,Man City,0.0423728813559322,0.10344827586206895
Crystal Palace,QPR,0.6016949152542372,0.6206896551724138
Leicester,Hull,0.423728813559322,0.3793103448275862
Sunderland,Aston Villa,0.559322033898305,0.5517241379310345
West Brom,Stoke,0.423728813559322,0.3793103448275862
Chelsea,Southampton,0.635593220338983,0.6724137931034483
Everton,Newcastle,0.5254237288135594,0.43103448275862066
Man United,Tottenham,0.6186440677966102,0.5517241379310345
Swansea,Liverpool,0.364406779661017,0.3793103448275862
Aston Villa,Swansea,0.3813559322033898,0.3620689655172414
Man City,West Brom,0.8389830508474576,0.7758620689655172
Newcastle,Arsenal,0.1610169491525424,0.2586206896551724
Southampton,Burnley,0.8389830508474576,0.7586206896551724
Stoke,Crystal Palace,0.5338983050847458,0.5862068965517242
Tottenham,Leicester,0.7033898305084746,0.8448275862068966
West Ham,Sunderland,0.6864406779661016,0.6206896551724138
Hull,Chelsea,0.11016949152542371,0.10344827586206895
Liverpool,Man United,0.4067796610169492,0.46551724137931033
QPR,Everton,0.3559322033898305,0.3620689655172414
Arsenal,Liverpool,0.6271186440677966,0.5689655172413793
Chelsea,Stoke,0.8305084745762712,0.7931034482758621
Everton,Southampton,0.288135593220339,0.3103448275862069
Leicester,West Ham,0.2966101694915254,0.22413793103448276
Man United,Aston Villa,0.8813559322033898,0.8620689655172413
Swansea,Hull,0.5677966101694916,0.6551724137931034
West Brom,QPR,0.5932203389830508,0.6551724137931034
Burnley,Tottenham,0.2627118644067796,0.20689655172413796
Sunderland,Newcastle,0.4491525423728814,0.43103448275862066
Crystal Palace,Man City,0.1694915254237288,0.22413793103448276
Aston Villa,QPR,0.4830508474576271,0.5517241379310345
Burnley,Arsenal,0.05084745762711862,0.10344827586206895
Southampton,Hull,0.788135593220339,0.7586206896551724
Sunderland,Crystal Palace,0.364406779661017,0.41379310344827586
Swansea,Everton,0.5084745762711864,0.5862068965517242
Tottenham,Aston Villa,0.728813559322034,0.7758620689655172
West Brom,Leicester,0.5423728813559322,0.6379310344827587
West Ham,Stoke,0.5508474576271186,0.5172413793103449
Man United,Man City,0.4491525423728814,0.5172413793103449
QPR,Chelsea,0.01694915254237289,-0.017241379310344862
Liverpool,Newcastle,0.711864406779661,0.7068965517241379
Chelsea,Man United,0.576271186440678,0.5862068965517242
Crystal Palace,West Brom,0.6271186440677966,0.603448275862069
Everton,Burnley,0.6779661016949152,0.6379310344827587
Leicester,Swansea,0.3559322033898305,0.24137931034482757
Stoke,Southampton,0.2796610169491526,0.3620689655172414
Man City,West Ham,0.7457627118644068,0.6896551724137931
Newcastle,Tottenham,0.3135593220338983,0.2931034482758621
Burnley,Leicester,0.4322033898305085,0.5
Crystal Palace,Hull,0.6101694915254238,0.6551724137931034
Man City,Aston Villa,0.9576271186440678,0.8620689655172413
Newcastle,Swansea,0.364406779661017,0.3620689655172414
QPR,West Ham,0.3220338983050848,0.27586206896551724
Southampton,Tottenham,0.6271186440677966,0.4827586206896552
Stoke,Sunderland,0.6694915254237288,0.6551724137931034
West Brom,Liverpool,0.288135593220339,0.27586206896551724
Arsenal,Chelsea,0.4322033898305085,0.3793103448275862
Everton,Man United,0.2457627118644068,0.24137931034482757
Hull,Liverpool,0.288135593220339,0.20689655172413796
Leicester,Chelsea,0.03389830508474578,-0.03448275862068961
Aston Villa,Everton,0.30508474576271183,0.3448275862068966
Leicester,Newcastle,0.5254237288135594,0.4482758620689655
Liverpool,QPR,0.7627118644067796,0.8620689655172413
Man United,West Brom,0.8305084745762712,0.8103448275862069
Sunderland,Southampton,0.1271186440677966,0.24137931034482757
Swansea,Stoke,0.5,0.5344827586206896
West Ham,Burnley,0.7203389830508474,0.7068965517241379
Chelsea,Crystal Palace,0.8898305084745763,0.9310344827586207
Tottenham,Man City,0.2627118644067796,0.39655172413793105
Hull,Arsenal,0.1271186440677966,0.13793103448275862
Aston Villa,West Ham,0.3135593220338983,0.3448275862068966
Crystal Palace,Man United,0.2457627118644068,0.24137931034482757
Everton,Sunderland,0.6864406779661016,0.603448275862069
Hull,Burnley,0.6016949152542372,0.5862068965517242
Leicester,Southampton,0.2033898305084746,0.24137931034482757
Newcastle,West Brom,0.4067796610169492,0.43103448275862066
Stoke,Tottenham,0.4152542372881356,0.3793103448275862
Chelsea,Liverpool,0.7627118644067796,0.7586206896551724
Man City,QPR,0.9830508474576272,1.0
Arsenal,Swansea,0.788135593220339,0.6896551724137931
Burnley,Stoke,0.2966101694915254,0.27586206896551724
Liverpool,Crystal Palace,0.652542372881356,0.7241379310344828
QPR,Newcastle,0.4661016949152542,0.3793103448275862
Southampton,Aston Villa,0.8220338983050848,0.7068965517241379
Sunderland,Leicester,0.4406779661016949,0.5344827586206896
Tottenham,Hull,0.652542372881356,0.7586206896551724
West Ham,Everton,0.5169491525423728,0.5344827586206896
Man United,Arsenal,0.4406779661016949,0.4827586206896552
Swansea,Man City,0.15254237288135591,0.3103448275862069
West Brom,Chelsea,0.03389830508474578,0.017241379310344807
Arsenal,Sunderland,0.9406779661016949,0.8448275862068966
Arsenal,West Brom,0.8559322033898304,0.8103448275862069
Aston Villa,Burnley,0.5084745762711864,0.5689655172413793
Chelsea,Sunderland,1.0,0.9827586206896552
Crystal Palace,Swansea,0.4745762711864407,0.3793103448275862
Everton,Tottenham,0.4576271186440678,0.3620689655172414
Hull,Man United,0.13559322033898308,0.10344827586206895
Leicester,QPR,0.6186440677966102,0.603448275862069
Man City,Southampton,0.6694915254237288,0.6896551724137931
Newcastle,West Ham,0.2966101694915254,0.3620689655172414
Stoke,Liverpool,0.4067796610169492,0.3793103448275862
