name1,name2,home,away,history,result,form1,form2,goal_diff,score_diff,motivation1,motivation2,diff_position
Everton,Bournemouth,1,0,0.5,1,0.3,0.2,0.484375,0.5185185185185185,0.98989898989899,1.0,0.368421052631579
Leicester,Liverpool,1,0,0.5,-1,0.3,0.6,0.484375,0.4444444444444444,1.0,1.0,0.8157894736842105
Man City,Crystal Palace,1,0,1.0,1,0.9,0.0,0.671875,0.6666666666666666,1.0,0.9595959595959596,0.0
Southampton,Man United,1,0,0.25,-1,0.6,0.9,0.390625,0.4444444444444444,1.0,1.0,0.7368421052631579
Stoke,Chelsea,1,0,0.0,-1,0.4,0.7,0.46875,0.4444444444444444,0.98989898989899,1.0,0.8421052631578947
Swansea,Watford,1,0,0.25,-1,0.4,0.6,0.4921875,0.462962962962963,0.98989898989899,1.0,0.7368421052631579
West Ham,Tottenham,1,0,0.5,-1,0.3,0.6,0.421875,0.4444444444444444,1.0,1.0,0.8684210526315791
Arsenal,West Brom,1,0,0.5,1,0.5,0.6,0.4921875,0.4814814814814815,0.98989898989899,1.0,0.368421052631579
Bournemouth,Leicester,1,0,0.75,0,0.2,0.3,0.46875,0.4814814814814815,0.9895833333333334,1.0,0.5526315789473684
Chelsea,Man City,1,0,1.0,-1,0.9,0.9,0.40625,0.462962962962963,1.0,1.0,0.5789473684210527
Man United,Crystal Palace,1,0,1.0,1,0.9,0.0,0.71875,0.7037037037037037,1.0,0.9583333333333334,0.02631578947368424
Stoke,Southampton,1,0,0.75,1,0.4,0.5,0.46875,0.462962962962963,0.9895833333333334,1.0,0.5263157894736842
West Brom,Watford,1,0,0.5,0,0.4,0.7,0.4921875,0.462962962962963,1.0,1.0,0.5526315789473684
West Ham,Swansea,1,0,1.0,1,0.3,0.3,0.4765625,0.4814814814814815,1.0,1.0,0.42105263157894735
Everton,Burnley,1,0,0.5,-1,0.3,0.5,0.4375,0.462962962962963,0.9791666666666666,1.0,0.763157894736842
Newcastle,Liverpool,1,0,0.75,0,0.6,0.7,0.5,0.462962962962963,1.0,1.0,0.5526315789473684
Burnley,West Ham,1,0,0.0,0,0.7,0.5,0.5625,0.5740740740740741,1.0,0.9784946236559141,0.2894736842105263
Crystal Palace,Chelsea,1,0,0.5,1,0.0,0.7,0.3203125,0.33333333333333337,0.956989247311828,1.0,0.8947368421052632
Liverpool,Man United,1,0,0.5,0,0.6,0.9,0.359375,0.4259259259259259,1.0,1.0,0.6578947368421053
Man City,Stoke,1,0,0.75,1,1.0,0.4,0.6875,0.6296296296296297,1.0,1.0,0.07894736842105265
Tottenham,Bournemouth,1,0,0.75,1,0.8,0.3,0.625,0.6296296296296297,1.0,0.956989247311828,0.07894736842105265
Watford,Arsenal,1,0,0.5,1,0.6,0.7,0.46875,0.5,1.0,1.0,0.4473684210526316
Southampton,Newcastle,1,0,0.75,0,0.3,0.7,0.4765625,0.4814814814814815,1.0,0.9784946236559141,0.5526315789473684
Leicester,West Brom,1,0,0.5,0,0.2,0.3,0.4921875,0.4444444444444444,0.967741935483871,0.989247311827957,0.7105263157894737
Chelsea,Watford,1,0,1.0,1,0.5,0.7,0.5390625,0.462962962962963,1.0,1.0,0.4473684210526316
Man City,Burnley,1,0,1.0,1,1.0,0.7,0.6796875,0.5925925925925926,1.0,0.9777777777777776,0.3157894736842105
Newcastle,Crystal Palace,1,0,0.5,1,0.6,0.2,0.6328125,0.6111111111111112,0.9666666666666668,0.9444444444444444,0.15789473684210525
Southampton,West Brom,1,0,0.5,1,0.3,0.3,0.5,0.4814814814814815,0.9888888888888888,0.9777777777777776,0.42105263157894735
Stoke,Bournemouth,1,0,0.25,-1,0.3,0.3,0.4921875,0.5555555555555556,1.0,0.9555555555555556,0.4473684210526316
Swansea,Leicester,1,0,0.5,-1,0.3,0.3,0.5,0.5185185185185185,1.0,1.0,0.5263157894736842
Everton,Arsenal,1,0,0.5,-1,0.3,0.7,0.421875,0.4444444444444444,1.0,1.0,0.8421052631578947
Tottenham,Liverpool,1,0,0.25,1,0.9,0.5,0.5703125,0.537037037037037,1.0,0.9777777777777776,0.34210526315789475
Arsenal,Swansea,1,0,1.0,1,0.7,0.3,0.5703125,0.5925925925925926,1.0,1.0,0.1842105263157895
Bournemouth,Chelsea,1,0,0.0,-1,0.5,0.5,0.390625,0.3888888888888889,0.9885057471264368,1.0,0.8947368421052632
Crystal Palace,West Ham,1,0,0.0,0,0.2,0.4,0.4375,0.4259259259259259,0.942528735632184,1.0,0.6052631578947368
Man United,Tottenham,1,0,0.5,1,0.7,0.9,0.5390625,0.5,1.0,1.0,0.4736842105263158
Watford,Stoke,1,0,0.0,-1,0.5,0.2,0.5625,0.5925925925925926,1.0,1.0,0.34210526315789475
West Brom,Man City,1,0,0.0,-1,0.3,1.0,0.2578125,0.33333333333333337,0.9770114942528736,1.0,0.8684210526315791
Leicester,Everton,1,0,0.0,1,0.5,0.3,0.5703125,0.5185185185185185,0.9885057471264368,1.0,0.3157894736842105
Burnley,Newcastle,1,0,0.5,1,0.5,0.6,0.4765625,0.5,1.0,1.0,0.4473684210526316
Newcastle,Bournemouth,1,0,0.5,-1,0.4,0.3,0.5703125,0.5925925925925926,1.0,1.0,0.34210526315789475
Southampton,Burnley,1,0,0.5,-1,0.4,0.6,0.4921875,0.462962962962963,1.0,1.0,0.6578947368421053
Stoke,Leicester,1,0,0.25,0,0.4,0.6,0.4296875,0.4814814814814815,0.9761904761904762,0.988095238095238,0.5526315789473684
West Ham,Liverpool,1,0,0.25,-1,0.4,0.6,0.421875,0.40740740740740733,1.0,1.0,0.8421052631578947
Chelsea,Man United,1,0,0.5,1,0.6,0.7,0.4140625,0.4444444444444444,1.0,1.0,0.5526315789473684
Everton,Watford,1,0,0.5,1,0.3,0.5,0.421875,0.40740740740740733,0.988095238095238,1.0,0.6578947368421053
Man City,Arsenal,1,0,0.75,1,1.0,0.8,0.6796875,0.6111111111111112,1.0,1.0,0.368421052631579
Tottenham,Crystal Palace,1,0,1.0,1,0.8,0.3,0.7265625,0.7037037037037037,1.0,0.9642857142857144,0.05263157894736842
Arsenal,Tottenham,1,0,0.25,1,0.6,0.8,0.4296875,0.4444444444444444,1.0,1.0,0.5526315789473684
Burnley,Swansea,1,0,0.0,1,0.7,0.2,0.5546875,0.6481481481481481,1.0,1.0,0.1842105263157895
Crystal Palace,Everton,1,0,0.25,0,0.3,0.3,0.453125,0.40740740740740733,0.962962962962963,0.9506172839506172,0.6052631578947368
Leicester,Man City,1,0,0.5,-1,0.7,1.0,0.2578125,0.2962962962962963,0.925925925925926,1.0,0.7894736842105263
Liverpool,Southampton,1,0,0.5,1,0.6,0.4,0.546875,0.5740740740740741,1.0,0.925925925925926,0.2631578947368421
Man United,Newcastle,1,0,0.5,1,0.5,0.4,0.640625,0.6111111111111112,1.0,0.9382716049382716,0.2631578947368421
West Brom,Chelsea,1,0,0.0,-1,0.2,0.6,0.390625,0.3703703703703704,1.0,1.0,0.8684210526315791
Watford,West Ham,1,0,0.75,1,0.3,0.4,0.5625,0.5740740740740741,0.9506172839506172,0.9876543209876544,0.2368421052631579
West Ham,Leicester,1,0,0.0,0,0.2,0.6,0.40625,0.4444444444444444,0.9871794871794872,0.9615384615384616,0.6578947368421053
Crystal Palace,Stoke,1,0,0.5,1,0.4,0.4,0.4296875,0.3888888888888889,0.935897435897436,0.9615384615384616,0.631578947368421
Liverpool,Chelsea,1,0,0.75,0,0.7,0.8,0.453125,0.4814814814814815,1.0,1.0,0.5789473684210527
Newcastle,Watford,1,0,0.0,-1,0.3,0.4,0.4921875,0.4444444444444444,0.9487179487179488,0.9487179487179488,0.6578947368421053
Swansea,Bournemouth,1,0,0.0,0,0.2,0.6,0.4609375,0.4444444444444444,0.9743589743589745,0.9615384615384616,0.6578947368421053
Tottenham,West Brom,1,0,0.75,0,0.6,0.1,0.65625,0.6481481481481481,1.0,1.0,0.1842105263157895
Burnley,Arsenal,1,0,0.0,-1,0.7,0.6,0.4765625,0.5185185185185185,1.0,1.0,0.5789473684210527
Southampton,Everton,1,0,0.5,1,0.4,0.4,0.5546875,0.5185185185185185,0.9615384615384616,0.9743589743589745,0.34210526315789475
Leicester,Tottenham,1,0,0.25,1,0.6,0.5,0.3984375,0.3888888888888889,0.9466666666666668,1.0,0.5526315789473684
Watford,Man United,1,0,0.5,-1,0.4,0.6,0.3359375,0.40740740740740733,0.9866666666666668,1.0,0.6578947368421053
West Brom,Newcastle,1,0,0.5,0,0.1,0.2,0.4765625,0.4814814814814815,1.0,0.96,0.631578947368421
Bournemouth,Burnley,1,0,0.5,-1,0.7,0.6,0.4609375,0.3888888888888889,0.96,1.0,0.7368421052631579
Chelsea,Swansea,1,0,0.75,1,0.9,0.1,0.6640625,0.7037037037037037,1.0,0.9733333333333334,0.07894736842105265
Everton,West Ham,1,0,0.75,1,0.3,0.2,0.4921875,0.5185185185185185,0.9866666666666668,0.9866666666666668,0.368421052631579
Man City,Southampton,1,0,0.75,1,1.0,0.5,0.78125,0.7407407407407407,1.0,0.9333333333333332,0.2368421052631579
Stoke,Liverpool,1,0,0.0,-1,0.4,0.7,0.3671875,0.3703703703703704,0.9733333333333334,1.0,0.7894736842105263
Arsenal,Man United,1,0,0.75,-1,0.8,0.8,0.40625,0.4444444444444444,1.0,1.0,0.5789473684210527
Chelsea,Newcastle,1,0,0.75,1,0.9,0.1,0.65625,0.6666666666666666,1.0,0.9444444444444444,0.1842105263157895
Leicester,Burnley,1,0,0.5,1,0.6,0.8,0.46875,0.40740740740740733,0.9305555555555556,1.0,0.5526315789473684
Stoke,Swansea,1,0,0.5,1,0.4,0.1,0.46875,0.5555555555555556,0.9722222222222222,0.9722222222222222,0.3157894736842105
Watford,Tottenham,1,0,0.0,0,0.4,0.3,0.4140625,0.462962962962963,0.9583333333333334,1.0,0.5526315789473684
West Brom,Crystal Palace,1,0,0.5,0,0.2,0.5,0.5625,0.5555555555555556,1.0,0.9583333333333334,0.4736842105263158
Bournemouth,Southampton,1,0,0.25,0,0.5,0.3,0.4921875,0.462962962962963,0.9722222222222222,0.9444444444444444,0.5789473684210527
Man City,West Ham,1,0,1.0,1,1.0,0.2,0.9140625,0.8518518518518519,1.0,0.9722222222222222,0.02631578947368424
Burnley,Watford,1,0,0.5,1,0.6,0.5,0.5234375,0.537037037037037,1.0,0.9710144927536232,0.4473684210526316
Crystal Palace,Bournemouth,1,0,0.75,0,0.5,0.6,0.3984375,0.4444444444444444,0.9710144927536232,0.9565217391304348,0.6578947368421053
Newcastle,Leicester,1,0,0.0,-1,0.1,0.6,0.4375,0.4259259259259259,0.9565217391304348,0.9420289855072465,0.7105263157894737
Swansea,West Brom,1,0,0.5,1,0.1,0.3,0.4921875,0.4259259259259259,0.9420289855072465,1.0,0.5526315789473684
Tottenham,Stoke,1,0,1.0,1,0.4,0.4,0.671875,0.6111111111111112,1.0,0.9565217391304348,0.2631578947368421
West Ham,Chelsea,1,0,0.0,1,0.1,0.9,0.2265625,0.2407407407407408,1.0,1.0,0.8947368421052632
Liverpool,Everton,1,0,1.0,0,0.9,0.7,0.6796875,0.6481481481481481,1.0,1.0,0.34210526315789475
Man United,Man City,1,0,0.25,-1,0.8,1.0,0.421875,0.40740740740740733,1.0,1.0,0.5263157894736842
Southampton,Arsenal,1,0,0.0,0,0.3,0.6,0.3984375,0.3888888888888889,0.9420289855072465,1.0,0.6578947368421053
Burnley,Stoke,1,0,0.5,1,0.6,0.3,0.6484375,0.6481481481481481,1.0,0.9545454545454546,0.2631578947368421
Crystal Palace,Watford,1,0,0.75,1,0.6,0.5,0.3828125,0.3703703703703704,0.9696969696969696,0.9090909090909092,0.7368421052631579
Liverpool,West Brom,1,0,1.0,0,0.8,0.3,0.6875,0.7037037037037037,1.0,1.0,0.1842105263157895
Man United,Bournemouth,1,0,0.75,1,0.8,0.5,0.7265625,0.7222222222222222,1.0,0.9545454545454546,0.1842105263157895
Newcastle,Everton,1,0,0.0,-1,0.1,0.6,0.5,0.4444444444444444,0.9696969696969696,0.9090909090909092,0.6578947368421053
Southampton,Leicester,1,0,0.75,-1,0.4,0.7,0.46875,0.4444444444444444,0.9242424242424242,0.9242424242424242,0.5789473684210527
Swansea,Man City,1,0,0.0,-1,0.3,1.0,0.140625,0.09259259259259263,0.9848484848484848,1.0,1.0
West Ham,Arsenal,1,0,0.0,0,0.3,0.7,0.28125,0.3148148148148148,1.0,1.0,0.8157894736842105
Arsenal,Newcastle,1,0,1.0,1,0.6,0.1,0.65625,0.6851851851851851,1.0,1.0,0.15789473684210525
Chelsea,Southampton,1,0,1.0,1,0.7,0.4,0.6796875,0.6851851851851851,1.0,0.9206349206349208,0.2631578947368421
Leicester,Crystal Palace,1,0,0.75,-1,0.9,0.7,0.65625,0.6481481481481481,0.9206349206349208,0.9841269841269842,0.34210526315789475
Man City,Tottenham,1,0,0.25,1,1.0,0.6,0.6953125,0.7037037037037037,1.0,1.0,0.34210526315789475
Stoke,West Ham,1,0,0.5,-1,0.2,0.4,0.5078125,0.5185185185185185,1.0,1.0,0.5526315789473684
Bournemouth,Liverpool,1,0,0.75,-1,0.3,0.7,0.3515625,0.2962962962962963,1.0,1.0,0.8157894736842105
West Brom,Man United,1,0,0.25,-1,0.4,0.8,0.21875,0.2407407407407408,0.9682539682539684,1.0,0.9473684210526316
Everton,Swansea,1,0,0.25,1,0.7,0.3,0.5390625,0.6296296296296297,0.9047619047619048,0.9365079365079364,0.21052631578947367
Arsenal,Liverpool,1,0,0.0,0,0.6,0.8,0.4453125,0.462962962962963,1.0,1.0,0.5526315789473684
Burnley,Tottenham,1,0,0.25,-1,0.7,0.5,0.4296875,0.5185185185185185,0.9833333333333332,1.0,0.5526315789473684
Everton,Chelsea,1,0,0.0,0,0.9,0.8,0.3125,0.35185185185185186,0.8666666666666667,1.0,0.6578947368421053
Leicester,Man United,1,0,0.0,0,0.8,0.8,0.296875,0.33333333333333337,0.8833333333333333,1.0,0.6578947368421053
Man City,Bournemouth,1,0,1.0,1,1.0,0.2,0.9140625,0.925925925925926,1.0,1.0,0.05263157894736842
Stoke,West Brom,1,0,0.25,1,0.2,0.3,0.4296875,0.5,1.0,0.9666666666666668,0.368421052631579
Swansea,Crystal Palace,1,0,1.0,0,0.2,0.7,0.484375,0.4259259259259259,0.9333333333333332,0.9833333333333332,0.6052631578947368
West Ham,Newcastle,1,0,0.0,-1,0.5,0.1,0.46875,0.537037037037037,1.0,1.0,0.5526315789473684
Bournemouth,West Ham,1,0,0.5,0,0.2,0.5,0.5234375,0.4814814814814815,0.9824561403508772,1.0,0.5263157894736842
Liverpool,Swansea,1,0,0.5,1,0.7,0.3,0.7578125,0.7962962962962963,1.0,0.9298245614035088,0.07894736842105265
Man United,Burnley,1,0,0.75,0,0.7,0.5,0.703125,0.6111111111111112,1.0,0.9824561403508772,0.368421052631579
Tottenham,Southampton,1,0,1.0,1,0.7,0.3,0.6796875,0.6666666666666666,1.0,0.9649122807017544,0.2631578947368421
Watford,Leicester,1,0,0.5,1,0.1,0.7,0.4375,0.4259259259259259,0.912280701754386,0.8947368421052632,0.5526315789473684
West Brom,Everton,1,0,0.0,0,0.2,0.8,0.4453125,0.3703703703703704,0.9473684210526316,0.8771929824561404,0.763157894736842
Newcastle,Man City,1,0,0.25,-1,0.2,1.0,0.046875,0.05555555555555558,0.9824561403508772,1.0,0.8684210526315791
Crystal Palace,Arsenal,1,0,0.5,-1,0.7,0.5,0.3125,0.3148148148148148,0.9824561403508772,1.0,0.763157894736842
Bournemouth,Everton,1,0,0.0,1,0.2,0.7,0.4453125,0.3703703703703704,1.0,0.8703703703703703,0.631578947368421
Chelsea,Stoke,1,0,1.0,1,0.7,0.3,0.796875,0.7592592592592593,1.0,0.9444444444444444,0.15789473684210525
Liverpool,Leicester,1,0,0.5,1,0.7,0.5,0.6796875,0.6481481481481481,1.0,0.8703703703703703,0.3947368421052632
Man United,Southampton,1,0,0.75,0,0.6,0.2,0.7890625,0.7777777777777778,1.0,0.962962962962963,0.2368421052631579
Watford,Swansea,1,0,1.0,-1,0.2,0.3,0.609375,0.6481481481481481,0.8518518518518519,0.925925925925926,0.2368421052631579
Crystal Palace,Man City,1,0,0.0,0,0.6,1.0,0.0078125,0.037037037037037035,1.0,1.0,0.9210526315789472
West Brom,Arsenal,1,0,0.5,0,0.2,0.7,0.3046875,0.2592592592592593,0.9444444444444444,1.0,0.8684210526315791
Burnley,Liverpool,1,0,0.25,-1,0.5,0.8,0.3203125,0.40740740740740733,1.0,1.0,0.5789473684210527
Everton,Man United,1,0,0.25,-1,0.6,0.7,0.234375,0.2962962962962963,0.8627450980392157,1.0,0.6842105263157895
Stoke,Newcastle,1,0,0.5,-1,0.3,0.3,0.40625,0.5185185185185185,1.0,0.9803921568627452,0.631578947368421
Man City,Watford,1,0,1.0,1,0.9,0.2,0.9375,0.9074074074074074,1.0,0.8627450980392157,0.2631578947368421
Southampton,Crystal Palace,1,0,1.0,-1,0.2,0.6,0.53125,0.5185185185185185,1.0,1.0,0.5789473684210527
Swansea,Tottenham,1,0,0.25,-1,0.3,0.8,0.203125,0.2407407407407408,0.9215686274509804,1.0,0.8947368421052632
West Ham,West Brom,1,0,0.5,1,0.6,0.3,0.4765625,0.5,1.0,0.9215686274509804,0.3947368421052632
Arsenal,Chelsea,1,0,0.25,0,0.7,0.9,0.3984375,0.4259259259259259,1.0,1.0,0.5789473684210527
Tottenham,West Ham,1,0,0.5,0,0.8,0.6,0.78125,0.7222222222222222,1.0,1.0,0.2368421052631579
Chelsea,Leicester,1,0,1.0,0,0.8,0.3,0.6796875,0.6851851851851851,1.0,0.8333333333333334,0.3947368421052632
Crystal Palace,Burnley,1,0,0.0,1,0.6,0.3,0.3984375,0.35185185185185186,0.9583333333333334,0.9166666666666666,0.631578947368421
Newcastle,Swansea,1,0,1.0,0,0.5,0.3,0.5859375,0.5740740740740741,0.9583333333333334,0.9166666666666666,0.368421052631579
Tottenham,Everton,1,0,1.0,1,0.7,0.4,0.734375,0.6666666666666666,1.0,0.8541666666666666,0.3947368421052632
Watford,Southampton,1,0,0.5,0,0.2,0.2,0.515625,0.537037037037037,0.8958333333333334,1.0,0.3157894736842105
Bournemouth,Arsenal,1,0,0.25,1,0.4,0.7,0.3125,0.2777777777777778,0.9791666666666666,1.0,0.6842105263157895
Liverpool,Man City,1,0,0.25,1,0.9,0.9,0.296875,0.3148148148148148,1.0,1.0,0.5526315789473684
Man United,Stoke,1,0,0.5,1,0.7,0.3,0.9140625,0.8333333333333333,1.0,1.0,0.07894736842105265
Arsenal,Crystal Palace,1,0,0.5,1,0.5,0.6,0.6796875,0.6666666666666666,1.0,0.8888888888888888,0.3157894736842105
Burnley,Man United,1,0,0.25,-1,0.2,0.7,0.2421875,0.3148148148148148,0.8888888888888888,1.0,0.6578947368421053
Everton,West Brom,1,0,0.75,0,0.2,0.4,0.4921875,0.5740740740740741,0.8444444444444444,0.9777777777777776,0.2368421052631579
Leicester,Watford,1,0,0.5,1,0.4,0.3,0.5859375,0.5740740740740741,0.8222222222222222,0.8666666666666667,0.42105263157894735
Man City,Newcastle,1,0,0.75,1,0.7,0.6,0.96875,0.962962962962963,1.0,0.9333333333333332,0.13157894736842107
West Ham,Bournemouth,1,0,0.25,0,0.6,0.6,0.4921875,0.5185185185185185,0.8888888888888888,0.9111111111111112,0.4736842105263158
Southampton,Tottenham,1,0,0.0,0,0.3,0.9,0.21875,0.2407407407407408,1.0,1.0,0.8421052631578947
Swansea,Liverpool,1,0,0.5,1,0.4,0.9,0.1328125,0.1111111111111111,0.9333333333333332,1.0,0.9210526315789472
Swansea,Arsenal,1,0,0.0,1,0.5,0.6,0.234375,0.2222222222222222,0.9047619047619048,1.0,0.8421052631578947
West Ham,Crystal Palace,1,0,0.75,0,0.7,0.5,0.5234375,0.5185185185185185,0.9523809523809524,0.9761904761904762,0.4736842105263158
Chelsea,Bournemouth,1,0,1.0,-1,0.8,0.7,0.8125,0.7962962962962963,1.0,0.9761904761904762,0.34210526315789475
Everton,Leicester,1,0,0.5,1,0.2,0.5,0.3671875,0.4259259259259259,0.9047619047619048,0.8095238095238095,0.5263157894736842
Man City,West Brom,1,0,1.0,1,0.7,0.5,1.0,1.0,1.0,0.9047619047619048,0.0
Newcastle,Burnley,1,0,0.25,0,0.4,0.2,0.421875,0.35185185185185186,1.0,0.8095238095238095,0.6842105263157895
Stoke,Watford,1,0,1.0,0,0.3,0.3,0.390625,0.462962962962963,1.0,0.9523809523809524,0.631578947368421
Tottenham,Man United,1,0,0.5,1,0.8,0.8,0.4375,0.40740740740740733,1.0,1.0,0.5789473684210527
Arsenal,Everton,1,0,1.0,1,0.4,0.3,0.6875,0.6296296296296297,1.0,0.8205128205128205,0.3947368421052632
Bournemouth,Stoke,1,0,0.75,1,0.8,0.3,0.6328125,0.5555555555555556,0.8974358974358975,1.0,0.2631578947368421
Burnley,Man City,1,0,0.0,0,0.2,0.7,0.0546875,0.12962962962962965,0.8205128205128205,1.0,0.6578947368421053
Leicester,Swansea,1,0,0.5,0,0.5,0.7,0.6640625,0.6481481481481481,0.7948717948717949,1.0,0.2631578947368421
West Brom,Southampton,1,0,0.0,-1,0.4,0.4,0.46875,0.462962962962963,0.9230769230769232,1.0,0.631578947368421
Crystal Palace,Newcastle,1,0,0.0,0,0.6,0.5,0.4765625,0.537037037037037,0.9230769230769232,0.9743589743589745,0.4473684210526316
Liverpool,Tottenham,1,0,0.5,0,0.8,0.8,0.5078125,0.537037037037037,1.0,1.0,0.4473684210526316
Watford,Chelsea,1,0,0.0,1,0.2,0.6,0.2109375,0.2222222222222222,0.8974358974358975,1.0,0.6842105263157895
Everton,Crystal Palace,1,0,0.75,1,0.3,0.6,0.4921875,0.537037037037037,0.7777777777777778,0.8888888888888888,0.34210526315789475
Man City,Leicester,1,0,1.0,1,0.7,0.6,0.90625,0.8888888888888888,1.0,0.8055555555555556,0.3157894736842105
Swansea,Burnley,1,0,0.5,1,0.6,0.2,0.375,0.33333333333333337,0.9722222222222222,0.8333333333333334,0.7368421052631579
Tottenham,Arsenal,1,0,0.5,1,0.7,0.5,0.5859375,0.5555555555555556,1.0,1.0,0.4736842105263158
West Ham,Watford,1,0,0.25,1,0.5,0.4,0.453125,0.4814814814814815,0.8888888888888888,0.8055555555555556,0.5263157894736842
Newcastle,Man United,1,0,0.25,1,0.5,0.8,0.1484375,0.12962962962962965,0.9722222222222222,1.0,0.7894736842105263
Southampton,Liverpool,1,0,0.25,-1,0.5,0.7,0.203125,0.20370370370370366,1.0,1.0,0.8947368421052632
Chelsea,West Brom,1,0,1.0,1,0.4,0.3,0.8046875,0.8333333333333333,1.0,0.8888888888888888,0.07894736842105265
Bournemouth,Newcastle,1,0,1.0,0,0.7,0.5,0.5078125,0.537037037037037,0.7878787878787878,0.8787878787878788,0.3947368421052632
Burnley,Southampton,1,0,1.0,0,0.2,0.5,0.5703125,0.6111111111111112,0.7272727272727273,0.9393939393939394,0.2631578947368421
Leicester,Stoke,1,0,0.75,0,0.4,0.4,0.6953125,0.6296296296296297,0.696969696969697,1.0,0.21052631578947367
Liverpool,West Ham,1,0,1.0,1,0.7,0.6,0.828125,0.7962962962962963,1.0,0.8181818181818181,0.2368421052631579
Watford,Everton,1,0,0.0,1,0.4,0.5,0.53125,0.4444444444444444,0.8181818181818181,0.696969696969697,0.5263157894736842
Crystal Palace,Tottenham,1,0,0.0,-1,0.4,0.8,0.1484375,0.20370370370370366,1.0,1.0,0.8421052631578947
Man United,Chelsea,1,0,0.5,1,0.6,0.5,0.546875,0.537037037037037,1.0,1.0,0.42105263157894735
Arsenal,Man City,1,0,0.25,-1,0.4,0.7,0.15625,0.1851851851851852,1.0,1.0,0.631578947368421
