name1,name2,motivation1,motivation2,diff_position
Arsenal,Aston Villa,1,1,0.7894736842105263
Liverpool,Stoke,1,1,0.34210526315789475
Norwich,Everton,1,1,0.5263157894736842
Sunderland,Fulham,1,1,0.7105263157894737
Swansea,Man United,1,1,0.9210526315789473
West Brom,Southampton,1,1,0.6842105263157895
West Ham,Cardiff,1,1,0.15789473684210525
Chelsea,Hull,1,1,0.05263157894736842
Crystal Palace,Tottenham,1,1,0.5789473684210527
Man City,Newcastle,1,1,0.026315789473684237
Chelsea,Aston Villa,1,1,0.39473684210526316
Aston Villa,Liverpool,1,1,0.6842105263157895
Everton,West Brom,1,1,0.42105263157894735
Fulham,Arsenal,1,1,0.6052631578947368
Hull,Norwich,1,1,0.4473684210526316
Newcastle,West Ham,1,1,0.5789473684210527
Southampton,Sunderland,1,1,0.2368421052631579
Stoke,Crystal Palace,1,1,0.26315789473684215
Cardiff,Man City,1,1,0.6052631578947368
Tottenham,Swansea,1,1,0.05263157894736842
Man United,Chelsea,1,1,0.5789473684210527
Cardiff,Everton,1,0.9907407407407407,0.39473684210526316
Crystal Palace,Sunderland,1,1,0.368421052631579
Man City,Hull,1,1,0.10526315789473684
Newcastle,Fulham,1,1,0.368421052631579
Norwich,Southampton,1,1,0.4736842105263158
West Ham,Stoke,1,1,0.5789473684210527
Arsenal,Tottenham,1,1,0.4473684210526316
Liverpool,Man United,1,0.9907407407407407,0.34210526315789475
West Brom,Swansea,0.9814814814814815,1,0.6052631578947368
Aston Villa,Newcastle,1,0.9904761904761905,0.7368421052631579
Everton,Chelsea,1,1,0.5789473684210527
Fulham,West Brom,1,0.9809523809523809,0.368421052631579
Hull,Cardiff,1,0.9904761904761905,0.6052631578947368
Man United,Crystal Palace,1,1,0.15789473684210525
Stoke,Man City,0.9904761904761905,1,0.5789473684210527
Sunderland,Arsenal,0.9809523809523809,1,0.9736842105263157
Tottenham,Norwich,1,0.9904761904761905,0.1842105263157895
Southampton,West Ham,0.9904761904761905,0.9904761904761905,0.5263157894736842
Swansea,Liverpool,1,1,0.8157894736842105
Chelsea,Fulham,1,1,0.13157894736842107
Liverpool,Southampton,1,0.9803921568627451,0.4473684210526316
Newcastle,Hull,1,0.9901960784313726,0.5263157894736842
Norwich,Aston Villa,1,1,0.6052631578947368
West Brom,Sunderland,1,0.9705882352941176,0.34210526315789475
West Ham,Everton,0.9901960784313726,1,0.7368421052631579
Arsenal,Stoke,1,1,0.26315789473684215
Cardiff,Tottenham,0.9901960784313726,1,0.868421052631579
Crystal Palace,Swansea,0.9901960784313726,1,0.763157894736842
Man City,Man United,1,1,0.368421052631579
Aston Villa,Man City,1,1,0.5526315789473684
Fulham,Cardiff,1,0.98989898989899,0.6842105263157895
Hull,West Ham,1,1,0.26315789473684215
Man United,West Brom,1,1,0.5526315789473684
Southampton,Crystal Palace,1,0.9797979797979798,0.15789473684210525
Swansea,Arsenal,0.98989898989899,1,0.8157894736842105
Tottenham,Chelsea,1,1,0.4473684210526316
Stoke,Norwich,0.98989898989899,1,0.5263157894736842
Sunderland,Liverpool,0.9595959595959596,1,0.9736842105263157
Everton,Newcastle,1,0.98989898989899,0.1842105263157895
Cardiff,Newcastle,1,0.9895833333333334,0.5789473684210527
Fulham,Stoke,1,0.9895833333333334,0.5526315789473684
Hull,Aston Villa,1,1,0.4473684210526316
Liverpool,Crystal Palace,1,0.9895833333333334,0.05263157894736842
Man City,Everton,1,1,0.4473684210526316
Sunderland,Man United,0.96875,0.9895833333333334,0.7894736842105263
Norwich,Chelsea,1,1,0.8947368421052632
Southampton,Swansea,1,0.9895833333333334,0.21052631578947367
Tottenham,West Ham,1,1,0.3157894736842105
West Brom,Arsenal,0.9583333333333334,1,0.763157894736842
Arsenal,Norwich,1,1,0.05263157894736842
Chelsea,Cardiff,1,1,0.10526315789473684
Everton,Hull,0.989247311827957,0.978494623655914,0.4473684210526316
Man United,Southampton,0.978494623655914,1,0.5526315789473684
Newcastle,Liverpool,0.978494623655914,1,0.6842105263157895
Stoke,West Brom,1,0.989247311827957,0.6052631578947368
Swansea,Sunderland,1,0.9247311827956989,0.26315789473684215
West Ham,Man City,1,1,0.7894736842105263
Aston Villa,Tottenham,0.978494623655914,1,0.7105263157894737
Crystal Palace,Fulham,0.946236559139785,1,0.631578947368421
Aston Villa,Everton,0.9777777777777777,1,0.6842105263157895
Crystal Palace,Arsenal,0.9444444444444444,1,1.0
Liverpool,West Brom,1,0.9777777777777777,0.26315789473684215
Man United,Stoke,0.9666666666666667,1,0.26315789473684215
Norwich,Cardiff,0.9888888888888889,1,0.5526315789473684
Southampton,Fulham,1,0.9777777777777777,0.21052631578947367
Chelsea,Man City,1,1,0.368421052631579
Sunderland,Newcastle,1,1,0.7105263157894737
Swansea,West Ham,0.9777777777777777,1,0.34210526315789475
Tottenham,Hull,1,0.9666666666666667,0.34210526315789475
Arsenal,Liverpool,1,1,0.4473684210526316
Fulham,Man United,1,0.9885057471264368,0.763157894736842
Hull,Sunderland,0.9655172413793104,0.9540229885057472,0.26315789473684215
Man City,Norwich,1,1,0.15789473684210525
Newcastle,Chelsea,0.9655172413793104,1,0.6842105263157895
Stoke,Southampton,1,1,0.7894736842105263
West Brom,Crystal Palace,0.9770114942528736,0.9425287356321839,0.26315789473684215
West Ham,Aston Villa,0.9885057471264368,0.9770114942528736,0.5263157894736842
Cardiff,Swansea,0.9885057471264368,0.9655172413793104,0.4736842105263158
Everton,Tottenham,1,1,0.5789473684210527
Aston Villa,Cardiff,0.9642857142857143,0.9523809523809523,0.42105263157894735
Chelsea,West Brom,1,0.9404761904761905,0.34210526315789475
Crystal Palace,Everton,0.9404761904761905,1,0.868421052631579
Liverpool,Fulham,1,1,0.07894736842105265
Norwich,West Ham,1,0.9761904761904762,0.4736842105263158
Southampton,Hull,1,0.9404761904761905,0.26315789473684215
Man United,Arsenal,1,1,0.6052631578947368
Sunderland,Man City,0.9523809523809523,1,0.7894736842105263
Swansea,Stoke,0.9761904761904762,1,0.39473684210526316
Tottenham,Newcastle,1,0.9404761904761905,0.4473684210526316
Arsenal,Southampton,1,1,0.39473684210526316
Everton,Liverpool,1,1,0.631578947368421
Fulham,Swansea,1,0.962962962962963,0.7105263157894737
Hull,Crystal Palace,0.9382716049382716,0.9382716049382716,0.34210526315789475
Newcastle,Norwich,0.9753086419753086,0.9753086419753086,0.2894736842105263
Stoke,Sunderland,0.9876543209876543,0.9753086419753086,0.34210526315789475
West Ham,Chelsea,1,1,0.868421052631579
Cardiff,Man United,0.9753086419753086,1,0.7368421052631579
Man City,Tottenham,1,1,0.368421052631579
West Brom,Aston Villa,0.9506172839506173,0.9506172839506173,0.4736842105263158
Aston Villa,Sunderland,0.9358974358974359,0.9615384615384616,0.2894736842105263
Cardiff,Arsenal,1,1,0.9210526315789473
Everton,Stoke,1,1,0.21052631578947367
Newcastle,West Brom,1,0.9743589743589743,0.34210526315789475
Norwich,Crystal Palace,1,1,0.6052631578947368
West Ham,Fulham,1,1,0.42105263157894735
Chelsea,Southampton,1,1,0.368421052631579
Hull,Liverpool,0.9871794871794872,1,0.6578947368421053
Man City,Swansea,1,0.9743589743589743,0.2368421052631579
Tottenham,Man United,1,1,0.5263157894736842
Crystal Palace,West Ham,0.92,1,0.5526315789473684
Arsenal,Hull,1,0.96,0.21052631578947367
Fulham,Tottenham,1,1,0.8157894736842105
Liverpool,Norwich,1,0.9866666666666667,0.1842105263157895
Man United,Everton,1,1,0.6052631578947368
Southampton,Aston Villa,1,0.96,0.4473684210526316
Stoke,Cardiff,1,1,0.4736842105263158
Sunderland,Chelsea,0.9333333333333333,1,0.9736842105263157
Swansea,Newcastle,0.9733333333333334,1,0.6052631578947368
West Brom,Man City,0.9733333333333334,1,0.763157894736842
Crystal Palace,Cardiff,0.9583333333333334,0.9861111111111112,0.5789473684210527
Liverpool,West Ham,1,1,0.10526315789473684
Man United,Newcastle,1,1,0.5526315789473684
Southampton,Man City,1,1,0.6052631578947368
Stoke,Chelsea,0.9861111111111112,1,0.763157894736842
Sunderland,Tottenham,0.9305555555555556,1,0.868421052631579
West Brom,Norwich,0.9722222222222222,0.9861111111111112,0.5263157894736842
Arsenal,Everton,1,1,0.39473684210526316
Fulham,Aston Villa,0.9583333333333334,0.9305555555555556,0.6842105263157895
Swansea,Hull,0.9305555555555556,0.9444444444444444,0.4473684210526316
Cardiff,West Brom,0.9855072463768116,0.9710144927536232,0.4736842105263158
Chelsea,Crystal Palace,1,1,0.10526315789473684
Everton,Fulham,1,1,0.13157894736842107
Hull,Stoke,0.927536231884058,0.9420289855072463,0.4736842105263158
Man City,Arsenal,1,1,0.5789473684210527
Newcastle,Southampton,1,0.9565217391304348,0.42105263157894735
West Ham,Sunderland,1,0.927536231884058,0.42105263157894735
Aston Villa,Man United,0.9130434782608696,0.9420289855072463,0.5789473684210527
Norwich,Swansea,0.9420289855072463,0.9130434782608696,0.6052631578947368
Tottenham,Liverpool,1,1,0.631578947368421
Crystal Palace,Newcastle,1,1,0.8157894736842105
Fulham,Man City,1,1,0.9210526315789473
Liverpool,Cardiff,1,0.9393939393939394,0.13157894736842107
Man United,West Ham,0.9696969696969697,1,0.26315789473684215
Stoke,Aston Villa,0.9393939393939394,0.9242424242424242,0.42105263157894735
Sunderland,Norwich,0.9242424242424242,0.9393939393939394,0.6578947368421053
West Brom,Hull,0.9848484848484849,0.9242424242424242,0.6052631578947368
Southampton,Tottenham,0.9545454545454546,1,0.5526315789473684
Swansea,Everton,0.9090909090909091,1,0.6578947368421053
Arsenal,Chelsea,1,1,0.4473684210526316
Aston Villa,Crystal Palace,0.9047619047619048,1,0.39473684210526316
Cardiff,Southampton,0.9365079365079365,0.9523809523809523,0.6842105263157895
Chelsea,Swansea,1,0.8888888888888888,0.2894736842105263
Everton,Sunderland,1,0.9523809523809523,0.10526315789473684
Hull,Man United,0.8888888888888888,1,0.631578947368421
Man City,Liverpool,1,1,0.4473684210526316
Newcastle,Stoke,1,0.873015873015873,0.39473684210526316
Norwich,Fulham,0.9047619047619048,1,0.39473684210526316
Tottenham,West Brom,1,0.9523809523809523,0.3157894736842105
West Ham,Arsenal,1,1,0.9736842105263157
Aston Villa,Swansea,0.9,0.8833333333333333,0.5526315789473684
Cardiff,Sunderland,0.9333333333333333,1,0.39473684210526316
Hull,Fulham,0.8833333333333333,1,0.2894736842105263
Man City,Crystal Palace,1,1,0.10526315789473684
Norwich,Man United,0.95,1,0.7105263157894737
West Ham,West Brom,0.9666666666666667,0.9833333333333333,0.6052631578947368
Chelsea,Liverpool,1,1,0.4473684210526316
Everton,Southampton,1,0.9333333333333333,0.368421052631579
Newcastle,Arsenal,1,1,0.6842105263157895
Tottenham,Stoke,1,0.9166666666666666,0.368421052631579
Arsenal,Cardiff,1,1,0.07894736842105265
Crystal Palace,Norwich,0.9649122807017544,0.9824561403508771,0.5789473684210527
Fulham,West Ham,1,1,0.42105263157894735
Liverpool,Hull,1,0.9122807017543859,0.34210526315789475
Man United,Tottenham,1,1,0.5263157894736842
Southampton,Chelsea,0.8771929824561404,1,0.6578947368421053
Stoke,Everton,0.9473684210526316,1,0.6842105263157895
Sunderland,Aston Villa,0.9298245614035088,0.9649122807017544,0.7368421052631579
Swansea,Man City,0.9473684210526316,1,0.7894736842105263
West Brom,Newcastle,1,0.9824561403508771,0.6578947368421053
Cardiff,West Ham,1,1,0.5263157894736842
Everton,Norwich,1,0.9074074074074074,0.2368421052631579
Fulham,Sunderland,0.9259259259259259,0.9814814814814815,0.42105263157894735
Hull,Chelsea,0.8518518518518519,1,0.6842105263157895
Man United,Swansea,1,0.8888888888888888,0.34210526315789475
Southampton,West Brom,0.8703703703703703,0.8888888888888888,0.368421052631579
Tottenham,Crystal Palace,1,1,0.13157894736842107
Newcastle,Man City,0.9259259259259259,1,0.6578947368421053
Stoke,Liverpool,0.8703703703703703,1,0.7105263157894737
Aston Villa,Arsenal,0.8518518518518519,1,0.763157894736842
Arsenal,Fulham,1,1,0.07894736842105265
Crystal Palace,Stoke,1,0.9411764705882353,0.5526315789473684
Liverpool,Aston Villa,1,0.9215686274509804,0.34210526315789475
Man City,Cardiff,1,0.9803921568627451,0.026315789473684237
Norwich,Hull,0.9803921568627451,0.9215686274509804,0.5789473684210527
Sunderland,Southampton,0.9607843137254902,0.8627450980392157,0.763157894736842
West Ham,Newcastle,0.9803921568627451,0.9215686274509804,0.763157894736842
Chelsea,Man United,1,1,0.39473684210526316
Swansea,Tottenham,0.9607843137254902,1,0.763157894736842
West Brom,Everton,0.9607843137254902,1,0.6842105263157895
Crystal Palace,Hull,0.9791666666666666,0.9166666666666666,0.5263157894736842
Liverpool,Everton,1,1,0.4473684210526316
Man United,Cardiff,0.8958333333333334,0.9791666666666666,0.15789473684210525
Norwich,Newcastle,0.9166666666666666,0.875,0.6578947368421053
Southampton,Arsenal,0.7708333333333334,1,0.6842105263157895
Swansea,Fulham,0.9583333333333334,1,0.2894736842105263
Aston Villa,West Brom,0.8958333333333334,0.9375,0.368421052631579
Chelsea,West Ham,1,1,0.10526315789473684
Sunderland,Stoke,1,0.9166666666666666,0.5263157894736842
Tottenham,Man City,1,1,0.6052631578947368
Cardiff,Norwich,1,0.8666666666666667,0.6052631578947368
Everton,Aston Villa,1,0.8,0.368421052631579
Fulham,Southampton,1,0.7777777777777778,0.7894736842105263
Hull,Tottenham,0.8888888888888888,1,0.6842105263157895
Newcastle,Sunderland,1,1,0.34210526315789475
Stoke,Man United,0.9111111111111111,0.9333333333333333,0.6052631578947368
West Ham,Swansea,1,0.8666666666666667,0.6578947368421053
Arsenal,Crystal Palace,1,1,0.07894736842105265
West Brom,Liverpool,1,1,0.8157894736842105
Man City,Chelsea,1,1,0.4736842105263158
Aston Villa,West Ham,0.9047619047619048,1,0.42105263157894735
Chelsea,Newcastle,1,0.8571428571428572,0.3157894736842105
Crystal Palace,West Brom,1,1,0.39473684210526316
Liverpool,Arsenal,1,1,0.5526315789473684
Norwich,Man City,0.9761904761904762,1,0.8421052631578947
Southampton,Stoke,0.8095238095238095,0.9523809523809523,0.39473684210526316
Sunderland,Hull,1,1,0.6578947368421053
Swansea,Cardiff,1,0.9285714285714286,0.26315789473684215
Man United,Fulham,0.9285714285714286,0.8809523809523809,0.15789473684210525
Tottenham,Everton,1,1,0.4736842105263158
Cardiff,Aston Villa,0.9230769230769231,0.9230769230769231,0.6842105263157895
Hull,Southampton,0.9230769230769231,0.7692307692307692,0.631578947368421
West Brom,Chelsea,1,1,0.9210526315789473
West Ham,Norwich,0.9487179487179487,0.9487179487179487,0.368421052631579
Arsenal,Man United,1,0.8974358974358975,0.368421052631579
Fulham,Liverpool,0.9230769230769231,1,0.9210526315789473
Newcastle,Tottenham,0.7948717948717949,1,0.6052631578947368
Stoke,Swansea,0.9230769230769231,0.8974358974358975,0.6052631578947368
Arsenal,Sunderland,1,1,0.07894736842105265
Cardiff,Hull,0.9722222222222222,0.8888888888888888,0.7105263157894737
Chelsea,Everton,1,1,0.34210526315789475
Crystal Palace,Man United,0.9230769230769231,1,0.763157894736842
Man City,Stoke,1,0.8888888888888888,0.1842105263157895
West Brom,Fulham,1,0.8888888888888888,0.42105263157894735
West Ham,Southampton,0.8888888888888888,0.9166666666666666,0.5263157894736842
Liverpool,Swansea,1,0.8888888888888888,0.2894736842105263
Newcastle,Aston Villa,0.8611111111111112,0.8888888888888888,0.368421052631579
Norwich,Tottenham,0.9722222222222222,1,0.7368421052631579
Everton,West Ham,1,0.7878787878787878,0.4473684210526316
Fulham,Chelsea,1,1,1.0
Hull,Newcastle,0.8181818181818181,0.9393939393939394,0.6052631578947368
Southampton,Liverpool,0.9090909090909091,1,0.6842105263157895
Stoke,Arsenal,0.9090909090909091,1,0.763157894736842
Aston Villa,Norwich,0.8787878787878788,0.8787878787878788,0.39473684210526316
Swansea,Crystal Palace,0.8787878787878788,0.9444444444444444,0.4473684210526316
Tottenham,Cardiff,1,0.9393939393939394,0.13157894736842107
Cardiff,Fulham,0.9333333333333333,0.9,0.4473684210526316
Chelsea,Tottenham,1,1,0.39473684210526316
Crystal Palace,Southampton,0.9090909090909091,0.9,0.6842105263157895
Norwich,Stoke,0.8666666666666667,0.8,0.5789473684210527
West Brom,Man United,1,1,0.7894736842105263
Aston Villa,Chelsea,0.8,1,0.7368421052631579
Everton,Cardiff,1,1,0.21052631578947367
Fulham,Newcastle,0.8518518518518519,0.9333333333333333,0.7894736842105263
Hull,Man City,0.8333333333333334,1,0.7368421052631579
Southampton,Norwich,0.8888888888888888,0.8518518518518519,0.3157894736842105
Stoke,West Ham,0.7777777777777778,0.8,0.4736842105263158
Sunderland,Crystal Palace,0.9166666666666666,1,0.5263157894736842
Swansea,West Brom,0.9333333333333333,1,0.4473684210526316
Man United,Liverpool,1,1,0.631578947368421
Tottenham,Arsenal,1,1,0.5526315789473684
Cardiff,Liverpool,0.9166666666666666,1,0.9473684210526316
Chelsea,Arsenal,1,1,0.42105263157894735
Everton,Swansea,1,0.9259259259259259,0.3157894736842105
Hull,West Brom,0.8888888888888888,0.962962962962963,0.39473684210526316
Man City,Fulham,1,0.875,0.05263157894736842
Newcastle,Crystal Palace,0.9259259259259259,1,0.26315789473684215
Norwich,Sunderland,0.9583333333333334,0.9090909090909091,0.368421052631579
West Ham,Man United,0.8888888888888888,1,0.6842105263157895
Aston Villa,Stoke,0.7777777777777778,0.75,0.5263157894736842
Tottenham,Southampton,1,1,0.39473684210526316
Arsenal,Swansea,1,0.9583333333333334,0.21052631578947367
Man United,Man City,1,1,0.6052631578947368
Newcastle,Everton,1,1,0.5789473684210527
Liverpool,Sunderland,1,0.9,0.07894736842105265
West Ham,Hull,0.875,0.7916666666666666,0.4473684210526316
Arsenal,Man City,1,1,0.5263157894736842
Crystal Palace,Chelsea,1,1,0.868421052631579
Man United,Aston Villa,1,0.75,0.368421052631579
Southampton,Newcastle,1,1,0.4736842105263158
Stoke,Hull,0.6190476190476191,0.7619047619047619,0.39473684210526316
Swansea,Norwich,0.9047619047619048,0.8095238095238095,0.4473684210526316
West Brom,Cardiff,1,0.8571428571428572,0.4736842105263158
Fulham,Everton,0.8095238095238095,1,0.8947368421052632
Liverpool,Tottenham,1,1,0.368421052631579
Sunderland,West Ham,0.8888888888888888,0.7142857142857143,0.7105263157894737
Aston Villa,Fulham,0.7142857142857143,0.7777777777777778,0.368421052631579
Cardiff,Crystal Palace,0.8888888888888888,0.8571428571428572,0.631578947368421
Chelsea,Stoke,1,0.33333333333333337,0.2894736842105263
Hull,Swansea,0.7222222222222222,0.7222222222222222,0.42105263157894735
Man City,Southampton,1,0.5555555555555556,0.368421052631579
Newcastle,Man United,0.4444444444444444,0.8888888888888888,0.5526315789473684
Norwich,West Brom,1,1,0.5263157894736842
Everton,Arsenal,1,1,0.5263157894736842
West Ham,Liverpool,0.7222222222222222,1,0.763157894736842
Tottenham,Sunderland,1,0.7083333333333333,0.13157894736842107
Crystal Palace,Aston Villa,0.8888888888888888,0.8888888888888888,0.4473684210526316
Fulham,Norwich,0.6666666666666667,1,0.5263157894736842
Southampton,Cardiff,0.4666666666666667,0.6,0.21052631578947367
Stoke,Newcastle,0.4666666666666667,0.33333333333333337,0.5263157894736842
Sunderland,Everton,0.6666666666666667,1,0.9210526315789473
West Brom,Tottenham,1,1,0.763157894736842
Liverpool,Man City,1,1,0.4473684210526316
Swansea,Chelsea,0.9333333333333333,1,0.8421052631578947
Arsenal,West Ham,1,1,0.2894736842105263
Everton,Crystal Palace,1,0.6666666666666667,0.34210526315789475
Man City,Sunderland,1,0.6111111111111112,0.05263157894736842
Aston Villa,Southampton,0.8666666666666667,0.08333333333333337,0.6842105263157895
Cardiff,Stoke,0.75,0.08333333333333337,0.7105263157894737
Chelsea,Sunderland,1,0.6,0.026315789473684237
Newcastle,Swansea,0,0.9166666666666666,0.39473684210526316
Tottenham,Fulham,1,1,0.15789473684210525
West Ham,Crystal Palace,0.5833333333333333,0.33333333333333337,0.5263157894736842
Everton,Man United,1,0.8,0.4473684210526316
Hull,Arsenal,0.7333333333333334,1,0.763157894736842
Norwich,Liverpool,1,1,0.9210526315789473
Man City,West Brom,1,0.9333333333333333,0.15789473684210525
Fulham,Hull,0.7777777777777778,0.6666666666666667,0.6578947368421053
Man United,Norwich,0.75,1,0.21052631578947367
Southampton,Everton,0,1,0.5789473684210527
Stoke,Tottenham,0,1,0.6052631578947368
Swansea,Aston Villa,0.5555555555555556,0.75,0.39473684210526316
West Brom,West Ham,0.9166666666666666,0.4444444444444444,0.5263157894736842
Crystal Palace,Man City,0,1,0.7105263157894737
Liverpool,Chelsea,1,1,0.4736842105263158
Sunderland,Cardiff,1,1,0.42105263157894735
Arsenal,Newcastle,1,0,0.368421052631579
Aston Villa,Hull,0.33333333333333337,0.11111111111111116,0.4736842105263158
Everton,Man City,1,1,0.5789473684210527
Man United,Sunderland,0.6666666666666667,0.6666666666666667,0.3157894736842105
Newcastle,Cardiff,0,1,0.21052631578947367
Stoke,Fulham,0,1,0.26315789473684215
Swansea,Southampton,0,0,0.631578947368421
West Ham,Tottenham,1,1,0.6578947368421053
Arsenal,West Brom,1,1,0.15789473684210525
Chelsea,Norwich,1,0.33333333333333337,0.10526315789473684
Crystal Palace,Liverpool,0,1,0.7368421052631579
Man United,Hull,0.0,0.8333333333333334,0.26315789473684215
Man City,Aston Villa,1,0.6666666666666667,0.13157894736842107
Sunderland,West Brom,1,1,0.42105263157894735
Cardiff,Chelsea,0,1,0.9473684210526316
Fulham,Crystal Palace,0,0,0.7105263157894737
Hull,Everton,0.6666666666666667,1,0.7894736842105263
Liverpool,Newcastle,1,0,0.2894736842105263
Man City,West Ham,1,0,0.1842105263157895
Norwich,Arsenal,0.0,1,0.868421052631579
Southampton,Man United,0,0.0,0.5263157894736842
Sunderland,Swansea,0.33333333333333337,0.0,0.5526315789473684
Tottenham,Aston Villa,1,0.33333333333333337,0.26315789473684215
West Brom,Stoke,1,0,0.7105263157894737
