name1,name2,home,away,history,result,form1,form2,goal_diff,score_diff,motivation1,motivation2,diff_position
Arsenal,West Brom,1,0,1.0,-1,0.8,0.5,0.6166666666666667,0.5576923076923077,1.0,1.0,0.42105263157894735
Birmingham,Wigan,1,0,1.0,0,0.5,0.3,0.5833333333333334,0.5384615384615384,0.98989898989899,1.0,0.368421052631579
Fulham,Everton,1,0,0.5,0,0.6,0.2,0.5333333333333333,0.5769230769230769,1.0,0.98989898989899,0.15789473684210525
Liverpool,Sunderland,1,0,0.5,0,0.4,0.5,0.475,0.4807692307692308,0.9797979797979798,0.98989898989899,0.631578947368421
Man City,Chelsea,1,0,1.0,1,0.6,1.0,0.3666666666666667,0.4230769230769231,1.0,1.0,0.5789473684210527
West Ham,Tottenham,1,0,0.0,1,0.1,0.6,0.4,0.40384615384615385,1.0,1.0,0.7894736842105263
Bolton,Man United,1,0,0.0,0,0.5,0.8,0.43333333333333335,0.4423076923076923,0.98989898989899,1.0,0.763157894736842
Newcastle,Stoke,1,0,0.5,-1,0.5,0.3,0.5416666666666666,0.5384615384615384,1.0,0.98989898989899,0.3947368421052632
Wolves,Aston Villa,1,0,0.5,-1,0.4,0.5,0.5083333333333333,0.4807692307692308,1.0,1.0,0.8157894736842105
Birmingham,Everton,1,0,0.5,-1,0.5,0.3,0.5166666666666667,0.5576923076923077,1.0,1.0,0.4736842105263158
Stoke,Blackburn,1,0,0.75,1,0.5,0.4,0.4833333333333333,0.4807692307692308,1.0,1.0,0.34210526315789475
Sunderland,Man United,1,0,0.25,0,0.5,0.7,0.44166666666666665,0.4423076923076923,1.0,1.0,0.7105263157894737
Tottenham,Aston Villa,1,0,0.5,1,0.5,0.5,0.525,0.4807692307692308,1.0,1.0,0.42105263157894735
West Brom,Bolton,1,0,0.5,0,0.7,0.5,0.4833333333333333,0.5192307692307693,1.0,0.96875,0.34210526315789475
West Ham,Fulham,1,0,0.25,0,0.3,0.6,0.4166666666666667,0.4230769230769231,1.0,1.0,0.763157894736842
Wigan,Wolves,1,0,0.5,1,0.4,0.2,0.43333333333333335,0.5,0.9791666666666666,1.0,0.368421052631579
Chelsea,Arsenal,1,0,1.0,1,0.8,0.7,0.5833333333333334,0.5384615384615384,1.0,1.0,0.42105263157894735
Man City,Newcastle,1,0,0.75,1,0.7,0.5,0.5333333333333333,0.5576923076923077,1.0,0.96875,0.15789473684210525
Arsenal,Birmingham,1,0,0.75,1,0.5,0.3,0.5833333333333334,0.5384615384615384,1.0,1.0,0.13157894736842107
Aston Villa,Chelsea,1,0,0.5,0,0.5,0.8,0.3,0.40384615384615385,1.0,1.0,0.6842105263157895
Bolton,Stoke,1,0,0.75,1,0.4,0.7,0.5,0.5,0.989247311827957,1.0,0.4473684210526316
Fulham,Tottenham,1,0,0.25,-1,0.6,0.5,0.4916666666666666,0.5,1.0,1.0,0.6842105263157895
Man United,West Brom,1,0,1.0,0,0.7,0.6,0.5833333333333334,0.5384615384615384,1.0,1.0,0.4473684210526316
Newcastle,Wigan,1,0,0.25,0,0.3,0.6,0.575,0.4807692307692308,1.0,0.989247311827957,0.5263157894736842
Wolves,West Ham,1,0,0.5,0,0.1,0.4,0.5333333333333333,0.5,0.9784946236559141,0.9784946236559141,0.4473684210526316
Everton,Liverpool,1,0,0.0,1,0.4,0.4,0.525,0.5,1.0,1.0,0.2894736842105263
Blackburn,Sunderland,1,0,0.25,0,0.4,0.6,0.4916666666666666,0.4807692307692308,0.989247311827957,0.989247311827957,0.5263157894736842
Chelsea,Wolves,1,0,1.0,1,0.7,0.1,0.7166666666666667,0.6538461538461539,1.0,0.9888888888888888,0.02631578947368424
Sunderland,Aston Villa,1,0,0.25,1,0.5,0.4,0.525,0.5,0.9777777777777776,1.0,0.42105263157894735
Tottenham,Everton,1,0,0.75,0,0.7,0.6,0.5166666666666667,0.5576923076923077,1.0,0.9777777777777776,0.34210526315789475
West Brom,Fulham,1,0,0.5,1,0.7,0.5,0.475,0.5192307692307693,1.0,0.9777777777777776,0.2368421052631579
West Ham,Newcastle,1,0,0.75,-1,0.5,0.3,0.425,0.4807692307692308,0.9888888888888888,0.9888888888888888,0.7894736842105263
Wigan,Bolton,1,0,0.25,0,0.5,0.5,0.425,0.4615384615384616,0.9777777777777776,0.9888888888888888,0.6842105263157895
Liverpool,Blackburn,1,0,0.75,1,0.2,0.5,0.4583333333333333,0.4615384615384616,0.9666666666666668,1.0,0.5263157894736842
Man City,Arsenal,1,0,0.75,-1,0.9,0.5,0.4916666666666666,0.5384615384615384,1.0,1.0,0.5526315789473684
Stoke,Man United,1,0,0.0,-1,0.7,0.6,0.425,0.4230769230769231,0.9888888888888888,1.0,0.763157894736842
Arsenal,West Ham,1,0,0.75,1,0.5,0.5,0.675,0.6346153846153846,1.0,1.0,0.02631578947368424
Blackburn,Chelsea,1,0,0.25,-1,0.4,0.7,0.29166666666666663,0.3461538461538461,1.0,1.0,0.9473684210526316
Everton,Stoke,1,0,0.5,1,0.6,0.5,0.5333333333333333,0.5192307692307693,0.9885057471264368,0.9885057471264368,0.2894736842105263
Fulham,Wigan,1,0,0.75,1,0.3,0.5,0.5666666666666667,0.5,1.0,1.0,0.3157894736842105
Man United,Tottenham,1,0,1.0,1,0.7,0.7,0.5416666666666666,0.5384615384615384,1.0,1.0,0.4473684210526316
Wolves,Man City,1,0,0.0,1,0.1,0.8,0.4083333333333333,0.3653846153846154,0.9540229885057472,1.0,0.8947368421052632
Aston Villa,Birmingham,1,0,1.0,0,0.4,0.3,0.4833333333333333,0.5,0.9885057471264368,1.0,0.4736842105263158
Bolton,Liverpool,1,0,0.0,-1,0.6,0.3,0.5416666666666666,0.5576923076923077,1.0,1.0,0.4473684210526316
Newcastle,Sunderland,1,0,0.25,1,0.5,0.6,0.5,0.4615384615384616,1.0,1.0,0.368421052631579
Birmingham,West Ham,1,0,0.5,0,0.4,0.4,0.575,0.5769230769230769,0.988095238095238,0.9523809523809524,0.368421052631579
Blackburn,Wigan,1,0,0.75,1,0.3,0.5,0.5666666666666667,0.4807692307692308,1.0,1.0,0.4473684210526316
Bolton,Tottenham,1,0,0.25,1,0.5,0.5,0.4833333333333333,0.4807692307692308,1.0,1.0,0.4736842105263158
Fulham,Aston Villa,1,0,0.0,0,0.4,0.4,0.5416666666666666,0.5192307692307693,1.0,1.0,0.4736842105263158
Man United,Wolves,1,0,1.0,1,0.7,0.3,0.6333333333333333,0.6538461538461539,1.0,0.988095238095238,0.05263157894736842
Sunderland,Stoke,1,0,0.25,1,0.5,0.4,0.5083333333333333,0.5576923076923077,1.0,1.0,0.2631578947368421
Arsenal,Newcastle,1,0,1.0,-1,0.6,0.5,0.5583333333333333,0.5769230769230769,1.0,1.0,0.4473684210526316
Liverpool,Chelsea,1,0,0.0,1,0.5,0.7,0.26666666666666666,0.3461538461538461,1.0,1.0,0.7105263157894737
West Brom,Man City,1,0,0.5,-1,0.6,0.6,0.45,0.4807692307692308,1.0,1.0,0.6578947368421053
Stoke,Birmingham,1,0,0.25,1,0.2,0.4,0.4666666666666667,0.4423076923076923,1.0,1.0,0.4736842105263158
Tottenham,Sunderland,1,0,0.5,0,0.5,0.6,0.5,0.4807692307692308,1.0,1.0,0.4736842105263158
Chelsea,Fulham,1,0,1.0,1,0.7,0.4,0.675,0.6153846153846154,1.0,1.0,0.13157894736842107
Everton,Bolton,1,0,0.5,0,0.8,0.6,0.5083333333333333,0.4807692307692308,0.9876543209876544,1.0,0.6578947368421053
Man City,Man United,1,0,0.0,0,0.6,0.8,0.45,0.4423076923076923,1.0,1.0,0.5526315789473684
Newcastle,Blackburn,1,0,0.0,-1,0.7,0.3,0.5666666666666667,0.5576923076923077,1.0,1.0,0.2894736842105263
West Ham,West Brom,1,0,0.25,0,0.3,0.4,0.45,0.40384615384615385,0.9382716049382716,1.0,0.7368421052631579
Wigan,Liverpool,1,0,0.5,0,0.4,0.6,0.4166666666666667,0.4423076923076923,0.9753086419753086,1.0,0.7368421052631579
Wolves,Arsenal,1,0,0.0,-1,0.3,0.6,0.35,0.3653846153846154,0.962962962962963,1.0,0.9210526315789472
Aston Villa,Man United,1,0,0.75,0,0.5,0.8,0.3833333333333333,0.3846153846153846,1.0,1.0,0.6578947368421053
Man City,Birmingham,1,0,0.75,0,0.5,0.4,0.5666666666666667,0.5961538461538461,1.0,1.0,0.13157894736842107
Newcastle,Fulham,1,0,0.0,0,0.7,0.3,0.5416666666666666,0.5192307692307693,1.0,0.9871794871794872,0.2894736842105263
Stoke,Liverpool,1,0,0.25,1,0.2,0.7,0.475,0.4423076923076923,0.9871794871794872,1.0,0.4736842105263158
Tottenham,Blackburn,1,0,1.0,1,0.4,0.5,0.5,0.5192307692307693,1.0,1.0,0.3157894736842105
Wigan,West Brom,1,0,0.5,1,0.3,0.4,0.44166666666666665,0.4423076923076923,1.0,1.0,0.631578947368421
Wolves,Bolton,1,0,0.5,-1,0.3,0.6,0.4166666666666667,0.3846153846153846,0.9743589743589745,1.0,0.8684210526315791
Chelsea,Sunderland,1,0,1.0,-1,0.7,0.6,0.7,0.6153846153846154,1.0,1.0,0.368421052631579
Everton,Arsenal,1,0,0.25,-1,0.7,0.8,0.4083333333333333,0.4230769230769231,0.9871794871794872,1.0,0.7894736842105263
Arsenal,Tottenham,1,0,0.5,-1,0.8,0.4,0.6083333333333334,0.5769230769230769,1.0,1.0,0.42105263157894735
Birmingham,Chelsea,1,0,0.25,1,0.5,0.6,0.3083333333333333,0.3461538461538461,0.9733333333333334,1.0,0.8684210526315791
Bolton,Newcastle,1,0,0.5,1,0.6,0.7,0.475,0.5384615384615384,1.0,0.9866666666666668,0.368421052631579
Liverpool,West Ham,1,0,1.0,1,0.7,0.3,0.5583333333333333,0.5769230769230769,0.96,0.9733333333333334,0.21052631578947367
Man United,Wigan,1,0,1.0,1,0.8,0.4,0.6833333333333333,0.6538461538461539,1.0,1.0,0.07894736842105265
West Brom,Stoke,1,0,0.0,-1,0.3,0.4,0.475,0.5192307692307693,0.96,0.96,0.7105263157894737
Blackburn,Aston Villa,1,0,1.0,1,0.4,0.5,0.5,0.4615384615384616,0.9466666666666668,0.9733333333333334,0.4473684210526316
Fulham,Man City,1,0,0.25,-1,0.4,0.4,0.4583333333333333,0.4230769230769231,1.0,1.0,0.8421052631578947
Sunderland,Everton,1,0,0.25,0,0.7,0.5,0.5083333333333333,0.5576923076923077,1.0,0.9866666666666668,0.3157894736842105
Aston Villa,Arsenal,1,0,0.25,-1,0.5,0.6,0.35,0.40384615384615385,0.9722222222222222,1.0,0.8157894736842105
Everton,West Brom,1,0,1.0,-1,0.5,0.1,0.5833333333333334,0.5192307692307693,0.9722222222222222,0.9722222222222222,0.6052631578947368
Fulham,Birmingham,1,0,0.5,0,0.4,0.5,0.4916666666666666,0.4807692307692308,1.0,0.9722222222222222,0.5789473684210527
Man United,Blackburn,1,0,0.75,1,0.8,0.6,0.6166666666666667,0.6538461538461539,1.0,0.9444444444444444,0.1842105263157895
Stoke,Man City,1,0,0.25,0,0.6,0.6,0.43333333333333335,0.40384615384615385,0.9583333333333334,1.0,0.6052631578947368
West Ham,Wigan,1,0,0.5,1,0.3,0.3,0.4916666666666666,0.4423076923076923,0.9305555555555556,1.0,0.5526315789473684
Wolves,Sunderland,1,0,0.5,1,0.2,0.6,0.39166666666666666,0.3269230769230769,0.9305555555555556,0.9722222222222222,0.8157894736842105
Newcastle,Chelsea,1,0,0.25,0,0.5,0.4,0.35,0.3846153846153846,0.9444444444444444,1.0,0.6842105263157895
Tottenham,Liverpool,1,0,0.5,1,0.5,0.7,0.525,0.5384615384615384,1.0,0.9583333333333334,0.368421052631579
Arsenal,Fulham,1,0,1.0,1,0.6,0.3,0.65,0.6346153846153846,1.0,1.0,0.07894736842105265
Birmingham,Tottenham,1,0,0.25,0,0.5,0.7,0.4583333333333333,0.4230769230769231,0.9710144927536232,1.0,0.7368421052631579
Blackburn,Wolves,1,0,0.75,1,0.6,0.2,0.525,0.5769230769230769,0.9565217391304348,0.9565217391304348,0.2894736842105263
Chelsea,Everton,1,0,0.25,0,0.3,0.3,0.675,0.6346153846153846,1.0,0.9855072463768116,0.1842105263157895
Man City,Bolton,1,0,0.75,1,0.7,0.8,0.5166666666666667,0.5192307692307693,1.0,1.0,0.4473684210526316
Wigan,Stoke,1,0,0.5,0,0.3,0.7,0.375,0.4423076923076923,0.9855072463768116,0.9565217391304348,0.7105263157894737
Sunderland,West Ham,1,0,0.25,1,0.6,0.5,0.6083333333333334,0.6153846153846154,0.9565217391304348,0.9565217391304348,0.15789473684210525
West Brom,Newcastle,1,0,0.0,1,0.3,0.4,0.44166666666666665,0.5,0.9420289855072465,0.9420289855072465,0.42105263157894735
Liverpool,Aston Villa,1,0,0.5,1,0.5,0.4,0.5416666666666666,0.5192307692307693,0.9420289855072465,0.9710144927536232,0.2894736842105263
Aston Villa,West Brom,1,0,1.0,1,0.3,0.5,0.45,0.4423076923076923,0.9696969696969696,0.9848484848484848,0.6052631578947368
Everton,Wigan,1,0,1.0,0,0.3,0.4,0.6083333333333334,0.5384615384615384,0.9696969696969696,1.0,0.3947368421052632
Fulham,Sunderland,1,0,0.75,0,0.2,0.6,0.45,0.40384615384615385,1.0,1.0,0.7894736842105263
Newcastle,Liverpool,1,0,0.0,1,0.2,0.5,0.4833333333333333,0.4615384615384616,0.9393939393939394,0.9848484848484848,0.4736842105263158
West Ham,Man City,1,0,0.25,-1,0.4,0.7,0.31666666666666665,0.28846153846153844,0.9545454545454546,1.0,0.9473684210526316
Bolton,Blackburn,1,0,0.0,1,0.6,0.6,0.575,0.5576923076923077,1.0,0.9696969696969696,0.368421052631579
Tottenham,Chelsea,1,0,0.5,0,0.8,0.4,0.3666666666666667,0.4615384615384616,1.0,1.0,0.5263157894736842
Wolves,Birmingham,1,0,0.0,1,0.2,0.5,0.4083333333333333,0.3846153846153846,0.9545454545454546,0.9545454545454546,0.5789473684210527
Man United,Arsenal,1,0,1.0,1,0.8,0.8,0.525,0.5192307692307693,1.0,1.0,0.4736842105263158
Blackburn,West Ham,1,0,0.5,0,0.4,0.3,0.5833333333333334,0.5961538461538461,0.9682539682539684,0.9523809523809524,0.2894736842105263
Sunderland,Bolton,1,0,1.0,1,0.6,0.7,0.4666666666666667,0.4807692307692308,1.0,1.0,0.4736842105263158
Man City,Everton,1,0,0.0,-1,0.8,0.3,0.6083333333333334,0.6538461538461539,1.0,0.9523809523809524,0.21052631578947367
Aston Villa,Tottenham,1,0,0.25,-1,0.3,0.8,0.4,0.40384615384615385,0.9365079365079364,1.0,0.763157894736842
Blackburn,Stoke,1,0,0.0,-1,0.5,0.6,0.4666666666666667,0.5192307692307693,0.9666666666666668,0.9523809523809524,0.4736842105263158
Bolton,West Brom,1,0,0.5,1,0.5,0.4,0.5833333333333334,0.5769230769230769,1.0,0.9365079365079364,0.2894736842105263
Fulham,West Ham,1,0,0.75,-1,0.3,0.3,0.5916666666666667,0.5576923076923077,1.0,1.0,0.4473684210526316
Man United,Sunderland,1,0,0.75,1,0.8,0.6,0.6416666666666666,0.5769230769230769,1.0,1.0,0.34210526315789475
Newcastle,Man City,1,0,0.0,-1,0.4,0.7,0.425,0.3653846153846154,0.9365079365079364,1.0,0.7894736842105263
Wolves,Wigan,1,0,0.0,-1,0.4,0.4,0.525,0.4615384615384616,1.0,0.9841269841269842,0.5789473684210527
Arsenal,Chelsea,1,0,0.0,1,0.6,0.3,0.4666666666666667,0.5,1.0,1.0,0.4736842105263158
Birmingham,Man United,1,0,0.25,0,0.5,0.9,0.29166666666666663,0.2692307692307692,1.0,1.0,0.9210526315789472
Man City,Aston Villa,1,0,0.75,1,0.7,0.2,0.6833333333333333,0.6923076923076923,1.0,0.9666666666666668,0.15789473684210525
Stoke,Fulham,1,0,1.0,-1,0.6,0.2,0.5583333333333333,0.5576923076923077,0.9666666666666668,0.9666666666666668,0.2894736842105263
Tottenham,Newcastle,1,0,0.5,1,0.8,0.3,0.5416666666666666,0.6153846153846154,1.0,0.9333333333333332,0.2894736842105263
West Brom,Blackburn,1,0,0.5,-1,0.4,0.3,0.5,0.5,0.9333333333333332,0.9298245614035088,0.631578947368421
West Ham,Everton,1,0,0.25,0,0.5,0.5,0.4,0.4230769230769231,0.9649122807017544,0.95,0.7368421052631579
Chelsea,Bolton,1,0,1.0,1,0.3,0.5,0.5833333333333334,0.5,1.0,1.0,0.4473684210526316
Liverpool,Wolves,1,0,0.75,-1,0.4,0.4,0.6,0.5961538461538461,0.9365079365079364,0.95,0.3157894736842105
Wigan,Arsenal,1,0,0.5,0,0.4,0.6,0.24166666666666664,0.3269230769230769,0.9833333333333332,1.0,0.8421052631578947
Birmingham,Arsenal,1,0,0.25,-1,0.5,0.7,0.33333333333333337,0.3269230769230769,1.0,1.0,0.9210526315789472
Liverpool,Bolton,1,0,1.0,1,0.4,0.4,0.43333333333333335,0.3846153846153846,0.9333333333333332,1.0,0.5526315789473684
Stoke,Everton,1,0,0.25,1,0.4,0.5,0.5,0.4807692307692308,0.912280701754386,0.9298245614035088,0.368421052631579
Sunderland,Blackburn,1,0,0.5,1,0.5,0.5,0.5333333333333333,0.5576923076923077,1.0,0.962962962962963,0.34210526315789475
Tottenham,Fulham,1,0,1.0,1,0.8,0.4,0.5833333333333334,0.6538461538461539,1.0,1.0,0.13157894736842107
West Brom,Man United,1,0,0.25,-1,0.4,0.9,0.24166666666666664,0.2692307692307692,0.9298245614035088,1.0,0.8421052631578947
West Ham,Wolves,1,0,0.25,1,0.4,0.6,0.4916666666666666,0.5192307692307693,1.0,1.0,0.3947368421052632
Chelsea,Aston Villa,1,0,0.75,0,0.5,0.2,0.7666666666666666,0.6730769230769231,1.0,0.9649122807017544,0.2368421052631579
Wigan,Newcastle,1,0,0.75,-1,0.5,0.3,0.4083333333333333,0.5,1.0,0.9649122807017544,0.6842105263157895
Fulham,West Brom,1,0,0.5,1,0.3,0.2,0.5416666666666666,0.5,1.0,0.962962962962963,0.4473684210526316
Man United,Stoke,1,0,1.0,1,0.9,0.5,0.6833333333333333,0.7115384615384616,1.0,1.0,0.2368421052631579
Arsenal,Man City,1,0,0.75,0,0.7,0.8,0.525,0.4615384615384616,1.0,1.0,0.5263157894736842
Aston Villa,Sunderland,1,0,0.25,-1,0.3,0.5,0.3666666666666667,0.3653846153846154,1.0,1.0,0.8157894736842105
Blackburn,Liverpool,1,0,0.0,1,0.3,0.4,0.44166666666666665,0.5,0.9019607843137256,0.912280701754386,0.42105263157894735
Bolton,Wigan,1,0,0.75,0,0.4,0.5,0.6666666666666666,0.6153846153846154,0.9803921568627452,1.0,0.1842105263157895
Everton,Tottenham,1,0,0.25,1,0.5,0.8,0.4166666666666667,0.3461538461538461,0.962962962962963,1.0,0.7105263157894737
Newcastle,West Ham,1,0,0.75,1,0.4,0.6,0.575,0.5384615384615384,0.9074074074074074,1.0,0.1842105263157895
Wolves,Chelsea,1,0,0.0,1,0.4,0.5,0.2333333333333333,0.2692307692307692,1.0,1.0,0.8157894736842105
Chelsea,Blackburn,1,0,0.75,1,0.4,0.5,0.6916666666666667,0.5961538461538461,1.0,0.9583333333333334,0.3157894736842105
Man City,Wolves,1,0,0.5,1,0.7,0.6,0.75,0.7884615384615384,1.0,1.0,0.05263157894736842
Stoke,Bolton,1,0,0.0,1,0.4,0.3,0.4583333333333333,0.4230769230769231,0.9411764705882352,1.0,0.5263157894736842
West Ham,Arsenal,1,0,0.0,-1,0.6,0.6,0.2,0.2692307692307692,1.0,1.0,0.9473684210526316
Wigan,Fulham,1,0,0.0,0,0.5,0.5,0.39166666666666666,0.4807692307692308,1.0,0.9215686274509804,0.5789473684210527
Birmingham,Aston Villa,1,0,0.25,0,0.4,0.3,0.5833333333333334,0.5384615384615384,0.9814814814814816,1.0,0.4736842105263158
Liverpool,Everton,1,0,0.5,0,0.2,0.6,0.4833333333333333,0.4615384615384616,1.0,1.0,0.5263157894736842
Sunderland,Newcastle,1,0,0.25,0,0.6,0.6,0.5,0.5961538461538461,1.0,1.0,0.42105263157894735
Tottenham,Man United,1,0,0.0,0,0.7,0.9,0.35,0.3846153846153846,1.0,1.0,0.6052631578947368
Arsenal,Wigan,1,0,0.25,1,0.8,0.5,0.8166666666666667,0.7307692307692308,1.0,1.0,0.07894736842105265
Aston Villa,Man City,1,0,0.0,1,0.2,0.9,0.225,0.2115384615384616,0.9791666666666666,1.0,0.763157894736842
Everton,West Ham,1,0,0.5,0,0.6,0.5,0.6416666666666666,0.5961538461538461,0.8958333333333334,0.9777777777777776,0.34210526315789475
Fulham,Stoke,1,0,0.5,1,0.5,0.6,0.4666666666666667,0.4615384615384616,0.9583333333333334,0.9166666666666666,0.631578947368421
Man United,Birmingham,1,0,0.5,1,0.8,0.4,0.7416666666666667,0.7692307692307692,1.0,1.0,0.07894736842105265
Newcastle,Tottenham,1,0,0.0,0,0.5,0.7,0.475,0.3846153846153846,0.8958333333333334,1.0,0.6052631578947368
Wolves,Liverpool,1,0,0.75,-1,0.4,0.3,0.4166666666666667,0.4230769230769231,0.9583333333333334,0.9375,0.8157894736842105
Blackburn,West Brom,1,0,0.75,1,0.4,0.2,0.5333333333333333,0.5384615384615384,0.8888888888888888,0.9583333333333334,0.2894736842105263
Bolton,Chelsea,1,0,0.0,-1,0.3,0.5,0.3666666666666667,0.4230769230769231,0.9111111111111112,1.0,0.6842105263157895
Wigan,Aston Villa,1,0,0.5,-1,0.3,0.4,0.4666666666666667,0.4807692307692308,0.9777777777777776,0.9555555555555556,0.631578947368421
Liverpool,Fulham,1,0,0.25,1,0.5,0.7,0.4916666666666666,0.5,0.8888888888888888,0.9333333333333332,0.2894736842105263
Arsenal,Everton,1,0,0.75,1,0.8,0.5,0.7333333333333334,0.6923076923076923,1.0,0.9111111111111112,0.15789473684210525
Man United,Aston Villa,1,0,0.5,1,0.9,0.6,0.8583333333333334,0.8076923076923077,1.0,0.8809523809523809,0.15789473684210525
Sunderland,Chelsea,1,0,0.5,-1,0.7,0.7,0.3416666666666667,0.4807692307692308,1.0,1.0,0.5526315789473684
West Brom,Wigan,1,0,0.5,0,0.2,0.2,0.5416666666666666,0.5,0.9555555555555556,0.9761904761904762,0.42105263157894735
Birmingham,Man City,1,0,0.25,0,0.4,0.7,0.275,0.25,1.0,1.0,0.8684210526315791
Blackburn,Tottenham,1,0,0.0,-1,0.6,0.6,0.4,0.3846153846153846,0.8571428571428572,1.0,0.6052631578947368
Bolton,Wolves,1,0,1.0,1,0.1,0.4,0.6333333333333333,0.6538461538461539,0.8333333333333334,0.9555555555555556,0.1842105263157895
Fulham,Newcastle,1,0,0.75,1,0.5,0.6,0.4666666666666667,0.4807692307692308,0.9285714285714286,0.8444444444444444,0.5526315789473684
Liverpool,Stoke,1,0,0.25,1,0.5,0.4,0.5,0.5384615384615384,0.8809523809523809,0.8444444444444444,0.3947368421052632
Aston Villa,Fulham,1,0,0.75,0,0.5,0.7,0.375,0.4615384615384616,0.8717948717948718,0.8461538461538461,0.5526315789473684
Man City,West Brom,1,0,1.0,1,0.6,0.3,0.7583333333333333,0.7692307692307692,1.0,1.0,0.13157894736842107
Newcastle,Arsenal,1,0,0.5,0,0.6,0.9,0.29166666666666663,0.2692307692307692,0.9047619047619048,1.0,0.7105263157894737
Stoke,Sunderland,1,0,0.25,1,0.4,0.7,0.4666666666666667,0.3653846153846154,0.9047619047619048,1.0,0.5526315789473684
Tottenham,Bolton,1,0,0.5,1,0.6,0.3,0.5583333333333333,0.5961538461538461,1.0,0.8974358974358975,0.42105263157894735
Wigan,Blackburn,1,0,0.0,1,0.3,0.4,0.4,0.4423076923076923,0.9230769230769232,0.8717948717948718,0.6842105263157895
Wolves,Man United,1,0,0.0,1,0.2,0.9,0.08333333333333331,0.038461538461538436,0.8809523809523809,1.0,0.9736842105263156
Chelsea,Liverpool,1,0,0.5,-1,0.7,0.7,0.6916666666666667,0.6153846153846154,1.0,1.0,0.4473684210526316
West Ham,Birmingham,1,0,0.75,-1,0.5,0.4,0.44166666666666665,0.4807692307692308,0.9487179487179488,1.0,0.6052631578947368
Arsenal,Wolves,1,0,1.0,1,0.8,0.4,0.8666666666666667,0.8461538461538461,1.0,0.9487179487179488,0.02631578947368424
Birmingham,Stoke,1,0,0.5,1,0.6,0.4,0.43333333333333335,0.4807692307692308,0.9761904761904762,0.9487179487179488,0.631578947368421
Blackburn,Newcastle,1,0,1.0,0,0.4,0.5,0.4166666666666667,0.4807692307692308,0.8888888888888888,0.8974358974358975,0.5526315789473684
Liverpool,Wigan,1,0,0.25,0,0.9,0.4,0.675,0.6153846153846154,1.0,1.0,0.1842105263157895
Man United,Man City,1,0,0.75,1,0.7,0.6,0.5916666666666667,0.5769230769230769,1.0,1.0,0.4473684210526316
Sunderland,Tottenham,1,0,0.75,-1,0.5,0.6,0.44166666666666665,0.4230769230769231,0.9722222222222222,1.0,0.5789473684210527
West Brom,West Ham,1,0,0.5,0,0.3,0.3,0.5083333333333333,0.5,1.0,0.9444444444444444,0.4473684210526316
Bolton,Everton,1,0,0.25,1,0.3,0.6,0.5,0.5192307692307693,0.8611111111111112,0.8974358974358975,0.34210526315789475
Fulham,Chelsea,1,0,0.0,0,0.6,0.6,0.3,0.3653846153846154,1.0,1.0,0.7105263157894737
Arsenal,Stoke,1,0,1.0,1,0.9,0.4,0.7583333333333333,0.7692307692307692,1.0,0.8611111111111112,0.2894736842105263
Aston Villa,Blackburn,1,0,0.0,1,0.6,0.3,0.44166666666666665,0.5,0.9090909090909092,0.8484848484848485,0.4473684210526316
Everton,Sunderland,1,0,0.75,1,0.4,0.3,0.475,0.4230769230769231,0.9166666666666666,0.9696969696969696,0.5789473684210527
Newcastle,Bolton,1,0,0.0,0,0.5,0.4,0.525,0.4807692307692308,0.9090909090909092,0.9393939393939394,0.5526315789473684
Wigan,Man United,1,0,0.0,-1,0.4,0.8,0.08333333333333331,0.13461538461538464,1.0,1.0,1.0
Man City,Fulham,1,0,1.0,0,0.5,0.6,0.6583333333333333,0.6923076923076923,1.0,0.8787878787878788,0.2368421052631579
West Ham,Liverpool,1,0,0.0,1,0.4,0.9,0.325,0.3461538461538461,0.9393939393939394,1.0,0.8421052631578947
Stoke,West Brom,1,0,1.0,0,0.2,0.3,0.6166666666666667,0.5384615384615384,0.8484848484848485,1.0,0.3157894736842105
Chelsea,Man United,1,0,1.0,1,0.7,0.8,0.4,0.28846153846153844,1.0,1.0,0.5789473684210527
Arsenal,Sunderland,1,0,0.75,0,0.9,0.2,0.7666666666666666,0.7115384615384616,1.0,0.9333333333333332,0.34210526315789475
Bolton,Aston Villa,1,0,0.25,1,0.5,0.6,0.6083333333333334,0.5576923076923077,0.9333333333333332,0.9,0.34210526315789475
Fulham,Blackburn,1,0,0.25,1,0.5,0.3,0.5916666666666667,0.5576923076923077,0.9333333333333332,0.9333333333333332,0.42105263157894735
Man City,Wigan,1,0,1.0,1,0.4,0.4,0.8416666666666667,0.7692307692307692,1.0,0.9,0.05263157894736842
Newcastle,Everton,1,0,0.75,-1,0.5,0.5,0.5416666666666666,0.5192307692307693,0.9,0.9090909090909092,0.5263157894736842
West Ham,Stoke,1,0,0.25,1,0.6,0.3,0.39166666666666666,0.4615384615384616,0.9333333333333332,0.8666666666666667,0.6578947368421053
Liverpool,Man United,1,0,0.0,1,0.7,0.6,0.21666666666666667,0.2115384615384616,1.0,1.0,0.631578947368421
Wolves,Tottenham,1,0,0.5,0,0.5,0.7,0.31666666666666665,0.2307692307692308,0.9333333333333332,1.0,0.8684210526315791
Everton,Birmingham,1,0,0.75,0,0.6,0.5,0.6,0.5769230769230769,0.9,1.0,0.2894736842105263
Aston Villa,Wolves,1,0,0.75,-1,0.4,0.6,0.5166666666666667,0.5769230769230769,0.8888888888888888,0.962962962962963,0.3947368421052632
Everton,Fulham,1,0,0.75,1,0.7,0.7,0.4916666666666666,0.5192307692307693,0.925925925925926,0.8518518518518519,0.3947368421052632
Man United,Bolton,1,0,0.75,1,0.4,0.7,0.7583333333333333,0.75,1.0,1.0,0.34210526315789475
Stoke,Newcastle,1,0,0.75,1,0.3,0.5,0.425,0.4423076923076923,0.8518518518518519,0.8888888888888888,0.4736842105263158
Tottenham,West Ham,1,0,0.5,0,0.7,0.7,0.6666666666666666,0.7115384615384616,1.0,1.0,0.1842105263157895
West Brom,Arsenal,1,0,0.5,0,0.5,0.8,0.125,0.1923076923076923,0.962962962962963,1.0,0.8684210526315791
Wigan,Birmingham,1,0,0.25,1,0.4,0.5,0.4083333333333333,0.4423076923076923,0.8518518518518519,1.0,0.5263157894736842
Chelsea,Man City,1,0,0.0,1,0.7,0.6,0.5583333333333333,0.4615384615384616,1.0,1.0,0.4736842105263158
Sunderland,Liverpool,1,0,0.25,-1,0.1,0.7,0.4583333333333333,0.4807692307692308,0.8518518518518519,1.0,0.5789473684210527
Arsenal,Blackburn,1,0,0.5,0,0.7,0.2,0.85,0.8269230769230769,1.0,0.9166666666666666,0.1842105263157895
Birmingham,Bolton,1,0,0.25,1,0.3,0.5,0.3833333333333333,0.40384615384615385,1.0,0.9166666666666666,0.6842105263157895
Everton,Aston Villa,1,0,0.25,0,0.7,0.4,0.625,0.6153846153846154,0.9166666666666666,0.9166666666666666,0.2631578947368421
Stoke,Chelsea,1,0,0.0,0,0.3,0.7,0.24166666666666664,0.2692307692307692,0.7916666666666666,1.0,0.6842105263157895
West Brom,Liverpool,1,0,0.0,1,0.6,0.7,0.33333333333333337,0.3653846153846154,0.9166666666666666,1.0,0.6842105263157895
West Ham,Man United,1,0,0.0,-1,0.6,0.6,0.10833333333333334,0.11538461538461535,1.0,1.0,0.9473684210526316
Wigan,Tottenham,1,0,0.5,0,0.5,0.6,0.2583333333333333,0.2692307692307692,0.9583333333333334,1.0,0.8947368421052632
Man City,Sunderland,1,0,0.25,1,0.5,0.1,0.6833333333333333,0.6730769230769231,1.0,0.7916666666666666,0.2631578947368421
Blackburn,Birmingham,1,0,0.5,0,0.3,0.3,0.5,0.4615384615384616,0.9523809523809524,0.9583333333333334,0.4736842105263158
Bolton,West Ham,1,0,1.0,1,0.5,0.6,0.625,0.5961538461538461,0.7619047619047619,0.9523809523809524,0.2368421052631579
Chelsea,Wigan,1,0,1.0,1,0.8,0.4,0.925,0.7692307692307692,1.0,0.9047619047619048,0.05263157894736842
Man United,Fulham,1,0,0.75,1,0.6,0.6,0.775,0.8269230769230769,1.0,0.7619047619047619,0.2368421052631579
Sunderland,West Brom,1,0,0.0,-1,0.1,0.7,0.5416666666666666,0.5384615384615384,0.7619047619047619,0.8571428571428572,0.5789473684210527
Tottenham,Stoke,1,0,1.0,1,0.5,0.4,0.575,0.6923076923076923,1.0,0.7619047619047619,0.3157894736842105
Wolves,Everton,1,0,0.5,-1,0.6,0.8,0.35,0.3269230769230769,0.9523809523809524,0.8095238095238095,0.8157894736842105
Aston Villa,Newcastle,1,0,0.5,1,0.4,0.5,0.3666666666666667,0.4423076923076923,0.9523809523809524,0.7142857142857143,0.631578947368421
Liverpool,Man City,1,0,0.25,1,0.5,0.5,0.3416666666666667,0.3461538461538461,1.0,1.0,0.5526315789473684
Birmingham,Sunderland,1,0,0.25,1,0.4,0.1,0.4833333333333333,0.4807692307692308,0.9047619047619048,0.7222222222222222,0.4736842105263158
Everton,Blackburn,1,0,0.5,1,0.8,0.3,0.6333333333333333,0.6538461538461539,0.9444444444444444,0.7777777777777778,0.2631578947368421
West Brom,Chelsea,1,0,0.0,-1,0.8,0.9,0.14166666666666666,0.2692307692307692,0.6666666666666667,1.0,0.7105263157894737
West Ham,Aston Villa,1,0,0.25,-1,0.5,0.5,0.4583333333333333,0.4423076923076923,1.0,0.6666666666666667,0.7368421052631579
Arsenal,Liverpool,1,0,0.75,0,0.7,0.6,0.7083333333333334,0.6923076923076923,1.0,1.0,0.3947368421052632
Newcastle,Man United,1,0,0.0,0,0.3,0.6,0.19166666666666665,0.11538461538461535,0.5555555555555556,1.0,0.7105263157894737
Chelsea,Birmingham,1,0,0.5,1,0.9,0.6,0.85,0.75,1.0,0.6111111111111112,0.15789473684210525
Tottenham,Arsenal,1,0,1.0,0,0.5,0.6,0.3,0.3846153846153846,1.0,1.0,0.5526315789473684
Aston Villa,Stoke,1,0,0.25,0,0.5,0.4,0.425,0.5576923076923077,0.4666666666666667,0.6111111111111112,0.5789473684210527
Chelsea,West Ham,1,0,1.0,1,0.9,0.3,0.9416666666666668,0.8846153846153846,1.0,1.0,0.05263157894736842
Liverpool,Birmingham,1,0,0.5,1,0.7,0.5,0.6583333333333333,0.5961538461538461,1.0,0.6666666666666667,0.2631578947368421
Man United,Everton,1,0,0.25,1,0.7,0.8,0.7666666666666666,0.7692307692307692,1.0,0.8666666666666667,0.34210526315789475
Sunderland,Wigan,1,0,0.5,1,0.1,0.5,0.575,0.5384615384615384,0.6666666666666667,1.0,0.34210526315789475
Tottenham,West Brom,1,0,0.75,0,0.6,0.7,0.6916666666666667,0.7115384615384616,1.0,0.6,0.2631578947368421
Wolves,Fulham,1,0,0.25,0,0.5,0.5,0.325,0.3653846153846154,0.9444444444444444,0.7222222222222222,0.763157894736842
Bolton,Arsenal,1,0,0.0,1,0.5,0.6,0.2583333333333333,0.2307692307692308,0.6666666666666667,1.0,0.631578947368421
Blackburn,Man City,1,0,0.25,-1,0.3,0.5,0.21666666666666667,0.2307692307692308,0.8666666666666667,1.0,0.8157894736842105
Stoke,Wolves,1,0,0.25,1,0.4,0.4,0.6416666666666666,0.5769230769230769,0.6,1.0,0.2631578947368421
Fulham,Bolton,1,0,0.5,1,0.5,0.6,0.475,0.4423076923076923,0.6,0.8,0.5263157894736842
Blackburn,Bolton,1,0,0.5,1,0.3,0.4,0.3666666666666667,0.3461538461538461,0.8333333333333334,0.75,0.7105263157894737
Chelsea,Tottenham,1,0,0.25,1,0.9,0.6,0.7416666666666667,0.6153846153846154,1.0,1.0,0.3947368421052632
Sunderland,Fulham,1,0,0.5,-1,0.2,0.5,0.3833333333333333,0.4615384615384616,0.4166666666666666,0.33333333333333337,0.631578947368421
West Brom,Aston Villa,1,0,0.0,1,0.6,0.6,0.475,0.4807692307692308,0.5,0.4166666666666666,0.4473684210526316
Wigan,Everton,1,0,0.25,0,0.5,0.7,0.26666666666666666,0.3269230769230769,1.0,0.33333333333333337,0.7894736842105263
Arsenal,Man United,1,0,0.0,1,0.5,0.9,0.43333333333333335,0.3846153846153846,1.0,1.0,0.5526315789473684
Birmingham,Wolves,1,0,0.5,0,0.5,0.3,0.55,0.6153846153846154,0.6666666666666667,0.9166666666666666,0.3947368421052632
Liverpool,Newcastle,1,0,0.5,1,0.7,0.4,0.5916666666666667,0.6153846153846154,1.0,0.4166666666666666,0.3157894736842105
Man City,West Ham,1,0,0.75,1,0.6,0.1,0.8583333333333334,0.8269230769230769,1.0,0.8333333333333334,0.07894736842105265
Aston Villa,Wigan,1,0,1.0,0,0.6,0.4,0.5833333333333334,0.5576923076923077,0.2222222222222222,1.0,0.368421052631579
Bolton,Sunderland,1,0,0.0,-1,0.4,0.2,0.6083333333333334,0.5576923076923077,0.0,0.2222222222222222,0.42105263157894735
Everton,Man City,1,0,1.0,1,0.6,0.6,0.3583333333333333,0.3653846153846154,0.2222222222222222,1.0,0.5789473684210527
West Ham,Blackburn,1,0,0.5,0,0.0,0.4,0.425,0.4423076923076923,0.7777777777777778,0.5555555555555556,0.631578947368421
Man United,Chelsea,1,0,0.0,1,0.7,1.0,0.5,0.5576923076923077,1.0,1.0,0.4736842105263158
Stoke,Arsenal,1,0,0.0,1,0.5,0.6,0.2333333333333333,0.17307692307692307,0.0,1.0,0.631578947368421
Fulham,Liverpool,1,0,0.25,-1,0.7,0.7,0.43333333333333335,0.4230769230769231,0.0,1.0,0.631578947368421
Man City,Tottenham,1,0,0.25,1,0.6,0.5,0.6166666666666667,0.5384615384615384,1.0,1.0,0.4473684210526316
Blackburn,Man United,1,0,0.25,0,0.4,0.7,0.05833333333333335,0.019230769230769214,0.16666666666666666,1.0,0.8684210526315791
Sunderland,Wolves,1,0,0.0,-1,0.4,0.4,0.575,0.6153846153846154,0.0,0.5,0.4473684210526316
West Brom,Everton,1,0,0.5,1,0.5,0.7,0.31666666666666665,0.3653846153846154,0.0,0.16666666666666666,0.6052631578947368
Arsenal,Aston Villa,1,0,0.75,-1,0.4,0.6,0.8583333333333334,0.8076923076923077,1.0,0.0,0.2631578947368421
Birmingham,Fulham,1,0,0.25,-1,0.3,0.5,0.31666666666666665,0.4230769230769231,1.0,0.0,0.7368421052631579
Chelsea,Newcastle,1,0,0.75,0,0.8,0.4,0.8166666666666667,0.8076923076923077,1.0,0.16666666666666666,0.2368421052631579
Liverpool,Tottenham,1,0,0.5,-1,0.9,0.3,0.6,0.4807692307692308,1.0,1.0,0.5263157894736842
Wigan,West Ham,1,0,0.0,1,0.4,0.1,0.5,0.5576923076923077,0.5,0.0,0.4736842105263158
Man City,Stoke,1,0,0.5,1,0.6,0.6,0.6666666666666666,0.75,1.0,0.0,0.34210526315789475
Aston Villa,Liverpool,1,0,0.0,1,0.6,0.7,0.26666666666666666,0.3653846153846154,0.0,1.0,0.5789473684210527
Bolton,Man City,1,0,0.0,-1,0.2,0.8,0.275,0.2307692307692308,0.0,1.0,0.7894736842105263
Everton,Chelsea,1,0,0.75,1,0.5,0.7,0.2333333333333333,0.28846153846153844,0.0,1.0,0.631578947368421
Fulham,Arsenal,1,0,0.0,0,0.7,0.3,0.3083333333333333,0.28846153846153844,1.0,1.0,0.6052631578947368
Newcastle,West Brom,1,0,0.5,0,0.5,0.5,0.6166666666666667,0.5,0.0,0.0,0.5263157894736842
Stoke,Wigan,1,0,0.5,-1,0.6,0.6,0.675,0.5384615384615384,0.0,1.0,0.42105263157894735
Tottenham,Birmingham,1,0,0.5,1,0.4,0.1,0.7333333333333334,0.75,1.0,1.0,0.15789473684210525
West Ham,Sunderland,1,0,0.5,-1,0.1,0.4,0.4166666666666667,0.3653846153846154,0.0,0.0,0.763157894736842
Wolves,Blackburn,1,0,0.25,-1,0.6,0.4,0.4583333333333333,0.4807692307692308,1.0,1.0,0.5526315789473684
