<svg width="95" height="32" viewBox="0 0 95 32" fill="none" xmlns="http://www.w3.org/2000/svg">
<path d="M47.811 0.0622367V10.77L40.8805 0.0622367H34.471V13.9687L29.6469 0.0622367H26.5893L28.8542 3.01141H23.5091L25.6381 0.334468L25.8193 0.0622367H22.6938L18.4359 11.8362C18.4359 11.8362 18.9794 1.12848 9.35383 0.6067H0.271782L0 0.311782V21.7273H9.08205C9.08205 21.7273 13.6344 21.4551 16.2843 18.2564L15.2198 21.4778H21.6293L22.6938 18.2564H29.1033L30.1678 21.4778H40.3143V11.2918L47.7883 21.4551H53.6543V0.0622367H47.811ZM11.7546 12.0858C11.7546 12.0858 11.7546 13.6965 10.1465 14.7627C10.1465 14.7627 9.08205 15.829 6.40952 15.829V6.21013H8.01757C8.01757 6.21013 11.7546 6.75459 11.7546 10.4978V12.0858ZM24.5736 12.6303L26.1817 9.40885L27.7897 12.6303H24.5736ZM92.4285 2.98873H89.756L91.6358 0.0395508H87.8988V3.78273C87.8988 3.78273 86.8343 1.10579 83.0973 0.0395508H56.3721V6.45968H61.1736V21.4551H67.0395V6.48236H71.841V21.4778H77.707V16.1012L81.9875 21.4551H94.3083V1.12848L92.4285 2.98873ZM80.153 9.95331H78.0014V5.66567H79.6095C79.6095 5.66567 81.2175 6.21013 81.2175 8.34261C81.2175 8.34261 81.2175 9.40885 80.153 9.95331ZM88.1479 19.0504L84.4109 13.6965C84.4109 13.6965 86.019 13.152 88.1479 9.95331V19.0504Z" fill="white"/>
<path d="M3.00721 29.0404C2.2788 28.831 1.74798 28.5744 1.41474 28.2707C1.08445 27.964 0.919303 27.5865 0.919303 27.1382C0.919303 26.631 1.12131 26.2122 1.52533 25.882C1.93229 25.5487 2.46017 25.3821 3.10895 25.3821C3.55131 25.3821 3.945 25.4676 4.29004 25.6387C4.63802 25.8097 4.90638 26.0456 5.09512 26.3464C5.28681 26.6472 5.38265 26.976 5.38265 27.3329H4.52891C4.52891 26.9436 4.40505 26.6384 4.15733 26.4172C3.90961 26.1931 3.56015 26.081 3.10895 26.081C2.69019 26.081 2.36285 26.1739 2.12693 26.3597C1.89395 26.5425 1.77747 26.7976 1.77747 27.125C1.77747 27.3874 1.88806 27.6101 2.10923 27.7929C2.33336 27.9728 2.71231 28.138 3.24608 28.2884C3.7828 28.4388 4.20157 28.6054 4.50237 28.7882C4.80611 28.9681 5.03024 29.179 5.17474 29.4208C5.32219 29.6626 5.39592 29.9472 5.39592 30.2745C5.39592 30.7965 5.19244 31.2153 4.78547 31.5308C4.37851 31.8434 3.83441 31.9997 3.15319 31.9997C2.71083 31.9997 2.29797 31.9157 1.9146 31.7476C1.53123 31.5765 1.23485 31.3435 1.02547 31.0486C0.819036 30.7537 0.71582 30.419 0.71582 30.0445H1.56956C1.56956 30.4338 1.71259 30.7419 1.99865 30.969C2.28765 31.1931 2.6725 31.3052 3.15319 31.3052C3.60144 31.3052 3.945 31.2138 4.18387 31.0309C4.42274 30.8481 4.54218 30.5989 4.54218 30.2834C4.54218 29.9678 4.43159 29.7245 4.21041 29.5535C3.98924 29.3795 3.58817 29.2085 3.00721 29.0404Z" fill="white"/>
<path d="M11.4429 28.8988C11.4429 29.5299 11.3367 30.0814 11.1244 30.5532C10.9121 31.0221 10.6113 31.3804 10.222 31.6281C9.83272 31.8758 9.37857 31.9997 8.85955 31.9997C8.35231 31.9997 7.90259 31.8758 7.51037 31.6281C7.11815 31.3775 6.81292 31.0221 6.5947 30.5621C6.37942 30.0991 6.26883 29.5638 6.26293 28.9563V28.4918C6.26293 27.8725 6.37057 27.3255 6.58585 26.8507C6.80113 26.3759 7.10488 26.0132 7.4971 25.7625C7.89227 25.5089 8.34347 25.3821 8.8507 25.3821C9.36678 25.3821 9.82093 25.5074 10.2131 25.7581C10.6083 26.0058 10.9121 26.3671 11.1244 26.8419C11.3367 27.3137 11.4429 27.8637 11.4429 28.4918V28.8988ZM10.598 28.483C10.598 27.7192 10.4446 27.1338 10.1379 26.7268C9.83125 26.3169 9.40217 26.112 8.8507 26.112C8.31398 26.112 7.89079 26.3169 7.58114 26.7268C7.27445 27.1338 7.11667 27.7 7.10783 28.4255V28.8988C7.10783 29.639 7.26265 30.2214 7.5723 30.6461C7.88489 31.0678 8.31398 31.2787 8.85955 31.2787C9.40806 31.2787 9.83272 31.0796 10.1335 30.6815C10.4343 30.2804 10.5891 29.7068 10.598 28.9607V28.483Z" fill="white"/>
<path d="M16.8617 29.0404C16.1333 28.831 15.6025 28.5744 15.2692 28.2707C14.939 27.964 14.7738 27.5865 14.7738 27.1382C14.7738 26.631 14.9758 26.2122 15.3798 25.882C15.7868 25.5487 16.3147 25.3821 16.9635 25.3821C17.4058 25.3821 17.7995 25.4676 18.1445 25.6387C18.4925 25.8097 18.7609 26.0456 18.9496 26.3464C19.1413 26.6472 19.2372 26.976 19.2372 27.3329H18.3834C18.3834 26.9436 18.2596 26.6384 18.0118 26.4172C17.7641 26.1931 17.4147 26.081 16.9635 26.081C16.5447 26.081 16.2174 26.1739 15.9814 26.3597C15.7485 26.5425 15.632 26.7976 15.632 27.125C15.632 27.3874 15.7426 27.6101 15.9637 27.7929C16.1879 27.9728 16.5668 28.138 17.1006 28.2884C17.6373 28.4388 18.0561 28.6054 18.3569 28.7882C18.6606 28.9681 18.8847 29.179 19.0293 29.4208C19.1767 29.6626 19.2504 29.9472 19.2504 30.2745C19.2504 30.7965 19.0469 31.2153 18.64 31.5308C18.233 31.8434 17.6889 31.9997 17.0077 31.9997C16.5653 31.9997 16.1525 31.9157 15.7691 31.7476C15.3857 31.5765 15.0894 31.3435 14.88 31.0486C14.6735 30.7537 14.5703 30.419 14.5703 30.0445H15.4241C15.4241 30.4338 15.5671 30.7419 15.8532 30.969C16.1422 31.1931 16.527 31.3052 17.0077 31.3052C17.4559 31.3052 17.7995 31.2138 18.0384 31.0309C18.2773 30.8481 18.3967 30.5989 18.3967 30.2834C18.3967 29.9678 18.2861 29.7245 18.0649 29.5535C17.8437 29.3795 17.4427 29.2085 16.8617 29.0404Z" fill="white"/>
<path d="M23.8996 30.2303H21.2012L20.5952 31.9112H19.7193L22.1788 25.4706H22.922L25.3859 31.9112H24.5144L23.8996 30.2303ZM21.4578 29.5314H23.6474L22.5504 26.5189L21.4578 29.5314ZM22.9706 23.7454H23.9615L22.776 25.0459H22.1169L22.9706 23.7454Z" fill="white"/>
<path d="M31.2028 31.9112H30.3491L27.1066 26.948V31.9112H26.2529V25.4706H27.1066L30.3579 30.4559V25.4706H31.2028V31.9112Z" fill="white"/>
<path d="M37.6612 31.9112H36.8074V28.9342H33.5606V31.9112H32.7112V25.4706H33.5606V28.2397H36.8074V25.4706H37.6612V31.9112Z" fill="white"/>
<path d="M46.1721 31.0663C45.9538 31.3789 45.6486 31.6134 45.2564 31.7697C44.8671 31.923 44.413 31.9997 43.8939 31.9997C43.369 31.9997 42.9031 31.8773 42.4961 31.6325C42.0891 31.3848 41.7736 31.0339 41.5495 30.5797C41.3283 30.1256 41.2147 29.5992 41.2089 29.0005V28.4388C41.2089 27.4685 41.4345 26.7165 41.8857 26.1828C42.3398 25.649 42.9768 25.3821 43.7966 25.3821C44.469 25.3821 45.0101 25.5546 45.4201 25.8996C45.83 26.2417 46.0806 26.7283 46.1721 27.3594H45.3227C45.1635 26.5071 44.6563 26.081 43.801 26.081C43.2319 26.081 42.7998 26.2815 42.5049 26.6826C42.213 27.0807 42.0655 27.6587 42.0626 28.4166V28.943C42.0626 29.6656 42.2277 30.2406 42.558 30.6682C42.8883 31.0929 43.3351 31.3052 43.8984 31.3052C44.2169 31.3052 44.4955 31.2698 44.7344 31.199C44.9733 31.1283 45.1709 31.0088 45.3272 30.8407V29.3942H43.8364V28.7042H46.1721V31.0663Z" fill="white"/>
<path d="M48.5033 31.9112H47.6539V25.4706H48.5033V31.9112Z" fill="white"/>
<path d="M53.6965 30.2303H50.9981L50.3921 31.9112H49.5162L51.9757 25.4706H52.7189L55.1828 31.9112H54.3114L53.6965 30.2303ZM51.2547 29.5314H53.4443L52.3473 26.5189L51.2547 29.5314ZM52.7675 23.7454H53.7584L52.5729 25.0459H51.9138L52.7675 23.7454Z" fill="white"/>
<path d="M60.6591 29.3058H59.1463V31.9112H58.2925V25.4706H60.4247C61.1501 25.4706 61.7075 25.6357 62.0968 25.966C62.489 26.2963 62.6851 26.777 62.6851 27.4081C62.6851 27.8091 62.576 28.1586 62.3578 28.4565C62.1425 28.7543 61.8417 28.977 61.4554 29.1244L62.9682 31.8581V31.9112H62.057L60.6591 29.3058ZM59.1463 28.6113H60.4512C60.8729 28.6113 61.2076 28.5022 61.4554 28.2839C61.706 28.0657 61.8314 27.7738 61.8314 27.4081C61.8314 27.01 61.7119 26.7047 61.4731 26.4924C61.2371 26.2801 60.8951 26.1724 60.4468 26.1695H59.1463V28.6113Z" fill="white"/>
<path d="M67.52 28.9342H64.7288V31.2167H67.9712V31.9112H63.8795V25.4706H67.927V26.1695H64.7288V28.2397H67.52V28.9342ZM65.5958 24.9265L65.5914 24.2497C65.8125 24.2349 65.9747 24.2054 66.078 24.1612C66.1812 24.117 66.2328 24.0373 66.2328 23.9223C66.2328 23.8073 66.165 23.7218 66.0293 23.6658C65.8966 23.6068 65.7197 23.5773 65.4985 23.5773L65.5294 23.1084C65.9688 23.1084 66.3021 23.1851 66.5292 23.3384C66.7562 23.4888 66.8698 23.6894 66.8698 23.94C66.8698 24.1199 66.8123 24.2688 66.6973 24.3868C66.5822 24.5048 66.4112 24.58 66.1841 24.6124L66.1797 24.9265H65.5958Z" fill="white"/>
<path d="M76.2255 31.9112H75.3718L72.1294 26.948V31.9112H71.2756V25.4706H72.1294L75.3807 30.4559V25.4706H76.2255V31.9112Z" fill="white"/>
<path d="M82.6839 31.9112H81.8302V28.9342H78.5833V31.9112H77.734V25.4706H78.5833V28.2397H81.8302V25.4706H82.6839V31.9112Z" fill="white"/>
<path d="M87.8285 30.2303H85.1301L84.5241 31.9112H83.6482L86.1077 25.4706H86.8509L89.3148 31.9112H88.4433L87.8285 30.2303ZM85.3867 29.5314H87.5763L86.4793 26.5189L85.3867 29.5314ZM86.1652 23.8869H86.8376L88.1204 25.0503H87.249L86.5014 24.347L85.7494 25.0503H84.8736L86.1652 23.8869ZM88.4212 23.1217H89.3059L88.4168 24.2674H87.7931L88.4212 23.1217Z" fill="white"/>
<path d="M94.0568 26.1695H91.9866V31.9112H91.1417V26.1695H89.0759V25.4706H94.0568V26.1695Z" fill="white"/>
</svg>
