<svg width="6" height="9" viewBox="0 0 6 9" fill="none" xmlns="http://www.w3.org/2000/svg">
<path d="M0.633363 0.840289C0.840771 0.648289 1.16484 0.648289 1.37225 0.840289L4.88522 4.10429C5.09262 4.29629 5.09262 4.59629 4.88522 4.78829L1.35929 8.04029C1.16484 8.23229 0.827808 8.24429 0.6204 8.05229C0.412993 7.87229 0.40003 7.56029 0.607438 7.36829L0.6204 7.35629L3.78336 4.44029L0.6204 1.52429C0.425956 1.33229 0.425956 1.03229 0.633363 0.840289Z" fill="#555555"/>
</svg>
