<svg width="24" height="24" viewBox="0 0 24 24" fill="none" xmlns="http://www.w3.org/2000/svg">
<path d="M18.75 2.87851H5.25C5.02162 2.90288 4.875 3.10726 4.875 3.33488V20.6651C4.875 20.8928 5.02162 21.0971 5.25 21.1215H18.75C18.9784 21.0971 19.125 20.8954 19.125 20.6651V3.33488C19.125 3.10726 18.9784 2.90288 18.75 2.87851Z" fill="url(#paint0_linear)"/>
<path d="M4.875 16.7835L18.774 2.88451C18.7657 2.88451 18.7586 2.87851 18.75 2.87851H14.2087L4.875 12.2123V16.7835Z" fill="url(#paint1_linear)"/>
<path d="M5.24999 21.1211H8.25374L19.125 10.2499V7.21463L5.22449 21.1151C5.23349 21.1159 5.24099 21.1211 5.24999 21.1211Z" fill="url(#paint2_linear)"/>
<path d="M4.875 22.875C4.875 23.4964 5.37863 24 6 24H18C18.6214 24 19.125 23.4964 19.125 22.875V20.25H4.875V22.875Z" fill="url(#paint3_linear)"/>
<path d="M12 23.3348C12.6682 23.3348 13.2098 22.7931 13.2098 22.125C13.2098 21.4569 12.6682 20.9153 12 20.9153C11.3319 20.9153 10.7903 21.4569 10.7903 22.125C10.7903 22.7931 11.3319 23.3348 12 23.3348Z" fill="white"/>
<path d="M18 0H6C5.37863 0 4.875 0.503625 4.875 1.125V3.75H19.125V1.125C19.125 0.503625 18.6214 0 18 0Z" fill="url(#paint4_linear)"/>
<path d="M9.375 2.4375C9.68566 2.4375 9.9375 2.18566 9.9375 1.875C9.9375 1.56434 9.68566 1.3125 9.375 1.3125C9.06434 1.3125 8.8125 1.56434 8.8125 1.875C8.8125 2.18566 9.06434 2.4375 9.375 2.4375Z" fill="url(#paint5_linear)"/>
<path d="M15.375 2.25H11.625C11.418 2.25 11.25 2.082 11.25 1.875C11.25 1.668 11.418 1.5 11.625 1.5H15.375C15.582 1.5 15.75 1.668 15.75 1.875C15.75 2.082 15.582 2.25 15.375 2.25Z" fill="url(#paint6_linear)"/>
<defs>
<linearGradient id="paint0_linear" x1="-8.80125" y1="12" x2="27.1185" y2="12" gradientUnits="userSpaceOnUse">
<stop stop-color="#048AC4"/>
<stop offset="1" stop-color="#35489B"/>
</linearGradient>
<linearGradient id="paint1_linear" x1="-6.12975" y1="3.23138" x2="34.5011" y2="18.1733" gradientUnits="userSpaceOnUse">
<stop stop-color="#048AC4"/>
<stop offset="1" stop-color="#35489B"/>
</linearGradient>
<linearGradient id="paint2_linear" x1="-7.49101" y1="6.93301" x2="33.1402" y2="21.8745" gradientUnits="userSpaceOnUse">
<stop stop-color="#048AC4"/>
<stop offset="1" stop-color="#35489B"/>
</linearGradient>
<linearGradient id="paint3_linear" x1="-5.31075" y1="22.125" x2="43.4512" y2="22.125" gradientUnits="userSpaceOnUse">
<stop stop-color="#F3F7FF"/>
<stop offset="1" stop-color="#CDD9FF"/>
</linearGradient>
<linearGradient id="paint4_linear" x1="-5.31075" y1="1.875" x2="43.4512" y2="1.875" gradientUnits="userSpaceOnUse">
<stop stop-color="#F3F7FF"/>
<stop offset="1" stop-color="#CDD9FF"/>
</linearGradient>
<linearGradient id="paint5_linear" x1="5.592" y1="-4.60463" x2="9.69863" y2="2.42962" gradientUnits="userSpaceOnUse">
<stop stop-color="#F3F7FF"/>
<stop offset="1" stop-color="#CDD9FF"/>
</linearGradient>
<linearGradient id="paint6_linear" x1="9.6525" y1="-7.53862" x2="13.7595" y2="2.50987" gradientUnits="userSpaceOnUse">
<stop stop-color="#F3F7FF"/>
<stop offset="1" stop-color="#CDD9FF"/>
</linearGradient>
</defs>
</svg>
