<svg width="18" height="17" viewBox="0 0 18 17" fill="none" xmlns="http://www.w3.org/2000/svg">
<path d="M3.37435 13C2.65605 13 1.96718 12.7147 1.45927 12.2067C0.951357 11.6988 0.666016 11.01 0.666016 10.2917V3.20833C0.666016 2.49004 0.951357 1.80116 1.45927 1.29325C1.96718 0.785341 2.65605 0.5 3.37435 0.5H14.6243C14.98 0.5 15.3322 0.570053 15.6608 0.70616C15.9894 0.842266 16.2879 1.04176 16.5394 1.29325C16.7909 1.54474 16.9904 1.84331 17.1265 2.1719C17.2626 2.50049 17.3327 2.85267 17.3327 3.20833V10.2917C17.3327 10.6473 17.2626 10.9995 17.1265 11.3281C16.9904 11.6567 16.7909 11.9553 16.5394 12.2067C16.2879 12.4582 15.9894 12.6577 15.6608 12.7938C15.3322 12.9299 14.98 13 14.6243 13H9.84268L5.66602 16.125C5.51125 16.2408 5.32731 16.3113 5.13477 16.3286C4.94224 16.3458 4.7487 16.3091 4.57581 16.2226C4.40293 16.1362 4.25752 16.0033 4.15586 15.8389C4.0542 15.6744 4.0003 15.485 4.00018 15.2917V13H3.37518H3.37435ZM9.42768 11.75H14.6243C15.0111 11.75 15.3821 11.5964 15.6555 11.3229C15.929 11.0494 16.0827 10.6784 16.0827 10.2917V3.20833C16.0827 2.82156 15.929 2.45063 15.6555 2.17714C15.3821 1.90365 15.0111 1.75 14.6243 1.75H3.37435C2.98758 1.75 2.61664 1.90365 2.34315 2.17714C2.06966 2.45063 1.91602 2.82156 1.91602 3.20833V10.2917C1.91602 11.0967 2.56935 11.75 3.37435 11.75H5.24852V14.875L9.42768 11.75Z" fill="#646464"/>
</svg>
