<svg width="8" height="8" viewBox="0 0 8 8" fill="none" xmlns="http://www.w3.org/2000/svg">
<g clip-path="url(#clip0)">
<path d="M7.78216 5.87119L6.66574 4.75477C6.26702 4.35605 5.58919 4.51555 5.4297 5.03387C5.31008 5.39274 4.91136 5.5921 4.55251 5.51234C3.75506 5.31298 2.67851 4.2763 2.47915 3.43898C2.35953 3.08012 2.59877 2.68139 2.95762 2.56179C3.47596 2.4023 3.63545 1.72448 3.23672 1.32575L2.1203 0.209329C1.80132 -0.0697765 1.32285 -0.0697765 1.04375 0.209329L0.286174 0.966903C-0.4714 1.76435 0.365918 3.87758 2.23992 5.75158C4.11391 7.62557 6.22714 8.50278 7.02459 7.70532L7.78216 6.94774C8.06128 6.62877 8.06128 6.1503 7.78216 5.87119Z" fill="#333333"/>
</g>
<defs>
<clipPath id="clip0">
<rect width="8" height="8" fill="white"/>
</clipPath>
</defs>
</svg>
