<svg width="12" height="12" viewBox="0 0 12 12" fill="none" xmlns="http://www.w3.org/2000/svg">
<path d="M12 3.96094C12 3.17789 12 2.63009 12 2.57812C12 1.99657 11.5269 1.52344 10.9453 1.52344H10.8047V2.8125C10.8047 3.00666 10.6473 3.16406 10.4531 3.16406C10.259 3.16406 10.1016 3.00666 10.1016 2.8125C10.1016 2.41784 10.1016 1.3305 10.1016 0.9375C10.1016 0.743344 9.94416 0.585938 9.75 0.585938C9.55584 0.585938 9.39844 0.743344 9.39844 0.9375V1.52344H7.05469V2.8125C7.05469 3.00666 6.89728 3.16406 6.70312 3.16406C6.50897 3.16406 6.35156 3.00666 6.35156 2.8125C6.35156 2.41784 6.35156 1.3305 6.35156 0.9375C6.35156 0.743344 6.19416 0.585938 6 0.585938C5.80584 0.585938 5.64844 0.743344 5.64844 0.9375V1.52344H3.30469V2.8125C3.30469 3.00666 3.14728 3.16406 2.95312 3.16406C2.75897 3.16406 2.60156 3.00666 2.60156 2.8125C2.60156 2.41784 2.60156 1.3305 2.60156 0.9375C2.60156 0.743344 2.44416 0.585938 2.25 0.585938C2.05584 0.585938 1.89844 0.743344 1.89844 0.9375V1.52344H1.05469C0.473133 1.52344 0 1.99657 0 2.57812V3.96094H12Z" fill="#333333"/>
<path d="M0 4.66406V10.3594C0 10.9409 0.473133 11.4141 1.05469 11.4141H10.9453C11.5269 11.4141 12 10.9409 12 10.3594C12 10.2088 12 6.91847 12 4.66406C11.7812 4.66406 0.121031 4.66406 0 4.66406ZM3.375 9.53906H2.625C2.43084 9.53906 2.27344 9.38166 2.27344 9.1875C2.27344 8.99334 2.43084 8.83594 2.625 8.83594H3.375C3.56916 8.83594 3.72656 8.99334 3.72656 9.1875C3.72656 9.38166 3.56916 9.53906 3.375 9.53906ZM3.375 8.03906H2.625C2.43084 8.03906 2.27344 7.88166 2.27344 7.6875C2.27344 7.49334 2.43084 7.33594 2.625 7.33594H3.375C3.56916 7.33594 3.72656 7.49334 3.72656 7.6875C3.72656 7.88166 3.56916 8.03906 3.375 8.03906ZM3.375 6.53906H2.625C2.43084 6.53906 2.27344 6.38166 2.27344 6.1875C2.27344 5.99334 2.43084 5.83594 2.625 5.83594H3.375C3.56916 5.83594 3.72656 5.99334 3.72656 6.1875C3.72656 6.38166 3.56916 6.53906 3.375 6.53906ZM6.375 9.53906H5.625C5.43084 9.53906 5.27344 9.38166 5.27344 9.1875C5.27344 8.99334 5.43084 8.83594 5.625 8.83594H6.375C6.56916 8.83594 6.72656 8.99334 6.72656 9.1875C6.72656 9.38166 6.56916 9.53906 6.375 9.53906ZM6.375 8.03906H5.625C5.43084 8.03906 5.27344 7.88166 5.27344 7.6875C5.27344 7.49334 5.43084 7.33594 5.625 7.33594H6.375C6.56916 7.33594 6.72656 7.49334 6.72656 7.6875C6.72656 7.88166 6.56916 8.03906 6.375 8.03906ZM6.375 6.53906H5.625C5.43084 6.53906 5.27344 6.38166 5.27344 6.1875C5.27344 5.99334 5.43084 5.83594 5.625 5.83594H6.375C6.56916 5.83594 6.72656 5.99334 6.72656 6.1875C6.72656 6.38166 6.56916 6.53906 6.375 6.53906ZM9.375 9.53906H8.625C8.43084 9.53906 8.27344 9.38166 8.27344 9.1875C8.27344 8.99334 8.43084 8.83594 8.625 8.83594H9.375C9.56916 8.83594 9.72656 8.99334 9.72656 9.1875C9.72656 9.38166 9.56916 9.53906 9.375 9.53906ZM9.375 8.03906H8.625C8.43084 8.03906 8.27344 7.88166 8.27344 7.6875C8.27344 7.49334 8.43084 7.33594 8.625 7.33594H9.375C9.56916 7.33594 9.72656 7.49334 9.72656 7.6875C9.72656 7.88166 9.56916 8.03906 9.375 8.03906ZM9.375 6.53906H8.625C8.43084 6.53906 8.27344 6.38166 8.27344 6.1875C8.27344 5.99334 8.43084 5.83594 8.625 5.83594H9.375C9.56916 5.83594 9.72656 5.99334 9.72656 6.1875C9.72656 6.38166 9.56916 6.53906 9.375 6.53906Z" fill="#333333"/>
</svg>
