<svg width="10" height="10" viewBox="0 0 10 10" fill="none" xmlns="http://www.w3.org/2000/svg">
<g clip-path="url(#clip0)">
<path d="M9.72709 7.33899L8.33156 5.94346C7.83316 5.44506 6.98587 5.64444 6.78651 6.29234C6.63699 6.74093 6.13859 6.99013 5.69002 6.89043C4.69322 6.64123 3.34753 5.34538 3.09833 4.29873C2.9488 3.85015 3.24785 3.35174 3.69641 3.20224C4.34433 3.00288 4.5437 2.15559 4.04529 1.65719L2.64976 0.261662C2.25104 -0.0872206 1.65296 -0.0872206 1.30407 0.261662L0.357107 1.20863C-0.58986 2.20544 0.456787 4.84697 2.79928 7.18947C5.14178 9.53197 7.78332 10.6285 8.78013 9.63165L9.72709 8.68468C10.076 8.28596 10.076 7.68787 9.72709 7.33899Z" fill="white"/>
</g>
<defs>
<clipPath id="clip0">
<rect width="10" height="10" fill="white"/>
</clipPath>
</defs>
</svg>
