<svg width="135" height="40" viewBox="0 0 135 40" fill="none" xmlns="http://www.w3.org/2000/svg">
<path d="M134.035 35.1489C134.035 35.648 133.936 36.1423 133.744 36.6035C133.551 37.0646 133.269 37.4835 132.913 37.8363C132.558 38.1891 132.136 38.4688 131.671 38.6595C131.206 38.8501 130.708 38.948 130.206 38.9475H4.88713C3.87142 38.9485 2.89687 38.5489 2.17781 37.8366C1.45875 37.1242 1.05406 36.1575 1.05273 35.1489V4.85629C1.05406 3.84724 1.45859 2.87995 2.17751 2.16682C2.89642 1.45368 3.87096 1.053 4.88713 1.05273H130.205C130.708 1.05273 131.206 1.15112 131.67 1.34228C132.135 1.53344 132.557 1.81362 132.913 2.16683C133.269 2.52004 133.551 2.93935 133.743 3.40081C133.935 3.86227 134.034 4.35685 134.034 4.85629L134.035 35.1489Z" fill="white"/>
<path d="M130.269 40H4.73159C3.47816 39.9997 2.27603 39.5024 1.38897 38.6171C0.501911 37.7318 0.00238493 36.5308 0 35.2777L0 4.7273C0.00185427 3.47359 0.501051 2.27181 1.38808 1.38558C2.27511 0.499356 3.47754 0.00105818 4.73159 0L130.268 0C131.522 0.00158618 132.724 0.500054 133.611 1.38616C134.498 2.27228 134.998 3.47375 135 4.7273V35.2777C135.002 37.8824 132.876 40 130.269 40Z" fill="black"/>
<path d="M134.035 35.1489C134.035 35.648 133.936 36.1423 133.744 36.6035C133.551 37.0646 133.269 37.4835 132.913 37.8363C132.558 38.1891 132.136 38.4688 131.671 38.6595C131.206 38.8501 130.708 38.948 130.206 38.9475H4.88713C3.87142 38.9485 2.89687 38.5489 2.17781 37.8366C1.45875 37.1242 1.05406 36.1575 1.05273 35.1489V4.85629C1.05406 3.84724 1.45859 2.87995 2.17751 2.16682C2.89642 1.45368 3.87096 1.053 4.88713 1.05273H130.205C130.708 1.05273 131.206 1.15112 131.67 1.34228C132.135 1.53344 132.557 1.81362 132.913 2.16683C133.269 2.52004 133.551 2.93935 133.743 3.40081C133.935 3.86227 134.034 4.35685 134.034 4.85629L134.035 35.1489Z" fill="black"/>
<path d="M30.2156 19.7503C30.1862 16.5587 32.8923 15.006 33.0161 14.9337C31.4835 12.7521 29.108 12.4541 28.2732 12.4303C26.2781 12.2253 24.3429 13.5958 23.3266 13.5958C22.29 13.5958 20.7249 12.4501 19.0382 12.4838C16.8676 12.5165 14.837 13.7434 13.7233 15.6487C11.4249 19.5335 13.1391 25.2423 15.3411 28.3824C16.4426 29.9213 17.7297 31.6374 19.4145 31.577C21.0627 31.5117 21.6784 30.5521 23.6674 30.5521C25.6381 30.5521 26.2163 31.577 27.9345 31.5384C29.7034 31.5117 30.8171 29.9936 31.88 28.4419C33.153 26.6802 33.6642 24.9433 33.6845 24.8541C33.6439 24.8403 30.2501 23.5747 30.2156 19.7503ZM26.9699 10.3646C27.8564 9.28226 28.4629 7.80974 28.2945 6.31543C27.0115 6.37088 25.4069 7.18191 24.4829 8.2405C23.6653 9.17333 22.9351 10.7023 23.1237 12.1402C24.565 12.2451 26.0449 11.4301 26.9699 10.3646Z" fill="white"/>
<path d="M53.6794 31.5148H51.4078L50.1635 27.6058H45.8383L44.653 31.5148H42.4414L46.7275 18.2068H49.3742L53.6794 31.5148ZM49.7884 25.9658L48.6631 22.4908C48.544 22.1358 48.32 21.2998 47.9919 19.9838H47.9519C47.8198 20.5498 47.6088 21.3858 47.3197 22.4908L46.2134 25.9658H49.7884ZM64.6803 26.5988C64.6803 28.2308 64.2372 29.5208 63.35 30.4678C62.5557 31.3108 61.5685 31.7318 60.3912 31.7318C59.1198 31.7318 58.2056 31.2788 57.6504 30.3708V35.4058H55.5179V25.0728C55.5179 24.0478 55.4909 22.9968 55.4389 21.9188H57.3144L57.4334 23.4398H57.4734C58.1846 22.2938 59.2639 21.7208 60.7123 21.7208C61.8446 21.7208 62.7898 22.1678 63.546 23.0628C64.3012 23.9598 64.6803 25.1378 64.6803 26.5988ZM62.5077 26.6768C62.5077 25.7428 62.2977 24.9728 61.8756 24.3658C61.4144 23.7348 60.7953 23.4188 60.0191 23.4188C59.4929 23.4188 59.0148 23.5948 58.5877 23.9418C58.1596 24.2918 57.8795 24.7488 57.7485 25.3148C57.69 25.5264 57.6567 25.7443 57.6494 25.9638V27.5648C57.6494 28.2618 57.8635 28.8508 58.2916 29.3328C58.7197 29.8128 59.2759 30.0538 59.9601 30.0538C60.7633 30.0538 61.3884 29.7428 61.8356 29.1258C62.2837 28.5068 62.5077 27.6908 62.5077 26.6768ZM75.7202 26.5988C75.7202 28.2308 75.2771 29.5208 74.3899 30.4678C73.5947 31.3108 72.6084 31.7318 71.4301 31.7318C70.1588 31.7318 69.2445 31.2788 68.6894 30.3708V35.4058H66.5568V25.0728C66.5568 24.0478 66.5298 22.9968 66.4778 21.9188H68.3533L68.4723 23.4398H68.5123C69.2225 22.2938 70.3018 21.7208 71.7512 21.7208C72.8825 21.7208 73.8277 22.1678 74.5859 23.0628C75.3401 23.9598 75.7202 25.1378 75.7202 26.5988ZM73.5467 26.6768C73.5467 25.7428 73.3356 24.9728 72.9135 24.3658C72.4524 23.7348 71.8352 23.4188 71.059 23.4188C70.5329 23.4188 70.0547 23.5948 69.6256 23.9418C69.1975 24.2918 68.9184 24.7488 68.7874 25.3148C68.7224 25.5788 68.6874 25.7938 68.6874 25.9638V27.5648C68.6874 28.2618 68.9024 28.8508 69.3285 29.3328C69.7567 29.8118 70.3128 30.0538 70.999 30.0538C71.8032 30.0538 72.4284 29.7428 72.8745 29.1258C73.3226 28.5068 73.5467 27.6908 73.5467 26.6768ZM88.0635 27.7818C88.0635 28.9148 87.6674 29.8358 86.8802 30.5468C86.014 31.3228 84.8047 31.7118 83.2542 31.7118C81.8219 31.7118 80.6736 31.4358 79.8073 30.8828L80.3005 29.1058C81.2357 29.6598 82.263 29.9358 83.3813 29.9358C84.1855 29.9358 84.8107 29.7538 85.2568 29.3928C85.7039 29.0308 85.93 28.5468 85.93 27.9428C85.93 27.4018 85.7429 26.9488 85.3758 26.5798C85.0067 26.2118 84.3965 25.8688 83.5393 25.5538C81.2087 24.6848 80.0424 23.4138 80.0424 21.7418C80.0424 20.6498 80.4545 19.7558 81.2767 19.0568C82.0989 18.3588 83.1892 18.0098 84.5456 18.0098C85.7569 18.0098 86.7662 18.2208 87.5674 18.6418L87.0323 20.3798C86.2781 19.9718 85.4268 19.7678 84.4746 19.7678C83.7224 19.7678 83.1322 19.9528 82.7101 20.3208C82.355 20.6498 82.175 21.0508 82.175 21.5268C82.175 22.0518 82.38 22.4878 82.7881 22.8298C83.1422 23.1448 83.7884 23.4878 84.7226 23.8558C85.8689 24.3178 86.7112 24.8558 87.2503 25.4738C87.7934 26.0918 88.0635 26.8628 88.0635 27.7818ZM95.1324 23.5188H92.7818V28.1778C92.7818 29.3628 93.1959 29.9538 94.0261 29.9538C94.4072 29.9538 94.7233 29.9218 94.9734 29.8548L95.0324 31.4738C94.6123 31.6308 94.0591 31.7098 93.3739 31.7098C92.5317 31.7098 91.8735 31.4528 91.3984 30.9388C90.9253 30.4248 90.6872 29.5638 90.6872 28.3518V23.5148H89.2868V21.9148H90.6872V20.1578L92.7818 19.5258V21.9148H95.1324V23.5188ZM105.717 26.6378C105.717 28.1128 105.295 29.3238 104.453 30.2708C103.572 31.2458 102.399 31.7318 100.938 31.7318C99.5276 31.7318 98.4063 31.2648 97.57 30.3318C96.7338 29.3968 96.3157 28.2188 96.3157 26.7978C96.3157 25.3108 96.7478 24.0928 97.6091 23.1458C98.4723 22.1978 99.6346 21.7238 101.096 21.7238C102.504 21.7238 103.636 22.1918 104.492 23.1258C105.31 24.0318 105.717 25.2018 105.717 26.6378ZM103.507 26.6868C103.507 25.8078 103.317 25.0538 102.935 24.4228C102.488 23.6608 101.848 23.2798 101.019 23.2798C100.165 23.2798 99.5096 23.6608 99.0634 24.4228C98.6813 25.0538 98.4913 25.8208 98.4913 26.7268C98.4913 27.6068 98.6813 28.3628 99.0634 28.9918C99.5246 29.7538 100.168 30.1348 101.001 30.1348C101.816 30.1348 102.455 29.7458 102.917 28.9728C103.31 28.3268 103.507 27.5678 103.507 26.6868ZM112.652 23.7938C112.43 23.7537 112.205 23.734 111.98 23.7348C111.23 23.7348 110.65 24.0168 110.241 24.5848C109.887 25.0848 109.709 25.7168 109.709 26.4798V31.5148H107.577V24.9408C107.579 23.9334 107.558 22.9262 107.515 21.9198H109.372L109.45 23.7558H109.509C109.735 23.1248 110.089 22.6158 110.576 22.2348C111.02 21.9018 111.561 21.7216 112.117 21.7208C112.314 21.7208 112.492 21.7348 112.65 21.7598L112.652 23.7938ZM122.19 26.2628C122.195 26.5869 122.169 26.9107 122.112 27.2298H115.714C115.738 28.1778 116.048 28.9038 116.642 29.4038C117.181 29.8498 117.878 30.0738 118.735 30.0738C119.682 30.0738 120.546 29.9238 121.323 29.6208L121.657 31.0998C120.749 31.4958 119.677 31.6928 118.44 31.6928C116.951 31.6928 115.783 31.2548 114.933 30.3808C114.084 29.5058 113.659 28.3298 113.659 26.8568C113.659 25.4108 114.054 24.2058 114.846 23.2448C115.674 22.2188 116.793 21.7058 118.202 21.7058C119.585 21.7058 120.632 22.2188 121.343 23.2448C121.907 24.0578 122.19 25.0658 122.19 26.2628ZM120.156 25.7098C120.171 25.0768 120.031 24.5318 119.742 24.0708C119.373 23.4768 118.805 23.1808 118.043 23.1808C117.346 23.1808 116.778 23.4698 116.346 24.0498C115.991 24.5108 115.78 25.0648 115.715 25.7078L120.156 25.7098Z" fill="white"/>
<path d="M45.2229 13.5025C44.6297 13.5025 44.1166 13.4735 43.6895 13.4245V6.99045C44.2868 6.8982 44.8905 6.85273 45.4949 6.85445C47.9406 6.85445 49.0669 8.05745 49.0669 10.0185C49.0669 12.2805 47.7365 13.5025 45.2229 13.5025ZM45.581 7.67945C45.2509 7.67945 44.9698 7.69945 44.7367 7.74745V12.6385C44.8628 12.6585 45.1048 12.6675 45.4449 12.6675C47.0473 12.6675 47.9596 11.7555 47.9596 10.0475C47.9596 8.52446 47.1344 7.67945 45.581 7.67945ZM52.5768 13.5515C51.1984 13.5515 50.3052 12.5225 50.3052 11.1255C50.3052 9.66946 51.2175 8.63145 52.6548 8.63145C54.0132 8.63145 54.9264 9.61146 54.9264 11.0485C54.9264 12.5225 53.9852 13.5515 52.5768 13.5515ZM52.6168 9.39746C51.8596 9.39746 51.3745 10.1055 51.3745 11.0955C51.3745 12.0665 51.8696 12.7745 52.6068 12.7745C53.344 12.7745 53.8391 12.0175 53.8391 11.0755C53.8391 10.1155 53.354 9.39746 52.6168 9.39746ZM62.7865 8.72846L61.3111 13.4445H60.3499L59.7387 11.3965C59.5868 10.8955 59.4602 10.3872 59.3596 9.87346H59.3396C59.2626 10.3875 59.1165 10.9025 58.9615 11.3965L58.3113 13.4445H57.3401L55.9517 8.72846H57.029L57.5631 10.9705C57.6892 11.5045 57.7952 12.0085 57.8832 12.4845H57.9032C57.9802 12.0875 58.1063 11.5915 58.2913 10.9805L58.9615 8.72946H59.8157L60.4569 10.9325C60.6119 11.4665 60.738 11.9905 60.836 12.4855H60.864C60.932 12.0005 61.0391 11.4855 61.1841 10.9325L61.7573 8.72946L62.7865 8.72846ZM68.218 13.4445H67.1697V10.7365C67.1697 9.90246 66.8496 9.48446 66.2184 9.48446C65.5973 9.48446 65.1702 10.0185 65.1702 10.6395V13.4445H64.1219V10.0765C64.1219 9.65946 64.1119 9.21246 64.0829 8.72745H65.0051L65.0541 9.45546H65.0831C65.3652 8.95146 65.9374 8.63145 66.5785 8.63145C67.5688 8.63145 68.219 9.38846 68.219 10.6205L68.218 13.4445ZM71.1087 13.4445H70.0595V6.56445H71.1087V13.4445ZM74.9308 13.5515C73.5534 13.5515 72.6591 12.5225 72.6591 11.1255C72.6591 9.66946 73.5714 8.63145 75.0078 8.63145C76.3671 8.63145 77.2794 9.61146 77.2794 11.0485C77.2804 12.5225 76.3381 13.5515 74.9308 13.5515ZM74.9698 9.39746C74.2126 9.39746 73.7274 10.1055 73.7274 11.0955C73.7274 12.0665 74.2236 12.7745 74.9588 12.7745C75.697 12.7745 76.1911 12.0175 76.1911 11.0755C76.1921 10.1155 75.708 9.39746 74.9698 9.39746ZM81.4125 13.4445L81.3365 12.9015H81.3084C80.9884 13.3385 80.5212 13.5515 79.9291 13.5515C79.0839 13.5515 78.4837 12.9595 78.4837 12.1635C78.4837 10.9995 79.493 10.3975 81.2404 10.3975V10.3105C81.2404 9.68946 80.9113 9.37846 80.2612 9.37846C79.796 9.37846 79.3879 9.49546 79.0288 9.72846L78.8158 9.03946C79.2519 8.76745 79.796 8.63145 80.4352 8.63145C81.6675 8.63145 82.2897 9.28146 82.2897 10.5825V12.3195C82.2897 12.7955 82.3107 13.1645 82.3577 13.4455L81.4125 13.4445ZM81.2684 11.0955C80.1041 11.0955 79.52 11.3775 79.52 12.0465C79.52 12.5415 79.8211 12.7835 80.2392 12.7835C80.7723 12.7835 81.2684 12.3765 81.2684 11.8235V11.0955ZM87.3801 13.4445L87.331 12.6875H87.302C87.001 13.2595 86.4948 13.5515 85.7876 13.5515C84.6503 13.5515 83.8081 12.5515 83.8081 11.1445C83.8081 9.66946 84.6813 8.63046 85.8737 8.63046C86.5048 8.63046 86.9519 8.84346 87.204 9.27146H87.225V6.56445H88.2743V12.1735C88.2743 12.6295 88.2853 13.0565 88.3133 13.4445H87.3801ZM87.225 10.6695C87.225 10.0095 86.7879 9.44646 86.1207 9.44646C85.3435 9.44646 84.8684 10.1355 84.8684 11.1055C84.8684 12.0565 85.3615 12.7075 86.0997 12.7075C86.7589 12.7075 87.225 12.1345 87.225 11.4555V10.6695ZM94.9271 13.5515C93.5497 13.5515 92.6565 12.5225 92.6565 11.1255C92.6565 9.66946 93.5687 8.63145 95.0051 8.63145C96.3644 8.63145 97.2767 9.61146 97.2767 11.0485C97.2777 12.5225 96.3364 13.5515 94.9271 13.5515ZM94.9661 9.39746C94.2099 9.39746 93.7247 10.1055 93.7247 11.0955C93.7247 12.0665 94.2199 12.7745 94.9561 12.7745C95.6943 12.7745 96.1884 12.0175 96.1884 11.0755C96.1904 10.1155 95.7053 9.39746 94.9661 9.39746ZM102.914 13.4445H101.865V10.7365C101.865 9.90246 101.545 9.48446 100.914 9.48446C100.292 9.48446 99.8664 10.0185 99.8664 10.6395V13.4445H98.8171V10.0765C98.8171 9.65946 98.8071 9.21246 98.7781 8.72745H99.7003L99.7493 9.45546H99.7784C100.059 8.95146 100.633 8.63046 101.273 8.63046C102.263 8.63046 102.914 9.38746 102.914 10.6195V13.4445ZM109.967 9.51446H108.814V11.8045C108.814 12.3875 109.016 12.6785 109.424 12.6785C109.609 12.6785 109.764 12.6585 109.889 12.6295L109.918 13.4255C109.715 13.5035 109.443 13.5425 109.105 13.5425C108.279 13.5425 107.784 13.0865 107.784 11.8925V9.51446H107.096V8.72846H107.784V7.86445L108.814 7.55345V8.72745H109.967V9.51446ZM115.517 13.4445H114.469V10.7565C114.469 9.91246 114.15 9.48546 113.518 9.48546C112.975 9.48546 112.469 9.85446 112.469 10.6015V13.4445H111.421V6.56445H112.469V9.39746H112.49C112.82 8.88345 113.298 8.63046 113.908 8.63046C114.906 8.63046 115.517 9.40646 115.517 10.6395V13.4445ZM121.202 11.3385H118.056C118.076 12.2315 118.667 12.7355 119.543 12.7355C120.008 12.7355 120.436 12.6575 120.814 12.5125L120.977 13.2405C120.531 13.4345 120.006 13.5315 119.395 13.5315C117.919 13.5315 117.046 12.5995 117.046 11.1545C117.046 9.70846 117.94 8.62145 119.277 8.62145C120.482 8.62145 121.238 9.51446 121.238 10.8635C121.245 11.0227 121.233 11.1821 121.202 11.3385ZM120.241 10.5915C120.241 9.86346 119.874 9.34946 119.204 9.34946C118.601 9.34946 118.125 9.87346 118.057 10.5915H120.241Z" fill="white"/>
</svg>
