<svg width="16" height="16" viewBox="0 0 16 16" fill="none" xmlns="http://www.w3.org/2000/svg">
<path d="M11.0147 6.875C11.0147 6.52981 10.7348 6.25 10.3897 6.25H3.95215C3.60696 6.25 3.32715 6.52981 3.32715 6.875C3.32715 7.22019 3.60696 7.5 3.95215 7.5H10.3897C10.7348 7.5 11.0147 7.22019 11.0147 6.875Z" fill="#207BC1"/>
<path d="M3.95215 8.75C3.60696 8.75 3.32715 9.02981 3.32715 9.375C3.32715 9.72019 3.60696 10 3.95215 10H7.86186C8.20705 10 8.48686 9.72019 8.48686 9.375C8.48686 9.02981 8.20705 8.75 7.86186 8.75H3.95215Z" fill="#207BC1"/>
<path d="M5.42085 14.75H3.33057C2.64132 14.75 2.08057 14.1892 2.08057 13.5V2.5C2.08057 1.81075 2.64132 1.25 3.33057 1.25H11.0146C11.7038 1.25 12.2646 1.81075 12.2646 2.5V6.34375C12.2646 6.68894 12.5444 6.96875 12.8896 6.96875C13.2348 6.96875 13.5146 6.68894 13.5146 6.34375V2.5C13.5146 1.1215 12.3931 0 11.0146 0H3.33057C1.95207 0 0.830566 1.1215 0.830566 2.5V13.5C0.830566 14.8785 1.95207 16 3.33057 16H5.42085C5.76604 16 6.04585 15.7202 6.04585 15.375C6.04585 15.0298 5.76604 14.75 5.42085 14.75Z" fill="#207BC1"/>
<path d="M14.6213 9.0491C13.8902 8.31804 12.7007 8.31801 11.9701 9.0486L8.53875 12.4723C8.46588 12.5451 8.41213 12.6346 8.38219 12.7331L7.63491 15.1933C7.56866 15.4114 7.62638 15.6483 7.78557 15.8114C7.90482 15.9336 8.06682 16 8.23297 16C8.28857 16 8.34469 15.9925 8.39978 15.9773L10.9224 15.2785C11.0263 15.2497 11.1209 15.1946 11.1971 15.1185L14.6213 11.7008C15.3523 10.9697 15.3523 9.78023 14.6213 9.0491ZM10.4304 14.1177L9.16125 14.4693L9.53266 13.2465L11.8479 10.9364L12.732 11.8204L10.4304 14.1177ZM13.7378 10.8165L13.6168 10.9374L12.7328 10.0535L12.8535 9.93304C13.0972 9.68935 13.4937 9.68935 13.7374 9.93304C13.9811 10.1767 13.9811 10.5732 13.7378 10.8165Z" fill="#207BC1"/>
<path d="M10.3897 3.75H3.95215C3.60696 3.75 3.32715 4.02981 3.32715 4.375C3.32715 4.72019 3.60696 5 3.95215 5H10.3897C10.7348 5 11.0147 4.72019 11.0147 4.375C11.0147 4.02981 10.7348 3.75 10.3897 3.75Z" fill="#207BC1"/>
</svg>
