<svg width="16" height="16" viewBox="0 0 16 16" fill="none" xmlns="http://www.w3.org/2000/svg">
<path d="M8.625 4.3125V7.74113L10.9003 10.0164C11.1444 10.2605 11.1444 10.6562 10.9003 10.9003C10.6562 11.1444 10.2605 11.1443 10.0164 10.9003L7.55806 8.44194C7.44084 8.32475 7.375 8.16575 7.375 8V4.3125C7.375 3.96731 7.65481 3.6875 8 3.6875C8.34519 3.6875 8.625 3.96731 8.625 4.3125ZM10.4583 0H5.54166C4.23259 0 2.94112 0.460063 1.90778 1.35869V0.625C1.90778 0.279813 1.62797 0 1.28278 0C0.937594 0 0.657781 0.279813 0.657781 0.625V3.08334C0.657781 3.42853 0.94 3.70834 1.28278 3.70834H3.74113C4.08631 3.70834 4.36613 3.42853 4.36613 3.08334C4.36613 2.73816 4.08631 2.45834 3.74113 2.45834H2.55884C3.34991 1.69569 4.41775 1.25 5.54166 1.25H10.4583C12.8248 1.25 14.75 3.17522 14.75 5.54166V10.4583C14.75 12.8248 12.8248 14.75 10.4583 14.75H5.54166C3.17522 14.75 1.25 12.8248 1.25 10.4583V8C1.25 7.65481 0.970187 7.375 0.625 7.375C0.279813 7.375 0 7.65481 0 8V10.4583C0 13.514 2.48597 16 5.54166 16H10.4583C13.514 16 16 13.514 16 10.4583V5.54166C16 2.48597 13.514 0 10.4583 0V0Z" fill="#207BC1"/>
</svg>
