<svg width="14" height="12" viewBox="0 0 14 12" fill="none" xmlns="http://www.w3.org/2000/svg">
<path d="M0.315789 1.89474H1.92695C2.07347 2.61474 2.71137 3.15789 3.47368 3.15789C4.236 3.15789 4.8739 2.61474 5.02042 1.89474H13.5789C13.7526 1.89474 13.8947 1.75326 13.8947 1.57895C13.8947 1.40463 13.7526 1.26316 13.5789 1.26316H5.02042C4.8739 0.543158 4.236 0 3.47368 0C2.71137 0 2.07347 0.543158 1.92695 1.26316H0.315789C0.141474 1.26316 0 1.40463 0 1.57895C0 1.75326 0.141474 1.89474 0.315789 1.89474ZM3.47368 0.631579C3.996 0.631579 4.42105 1.05663 4.42105 1.57895C4.42105 2.10126 3.996 2.52632 3.47368 2.52632C2.95137 2.52632 2.52632 2.10126 2.52632 1.57895C2.52632 1.05663 2.95137 0.631579 3.47368 0.631579Z" fill="white"/>
<path d="M13.5789 5.68418H12.5994C12.4528 4.96418 11.8149 4.42102 11.0526 4.42102C10.2903 4.42102 9.65242 4.96418 9.5059 5.68418H0.315789C0.141474 5.68418 0 5.82565 0 5.99997C0 6.17428 0.141474 6.31576 0.315789 6.31576H9.5059C9.65242 7.03639 10.2903 7.57892 11.0526 7.57892C11.8149 7.57892 12.4528 7.03639 12.5994 6.31576H13.5789C13.7526 6.31576 13.8947 6.17428 13.8947 5.99997C13.8947 5.82565 13.7526 5.68418 13.5789 5.68418ZM11.0526 6.94734C10.5303 6.94734 10.1053 6.52228 10.1053 5.99997C10.1053 5.47765 10.5303 5.0526 11.0526 5.0526C11.5749 5.0526 12 5.47765 12 5.99997C12 6.52228 11.5749 6.94734 11.0526 6.94734Z" fill="white"/>
<path d="M13.5789 10.1053H8.49411C8.34758 9.38469 7.70968 8.84216 6.94737 8.84216C6.18505 8.84216 5.54716 9.38469 5.40063 10.1053H0.315789C0.141474 10.1053 0 10.2474 0 10.4211C0 10.5948 0.141474 10.7369 0.315789 10.7369H5.40063C5.54716 11.4575 6.18505 12.0001 6.94737 12.0001C7.70968 12.0001 8.34758 11.4575 8.49411 10.7369H13.5789C13.7526 10.7369 13.8947 10.5948 13.8947 10.4211C13.8947 10.2474 13.7526 10.1053 13.5789 10.1053ZM6.94737 11.3685C6.42505 11.3685 6 10.9434 6 10.4211C6 9.89879 6.42505 9.47374 6.94737 9.47374C7.46968 9.47374 7.89474 9.89879 7.89474 10.4211C7.89474 10.9434 7.46968 11.3685 6.94737 11.3685Z" fill="white"/>
</svg>
