<svg width="23" height="17" viewBox="0 0 23 17" fill="none" xmlns="http://www.w3.org/2000/svg">
<path d="M1.19477 9.22143L6.99005 15.5964C7.35225 16.0214 8.11288 16.0568 8.54753 15.7027C8.98217 15.3131 9.01839 14.6048 8.61997 14.1798L4.41839 9.5756H20.8263C21.442 9.5756 21.9129 9.11518 21.9129 8.5131C21.9129 7.91101 21.442 7.4506 20.8263 7.4506H4.41839L8.61997 2.84643C9.01839 2.42143 8.98217 1.71308 8.54753 1.3235C8.11288 0.933912 7.38847 0.969346 7.02627 1.42976L1.23099 7.80476C0.796346 8.3006 0.832566 8.76101 1.19477 9.22143Z" fill="white"/>
</svg>
