<svg width="8" height="8" viewBox="0 0 8 8" fill="none" xmlns="http://www.w3.org/2000/svg">
<path d="M7.78167 5.87119L6.66525 4.75477C6.26653 4.35605 5.5887 4.51555 5.42921 5.03387C5.30959 5.39274 4.91087 5.5921 4.55202 5.51234C3.75457 5.31298 2.67802 4.2763 2.47866 3.43898C2.35904 3.08012 2.59828 2.68139 2.95713 2.56179C3.47547 2.4023 3.63496 1.72448 3.23623 1.32575L2.11981 0.209329C1.80083 -0.0697765 1.32236 -0.0697765 1.04326 0.209329L0.285685 0.966903C-0.471888 1.76435 0.36543 3.87758 2.23943 5.75158C4.11342 7.62557 6.22666 8.50278 7.0241 7.70532L7.78167 6.94774C8.0608 6.62877 8.0608 6.1503 7.78167 5.87119Z" fill="#333333"/>
</svg>
