<svg width="16" height="16" viewBox="0 0 16 16" fill="none" xmlns="http://www.w3.org/2000/svg">
<path d="M13.1427 7.99963C12.8271 7.99963 12.5712 8.25546 12.5712 8.57106V14.2853C12.5712 14.6009 12.3154 14.8567 11.9998 14.8567H1.71426C1.39866 14.8567 1.14283 14.6009 1.14283 14.2853V2.85684C1.14283 2.54124 1.39866 2.28541 1.71426 2.28541H8.57131C8.88691 2.28541 9.14275 2.02958 9.14275 1.71398C9.14275 1.39838 8.88691 1.14258 8.57131 1.14258H1.71426C0.767501 1.14258 0 1.91008 0 2.85684V14.2853C0 15.232 0.767501 15.9995 1.71426 15.9995H11.9998C12.9466 15.9995 13.7141 15.232 13.7141 14.2853V8.57103C13.7141 8.25546 13.4583 7.99963 13.1427 7.99963Z" fill="#9FA2B4"/>
<path d="M15.3594 0.640782C14.9491 0.23043 14.3926 -5.7923e-05 13.8123 9.04044e-06C13.2317 -0.00166504 12.6747 0.229225 12.2655 0.64115L4.7387 8.1673C4.67625 8.23021 4.62915 8.30668 4.60099 8.39072L3.45815 11.8193C3.35841 12.1187 3.5203 12.4422 3.81972 12.542C3.87781 12.5613 3.93865 12.5712 3.99986 12.5712C4.06119 12.5711 4.12216 12.5613 4.18042 12.5421L7.60896 11.3993C7.69316 11.3712 7.76967 11.3238 7.83238 11.261L15.3592 3.73426C16.2134 2.88007 16.2135 1.49507 15.3594 0.640782Z" fill="#9FA2B4"/>
</svg>
