<svg width="11" height="11" viewBox="0 0 11 11" fill="none" xmlns="http://www.w3.org/2000/svg">
<path d="M8.9375 1.34375H2.1875C1.72217 1.34375 1.34375 1.72091 1.34375 2.18413V7.25338C1.34375 7.71659 1.72217 8.09375 2.1875 8.09375H3.45312V9.78125L6.13245 8.09375H8.9375C9.40283 8.09375 9.78125 7.71659 9.78125 7.25338V2.18413C9.78058 1.96087 9.69136 1.74699 9.53318 1.58944C9.37499 1.43189 9.16076 1.34353 8.9375 1.34375Z" fill="white"/>
</svg>
