<svg width="19" height="19" viewBox="0 0 19 19" fill="none" xmlns="http://www.w3.org/2000/svg">
<g clip-path="url(#clip0)">
<path d="M3.21875 11.5939V0.966797L17.0662 6.44137L3.21875 11.5939Z" fill="white"/>
<path d="M3.22047 18.0339C3.04271 18.0339 2.89844 17.8896 2.89844 17.7119V0.322034C2.89844 0.144271 3.04271 0 3.22047 0C3.39823 0 3.54251 0.144271 3.54251 0.322034V17.7119C3.54251 17.8896 3.39823 18.0339 3.22047 18.0339Z" fill="#E7ECED"/>
<path d="M1.93359 17.7129H4.50986V19.001H1.93359V17.7129Z" fill="#7383BF"/>
<path d="M4.83157 10.9944V8.69508C4.83157 8.51732 4.6873 8.37305 4.50953 8.37305C4.33177 8.37305 4.1875 8.51732 4.1875 8.69508V11.234L4.83157 10.9944Z" fill="#F0A500"/>
</g>
<defs>
<clipPath id="clip0">
<rect width="19" height="19" fill="white"/>
</clipPath>
</defs>
</svg>
