<svg width="14" height="14" viewBox="0 0 14 14" fill="none" xmlns="http://www.w3.org/2000/svg">
<path d="M12.5477 7L13.8048 5.77022C13.987 5.58803 14.0416 5.37851 13.9688 5.14166C13.8959 4.8866 13.741 4.73173 13.5042 4.67708L11.7825 4.23982L12.2744 2.54545C12.3473 2.29039 12.2926 2.07176 12.1104 1.88957C11.9282 1.70738 11.7096 1.65272 11.4545 1.7256L9.76018 2.21751L9.32292 0.495817C9.26827 0.25897 9.1134 0.104109 8.85834 0.0312326C8.62149 -0.0416434 8.41197 0.0130136 8.22978 0.195204L7 1.47964L5.77022 0.195204C5.60625 0.0130136 5.39673 -0.0416434 5.14166 0.0312326C4.8866 0.0858896 4.73173 0.240751 4.67708 0.495817L4.23982 2.21751L2.54545 1.7256C2.29039 1.65272 2.07176 1.70738 1.88957 1.88957C1.70738 2.07176 1.65272 2.29039 1.7256 2.54545L2.21751 4.23982L0.495817 4.67708C0.25897 4.73173 0.104109 4.8866 0.0312326 5.14166C-0.0416434 5.37851 0.0130136 5.58803 0.195204 5.77022L1.45231 7L0.195204 8.22978C0.0130136 8.41197 -0.0416434 8.6306 0.0312326 8.88567C0.104109 9.12251 0.25897 9.26827 0.495817 9.32292L2.21751 9.76018L1.7256 11.4545C1.65272 11.7096 1.70738 11.9282 1.88957 12.1104C2.07176 12.2926 2.29039 12.3473 2.54545 12.2744L4.23982 11.7825L4.67708 13.5042C4.73173 13.7592 4.87749 13.9141 5.11433 13.9688C5.3694 14.0416 5.58803 13.987 5.77022 13.8048L7 12.5477L8.22978 13.8048C8.39375 13.987 8.60327 14.0416 8.85834 13.9688C9.1134 13.9141 9.26827 13.7592 9.32292 13.5042L9.76018 11.7825L11.4545 12.2744C11.7096 12.3473 11.9282 12.2926 12.1104 12.1104C12.2926 11.9282 12.3473 11.7096 12.2744 11.4545L11.7825 9.76018L13.5042 9.32292C13.741 9.26827 13.8959 9.12251 13.9688 8.88567C14.0416 8.6306 13.987 8.41197 13.8048 8.22978L12.5477 7Z" fill="#FFF"/>
<path fill-rule="evenodd" clip-rule="evenodd" d="M5.81431 9.65743L3.39815 7.15375C3.33063 7.08336 3.29688 6.99287 3.29688 6.88226C3.29688 6.77166 3.33063 6.68117 3.39815 6.61078L3.93347 6.06781C4.00099 5.98737 4.08538 5.94715 4.18666 5.94715C4.28794 5.94715 4.37715 5.98737 4.45432 6.06781L6.07474 7.75705L9.54706 4.13726C9.62423 4.05682 9.71345 4.0166 9.81472 4.0166C9.916 4.0166 10.0004 4.05682 10.0679 4.13726L10.6032 4.68023C10.6707 4.75061 10.7045 4.84111 10.7045 4.95171C10.7045 5.06232 10.6707 5.15281 10.6032 5.2232L6.33516 9.65743C6.26764 9.73787 6.18084 9.77809 6.07474 9.77809C5.96864 9.77809 5.88183 9.73787 5.81431 9.65743Z" fill="#5CC46A"/>
</svg>
