<svg width="16" height="16" viewBox="0 0 16 16" fill="none" xmlns="http://www.w3.org/2000/svg">
<g clip-path="url(#clip0)">
<path d="M15.9373 14.4892L14.8389 11.2926C15.3672 10.2246 15.6466 9.03431 15.6485 7.83656C15.6517 5.774 14.8536 3.82372 13.4013 2.3451C11.9488 0.866197 10.0132 0.0337616 7.95118 0.0010429C6.87084 -0.0163008 5.82253 0.182761 4.83378 0.592042C3.88013 0.986822 3.02491 1.55867 2.29191 2.29166C1.55888 3.02466 0.987038 3.87988 0.592289 4.83353C0.183009 5.82228 -0.0158344 6.87112 0.00125934 7.95093C0.0339155 10.013 0.866383 11.9486 2.34529 13.4011C3.82103 14.8506 5.76628 15.6484 7.8244 15.6483C7.82843 15.6483 7.83268 15.6483 7.83671 15.6483C9.03446 15.6465 10.2248 15.367 11.2928 14.8387L14.4894 15.9371C14.6124 15.9794 14.7384 16 14.863 16C15.159 16 15.447 15.8837 15.6654 15.6652C15.9757 15.355 16.0799 14.9043 15.9373 14.4892ZM14.9946 14.9945C14.9632 15.026 14.8958 15.0737 14.7976 15.04L11.4103 13.8761C11.3602 13.8589 11.3081 13.8503 11.2562 13.8503C11.1796 13.8503 11.1034 13.8689 11.0344 13.9054C10.0554 14.4233 8.94918 14.698 7.83521 14.6997C4.09928 14.7057 1.00891 11.6712 0.949726 7.9359C0.919945 6.05656 1.63482 4.29028 2.96266 2.96244C4.2905 1.63463 6.05625 0.919885 7.93612 0.949604C11.6714 1.00882 14.7056 4.09766 14.6998 7.83509C14.6981 8.94909 14.4234 10.0553 13.9055 11.0342C13.8442 11.1501 13.8336 11.2862 13.8762 11.4102L15.0402 14.7975C15.0739 14.8956 15.0261 14.963 14.9946 14.9945Z" fill="white"/>
<path d="M7.74717 11.3359C7.49908 11.3359 7.26139 11.5541 7.27286 11.8102C7.28436 12.0672 7.48127 12.2846 7.74717 12.2846C7.99527 12.2846 8.23296 12.0664 8.22149 11.8102C8.20999 11.5532 8.01308 11.3359 7.74717 11.3359Z" fill="white"/>
<path d="M7.74717 3.98975C6.44595 3.98975 5.38733 5.04837 5.38733 6.34958C5.38733 6.61152 5.5997 6.8239 5.86164 6.8239C6.12358 6.8239 6.33595 6.61152 6.33595 6.34958C6.33595 5.57146 6.96905 4.93837 7.74717 4.93837C8.5253 4.93837 9.15839 5.57146 9.15839 6.34958C9.15839 7.12771 8.5253 7.7608 7.74717 7.7608C7.48523 7.7608 7.27286 7.97317 7.27286 8.23511V10.1696C7.27286 10.4316 7.48523 10.644 7.74717 10.644C8.00911 10.644 8.22148 10.4316 8.22148 10.1696V8.66152C9.29614 8.44136 10.107 7.48839 10.107 6.34958C10.107 5.04837 9.04839 3.98975 7.74717 3.98975Z" fill="white"/>
</g>
<defs>
<clipPath id="clip0">
<rect width="16" height="16" fill="white"/>
</clipPath>
</defs>
</svg>
