<svg width="10" height="9" viewBox="0 0 10 9" fill="none" xmlns="http://www.w3.org/2000/svg">
<path d="M9.08985 0.0340591C6.46016 0.828852 4.4014 3.46232 2.98717 5.95698C2.46258 5.21461 1.938 4.47223 1.41341 3.72987C0.855698 2.94062 -0.424006 3.70871 0.140829 4.50805C0.906252 5.59123 1.67167 6.67442 2.43709 7.7576C2.74548 8.19405 3.42542 8.31448 3.70967 7.7576C4.19744 6.80194 4.78223 5.88504 5.40859 5.02401C6.44885 3.59402 7.7779 2.03574 9.48164 1.52081C10.3911 1.24593 10.0043 -0.242318 9.08985 0.0340591Z" fill="#207BC1"/>
</svg>
