<svg width="272" height="241" viewBox="0 0 272 241" fill="none" xmlns="http://www.w3.org/2000/svg">
<path d="M181 162C184 166.5 195 196.5 195.5 201.5C196 206.5 198 218 186.5 222C184.688 222.63 182.28 222.851 179.5 222.769L183.5 240.5H94.9999C96.6285 234.405 98.648 224.898 99.948 214.5C97.2986 213.833 91.5999 212.3 89.9999 211.5C88.3999 210.7 88.6666 208.167 88.9999 207C89.5 204.833 90.8001 200.4 92 200C93.1999 199.6 98.6001 200.167 101.15 200.5C101.577 190.448 100.938 180.585 98.3111 173C102.514 164.706 109.962 156.538 122.5 152.5C124.777 151.767 127.034 151.176 129.26 150.713C130.01 150.557 130.757 150.416 131.5 150.288C137.279 149.295 142.833 149.141 148 149.543C165.739 150.926 178.916 158.875 181 162Z" fill="#CAEDEA"/>
<path d="M137 212C139.106 213.264 164.633 222.334 179.5 222.769L183.5 240.5H95C96.6286 234.405 98.6481 224.898 99.948 214.5C100.519 209.934 100.951 205.197 101.15 200.5C113.252 199.649 125.129 201.143 135.949 203.802C135.437 206.763 134.583 210.55 137 212Z" fill="#ADDDD8"/>
<path d="M130.999 158.5C130.833 156.026 130.699 150.919 131.499 150.288C130.999 144.577 146 135 146 140.5C146 144.9 147.333 148.363 147.999 149.544C147.55 151.829 141.45 157.238 137.315 160.126C136.847 160.453 136.405 160.747 135.999 161C135.005 161.622 134.177 161.777 133.499 161.644C131.997 161.351 131.229 159.649 130.999 158.5Z" fill="#FF8974"/>
<path fill-rule="evenodd" clip-rule="evenodd" d="M145.619 138.682C146.215 139.051 146.5 139.691 146.5 140.5C146.5 144.812 147.809 148.19 148.435 149.298L148.526 149.459L148.49 149.64C148.352 150.342 147.814 151.192 147.112 152.068C146.393 152.965 145.442 153.963 144.384 154.971C142.268 156.987 139.689 159.078 137.601 160.536C137.128 160.866 136.679 161.165 136.264 161.424C135.196 162.092 134.24 162.298 133.404 162.135C132.479 161.955 131.811 161.345 131.358 160.673C130.904 160 130.634 159.222 130.509 158.598L130.503 158.566L130.501 158.534C130.417 157.287 130.341 155.375 130.387 153.689C130.41 152.848 130.464 152.048 130.567 151.41C130.618 151.092 130.683 150.798 130.77 150.554C130.821 150.409 130.89 150.251 130.989 150.112C130.945 148.537 131.875 146.821 133.169 145.257C134.542 143.597 136.411 142.004 138.288 140.772C140.154 139.547 142.085 138.641 143.588 138.412C144.335 138.298 145.062 138.337 145.619 138.682ZM131.77 150.749C131.754 150.781 131.735 150.826 131.713 150.888C131.654 151.053 131.6 151.281 131.554 151.569C131.462 152.143 131.409 152.893 131.387 153.717C131.342 155.346 131.414 157.205 131.496 158.433C131.604 158.952 131.83 159.585 132.187 160.114C132.55 160.652 133.017 161.041 133.595 161.154C134.114 161.255 134.813 161.152 135.734 160.576C136.132 160.328 136.567 160.039 137.028 159.716C139.075 158.287 141.614 156.229 143.694 154.247C144.735 153.256 145.651 152.292 146.332 151.443C146.786 150.875 147.111 150.387 147.307 149.994C142.42 149.661 137.196 149.834 131.77 150.749ZM147.168 148.983C146.444 147.334 145.5 144.245 145.5 140.5C145.5 139.934 145.316 139.671 145.093 139.533C144.832 139.371 144.391 139.301 143.739 139.4C142.446 139.598 140.658 140.412 138.836 141.608C137.026 142.796 135.238 144.325 133.939 145.895C132.812 147.258 132.114 148.579 132.003 149.697C137.293 148.838 142.389 148.671 147.168 148.983Z" fill="#FF8974"/>
<path d="M146 140.5C146 144.9 147.333 148.363 148 149.544C147.811 150.505 146.622 152.019 145 153.666C141 154.198 134.333 151.636 131.5 150.288C130.999 144.577 146 135 146 140.5Z" fill="#A75F5A"/>
<path fill-rule="evenodd" clip-rule="evenodd" d="M145.619 138.682C146.215 139.051 146.5 139.691 146.5 140.5C146.5 144.812 147.81 148.19 148.435 149.298L148.526 149.459L148.49 149.64C148.373 150.237 147.969 150.932 147.438 151.646C146.896 152.376 146.176 153.184 145.356 154.017L145.236 154.139L145.066 154.161C142.956 154.442 140.203 153.907 137.671 153.162C135.122 152.411 132.722 151.424 131.285 150.74L131.026 150.617L131.001 150.332C130.858 148.698 131.815 146.894 133.169 145.257C134.543 143.597 136.411 142.004 138.288 140.772C140.154 139.547 142.085 138.641 143.588 138.412C144.335 138.298 145.062 138.337 145.619 138.682ZM132.003 149.697C132.114 148.579 132.812 147.258 133.939 145.895C135.238 144.325 137.026 142.796 138.836 141.608C140.658 140.412 142.446 139.598 143.739 139.4C144.391 139.301 144.832 139.371 145.093 139.533C145.316 139.671 145.5 139.934 145.5 140.5C145.5 144.245 146.444 147.334 147.168 148.983C142.389 148.671 137.293 148.838 132.003 149.697ZM147.307 149.994C142.864 149.691 138.143 149.806 133.245 150.518C134.566 151.072 136.225 151.694 137.954 152.202C140.39 152.92 142.893 153.393 144.766 153.19C145.515 152.422 146.157 151.694 146.636 151.049C146.937 150.644 147.159 150.291 147.307 149.994Z" fill="#A75F5A"/>
<path d="M131 167.5C131 168.328 130.552 169 130 169C129.448 169 129 168.328 129 167.5C129 166.672 129.448 166 130 166C130.552 166 131 166.672 131 167.5Z" fill="#6DCEC6"/>
<path d="M132 173.5C132 174.328 131.552 175 131 175C130.448 175 130 174.328 130 173.5C130 172.672 130.448 172 131 172C131.552 172 132 172.672 132 173.5Z" fill="#6DCEC6"/>
<path d="M82 240C82 239.448 82.4477 239 83 239H121C121.552 239 122 239.448 122 240C122 240.552 121.552 241 121 241H83C82.4477 241 82 240.552 82 240Z" fill="#8BAAA7"/>
<path d="M138.282 197.5C137.104 199.442 136.267 201.899 136 203.5C135.843 204.438 135.638 205.474 135.506 206.5C133.504 205.667 129.2 203.6 128 202C124 204.4 124 202.667 124.5 201.5C120.9 203.5 121.333 201.667 122 200.5C120.5 201.5 119 201.5 118.5 201C118 200.5 117.5 199 122 196.5C126.5 194 130.5 195.5 133 197C135 198.2 137.355 197.834 138.282 197.5Z" fill="#FF8974"/>
<g filter="url(#filter0_d)">
<path d="M14 6C14 3.79086 15.7909 2 18 2H160C162.209 2 164 3.79086 164 6V30C164 32.2091 162.209 34 160 34H18C15.7909 34 14 32.2091 14 30V6Z" fill="white"/>
</g>
<path fill-rule="evenodd" clip-rule="evenodd" d="M24.915 10C23.3051 10 22 11.3051 22 12.915V20.2025C22 21.8124 23.3051 23.1175 24.915 23.1175H26.7369V25.2698C26.7369 25.9321 27.5489 26.251 27.9996 25.7657L30.4587 23.1175H52.6074C54.2173 23.1175 55.5224 21.8124 55.5224 20.2025V12.915C55.5224 11.3051 54.2173 10 52.6074 10H24.915Z" fill="#8EB6FF"/>
<path fill-rule="evenodd" clip-rule="evenodd" d="M27.4656 22.3887L27.4656 25.2698L30.1409 22.3887H52.6074C53.8148 22.3887 54.7936 21.4099 54.7936 20.2025V12.915C54.7936 11.7076 53.8148 10.7287 52.6074 10.7287H24.915C23.7076 10.7287 22.7287 11.7076 22.7287 12.915V20.2025C22.7287 21.4099 23.7076 22.3887 24.915 22.3887H27.4656ZM24.915 23.1175C23.3051 23.1175 22 21.8124 22 20.2025V12.915C22 11.3051 23.3051 10 24.915 10H52.6074C54.2173 10 55.5224 11.3051 55.5224 12.915V20.2025C55.5224 21.8124 54.2173 23.1175 52.6074 23.1175H30.4587L27.9996 25.7657C27.5489 26.251 26.7369 25.9321 26.7369 25.2698V23.1175H24.915Z" fill="#2A3D4F"/>
<path d="M30.0013 15.7548C29.9631 15.6368 29.8584 15.5529 29.7346 15.5418L28.0519 15.389L27.3865 13.8316C27.3374 13.7174 27.2257 13.6436 27.1015 13.6436C26.9774 13.6436 26.8657 13.7174 26.8166 13.8318L26.1512 15.389L24.4683 15.5418C24.3446 15.5532 24.2402 15.6368 24.2018 15.7548C24.1634 15.8729 24.1988 16.0023 24.2924 16.084L25.5643 17.1994L25.1892 18.8516C25.1618 18.9731 25.2089 19.0986 25.3097 19.1715C25.3639 19.2106 25.4273 19.2306 25.4912 19.2306C25.5463 19.2306 25.601 19.2157 25.6501 19.1863L27.1015 18.3188L28.5525 19.1863C28.6587 19.2502 28.7925 19.2444 28.8931 19.1715C28.9939 19.0984 29.041 18.9728 29.0136 18.8516L28.6385 17.1994L29.9104 16.0842C30.004 16.0023 30.0397 15.8731 30.0013 15.7548Z" fill="#FEB166"/>
<path fill-rule="evenodd" clip-rule="evenodd" d="M27.8023 15.7322L27.1016 14.0922L26.4008 15.7322L24.6275 15.8932L25.9677 17.0685L25.5728 18.808L27.1016 17.8943L28.6301 18.8082L28.2352 17.0685L29.5756 15.8932L27.8023 15.7322ZM29.7346 15.5418L28.0519 15.389L27.3865 13.8316C27.3374 13.7174 27.2257 13.6436 27.1015 13.6436C26.9774 13.6436 26.8657 13.7174 26.8166 13.8318L26.1512 15.389L24.4683 15.5418C24.3446 15.5532 24.2402 15.6368 24.2018 15.7548C24.1634 15.8729 24.1988 16.0023 24.2924 16.084L25.5643 17.1994L25.1892 18.8516C25.1618 18.9731 25.2089 19.0986 25.3097 19.1715C25.3639 19.2106 25.4273 19.2306 25.4912 19.2306C25.5463 19.2306 25.601 19.2157 25.6501 19.1863L27.1015 18.3188L28.5525 19.1863C28.6587 19.2502 28.7925 19.2444 28.8931 19.1715C28.9939 19.0984 29.041 18.9728 29.0136 18.8516L28.6385 17.1994L29.9104 16.0842C30.004 16.0023 30.0397 15.8731 30.0013 15.7548C29.9631 15.6368 29.8584 15.5529 29.7346 15.5418Z" fill="#2A3D4F"/>
<path d="M35.8314 15.7548C35.7932 15.6368 35.6885 15.5529 35.5646 15.5418L33.8819 15.389L33.2166 13.8316C33.1675 13.7174 33.0558 13.6436 32.9316 13.6436C32.8075 13.6436 32.6957 13.7174 32.6467 13.8318L31.9813 15.389L30.2983 15.5418C30.1747 15.5532 30.0702 15.6368 30.0319 15.7548C29.9935 15.8729 30.0289 16.0023 30.1225 16.084L31.3944 17.1994L31.0193 18.8516C30.9919 18.9731 31.039 19.0986 31.1398 19.1715C31.194 19.2106 31.2574 19.2306 31.3213 19.2306C31.3764 19.2306 31.4311 19.2157 31.4801 19.1863L32.9316 18.3188L34.3826 19.1863C34.4887 19.2502 34.6226 19.2444 34.7232 19.1715C34.824 19.0984 34.8711 18.9728 34.8437 18.8516L34.4686 17.1994L35.7405 16.0842C35.8341 16.0023 35.8698 15.8731 35.8314 15.7548Z" fill="#FEB166"/>
<path fill-rule="evenodd" clip-rule="evenodd" d="M33.6323 15.7322L32.9317 14.0922L32.2309 15.7322L30.4575 15.8932L31.7977 17.0685L31.4029 18.808L32.9317 17.8943L34.4602 18.8082L34.0652 17.0685L35.4057 15.8932L33.6323 15.7322ZM35.5646 15.5418L33.8819 15.389L33.2166 13.8316C33.1675 13.7174 33.0558 13.6436 32.9316 13.6436C32.8075 13.6436 32.6957 13.7174 32.6467 13.8318L31.9813 15.389L30.2983 15.5418C30.1747 15.5532 30.0702 15.6368 30.0319 15.7548C29.9935 15.8729 30.0289 16.0023 30.1225 16.084L31.3944 17.1994L31.0193 18.8516C30.9919 18.9731 31.039 19.0986 31.1398 19.1715C31.194 19.2106 31.2574 19.2306 31.3213 19.2306C31.3764 19.2306 31.4311 19.2157 31.4801 19.1863L32.9316 18.3188L34.3826 19.1863C34.4887 19.2502 34.6226 19.2444 34.7232 19.1715C34.824 19.0984 34.8711 18.9728 34.8437 18.8516L34.4686 17.1994L35.7405 16.0842C35.8341 16.0023 35.8698 15.8731 35.8314 15.7548C35.7932 15.6368 35.6885 15.5529 35.5646 15.5418Z" fill="#2A3D4F"/>
<path d="M41.6615 15.7548C41.6233 15.6368 41.5186 15.5529 41.3947 15.5418L39.712 15.389L39.0466 13.8316C38.9976 13.7174 38.8858 13.6436 38.7617 13.6436C38.6376 13.6436 38.5258 13.7174 38.4768 13.8318L37.8114 15.389L36.1284 15.5418C36.0048 15.5532 35.9003 15.6368 35.8619 15.7548C35.8235 15.8729 35.859 16.0023 35.9525 16.084L37.2245 17.1994L36.8494 18.8516C36.822 18.9731 36.8691 19.0986 36.9699 19.1715C37.0241 19.2106 37.0875 19.2306 37.1514 19.2306C37.2065 19.2306 37.2612 19.2157 37.3102 19.1863L38.7617 18.3188L40.2126 19.1863C40.3188 19.2502 40.4527 19.2444 40.5532 19.1715C40.6541 19.0984 40.7012 18.9728 40.6737 18.8516L40.2987 17.1994L41.5706 16.0842C41.6641 16.0023 41.6999 15.8731 41.6615 15.7548Z" fill="#FEB166"/>
<path fill-rule="evenodd" clip-rule="evenodd" d="M39.4624 15.7322L38.7618 14.0922L38.061 15.7322L36.2876 15.8932L37.6278 17.0685L37.2329 18.808L38.7617 17.8943L40.2902 18.8082L39.8953 17.0685L41.2357 15.8932L39.4624 15.7322ZM41.3947 15.5418L39.712 15.389L39.0466 13.8316C38.9976 13.7174 38.8858 13.6436 38.7617 13.6436C38.6376 13.6436 38.5258 13.7174 38.4768 13.8318L37.8114 15.389L36.1284 15.5418C36.0048 15.5532 35.9003 15.6368 35.8619 15.7548C35.8235 15.8729 35.859 16.0023 35.9525 16.084L37.2245 17.1994L36.8494 18.8516C36.822 18.9731 36.8691 19.0986 36.9699 19.1715C37.0241 19.2106 37.0875 19.2306 37.1514 19.2306C37.2065 19.2306 37.2612 19.2157 37.3102 19.1863L38.7617 18.3188L40.2126 19.1863C40.3188 19.2502 40.4527 19.2444 40.5532 19.1715C40.6541 19.0984 40.7012 18.9728 40.6737 18.8516L40.2987 17.1994L41.5706 16.0842C41.6641 16.0023 41.6999 15.8731 41.6615 15.7548C41.6233 15.6368 41.5186 15.5529 41.3947 15.5418Z" fill="#2A3D4F"/>
<path d="M47.4906 15.7548C47.4524 15.6368 47.3477 15.5529 47.2238 15.5418L45.5411 15.389L44.8757 13.8316C44.8267 13.7174 44.7149 13.6436 44.5908 13.6436C44.4667 13.6436 44.3549 13.7174 44.3059 13.8318L43.6405 15.389L41.9575 15.5418C41.8339 15.5532 41.7294 15.6368 41.691 15.7548C41.6527 15.8729 41.6881 16.0023 41.7816 16.084L43.0536 17.1994L42.6785 18.8516C42.6511 18.9731 42.6982 19.0986 42.799 19.1715C42.8532 19.2106 42.9166 19.2306 42.9805 19.2306C43.0356 19.2306 43.0903 19.2157 43.1393 19.1863L44.5908 18.3188L46.0418 19.1863C46.1479 19.2502 46.2818 19.2444 46.3823 19.1715C46.4832 19.0984 46.5303 18.9728 46.5028 18.8516L46.1278 17.1994L47.3997 16.0842C47.4932 16.0023 47.529 15.8731 47.4906 15.7548Z" fill="#FEB166"/>
<path fill-rule="evenodd" clip-rule="evenodd" d="M45.2915 15.7322L44.5909 14.0922L43.8901 15.7322L42.1167 15.8932L43.4569 17.0685L43.062 18.808L44.5908 17.8943L46.1193 18.8082L45.7244 17.0685L47.0648 15.8932L45.2915 15.7322ZM47.2238 15.5418L45.5411 15.389L44.8757 13.8316C44.8267 13.7174 44.7149 13.6436 44.5908 13.6436C44.4667 13.6436 44.3549 13.7174 44.3059 13.8318L43.6405 15.389L41.9575 15.5418C41.8339 15.5532 41.7294 15.6368 41.691 15.7548C41.6527 15.8729 41.6881 16.0023 41.7816 16.084L43.0536 17.1994L42.6785 18.8516C42.6511 18.9731 42.6982 19.0986 42.799 19.1715C42.8532 19.2106 42.9166 19.2306 42.9805 19.2306C43.0356 19.2306 43.0903 19.2157 43.1393 19.1863L44.5908 18.3188L46.0418 19.1863C46.1479 19.2502 46.2818 19.2444 46.3823 19.1715C46.4832 19.0984 46.5303 18.9728 46.5028 18.8516L46.1278 17.1994L47.3997 16.0842C47.4932 16.0023 47.529 15.8731 47.4906 15.7548C47.4524 15.6368 47.3477 15.5529 47.2238 15.5418Z" fill="#2A3D4F"/>
<path d="M53.3206 15.7548C53.2825 15.6368 53.1778 15.5529 53.0539 15.5418L51.3712 15.389L50.7058 13.8316C50.6568 13.7174 50.545 13.6436 50.4209 13.6436C50.2967 13.6436 50.185 13.7174 50.1359 13.8318L49.4706 15.389L47.7876 15.5418C47.6639 15.5532 47.5595 15.6368 47.5211 15.7548C47.4827 15.8729 47.5182 16.0023 47.6117 16.084L48.8836 17.1994L48.5086 18.8516C48.4811 18.9731 48.5283 19.0986 48.6291 19.1715C48.6833 19.2106 48.7466 19.2306 48.8106 19.2306C48.8657 19.2306 48.9203 19.2157 48.9694 19.1863L50.4209 18.3188L51.8718 19.1863C51.978 19.2502 52.1118 19.2444 52.2124 19.1715C52.3133 19.0984 52.3604 18.9728 52.3329 18.8516L51.9579 17.1994L53.2298 16.0842C53.3233 16.0023 53.359 15.8731 53.3206 15.7548Z" fill="#FEB166"/>
<path fill-rule="evenodd" clip-rule="evenodd" d="M51.1216 15.7322L50.4209 14.0922L49.7201 15.7322L47.9468 15.8932L49.287 17.0685L48.8921 18.808L50.4209 17.8943L51.9494 18.8082L51.5545 17.0685L52.8949 15.8932L51.1216 15.7322ZM53.0539 15.5418L51.3712 15.389L50.7058 13.8316C50.6568 13.7174 50.545 13.6436 50.4209 13.6436C50.2967 13.6436 50.185 13.7174 50.1359 13.8318L49.4706 15.389L47.7876 15.5418C47.6639 15.5532 47.5595 15.6368 47.5211 15.7548C47.4827 15.8729 47.5182 16.0023 47.6117 16.084L48.8836 17.1994L48.5086 18.8516C48.4811 18.9731 48.5283 19.0986 48.6291 19.1715C48.6833 19.2106 48.7466 19.2306 48.8106 19.2306C48.8657 19.2306 48.9203 19.2157 48.9694 19.1863L50.4209 18.3188L51.8718 19.1863C51.978 19.2502 52.1118 19.2444 52.2124 19.1715C52.3133 19.0984 52.3604 18.9728 52.3329 18.8516L51.9579 17.1994L53.2298 16.0842C53.3233 16.0023 53.359 15.8731 53.3206 15.7548C53.2825 15.6368 53.1778 15.5529 53.0539 15.5418Z" fill="#2A3D4F"/>
<path d="M64.4385 19.1689C64.4385 18.8564 64.3278 18.6156 64.1064 18.4463C63.8883 18.277 63.4928 18.1061 62.9199 17.9336C62.347 17.7611 61.8913 17.569 61.5527 17.3574C60.9049 16.9505 60.5811 16.4199 60.5811 15.7656C60.5811 15.1927 60.8138 14.7207 61.2793 14.3496C61.748 13.9785 62.3551 13.793 63.1006 13.793C63.5954 13.793 64.0365 13.8841 64.4238 14.0664C64.8112 14.2487 65.1156 14.5091 65.3369 14.8477C65.5583 15.1829 65.6689 15.5557 65.6689 15.9658H64.4385C64.4385 15.5947 64.3213 15.305 64.0869 15.0967C63.8558 14.8851 63.5238 14.7793 63.0908 14.7793C62.6872 14.7793 62.373 14.8656 62.1484 15.0381C61.9271 15.2106 61.8164 15.4515 61.8164 15.7607C61.8164 16.0212 61.9368 16.2393 62.1777 16.415C62.4186 16.5876 62.8158 16.7568 63.3691 16.9229C63.9225 17.0856 64.3669 17.2728 64.7021 17.4844C65.0374 17.6927 65.2832 17.9336 65.4395 18.207C65.5957 18.4772 65.6738 18.7946 65.6738 19.1592C65.6738 19.7516 65.446 20.2236 64.9902 20.5752C64.5378 20.9235 63.9225 21.0977 63.1445 21.0977C62.6302 21.0977 62.1566 21.0033 61.7236 20.8145C61.2939 20.6224 60.9587 20.3587 60.7178 20.0234C60.4801 19.6882 60.3613 19.2975 60.3613 18.8516H61.5967C61.5967 19.2552 61.7301 19.5677 61.9971 19.7891C62.264 20.0104 62.6465 20.1211 63.1445 20.1211C63.5742 20.1211 63.8965 20.0348 64.1113 19.8623C64.3294 19.6865 64.4385 19.4554 64.4385 19.1689Z" fill="#333333"/>
<path d="M69.7998 21C69.7477 20.8991 69.7021 20.7347 69.6631 20.5068C69.2855 20.9007 68.8232 21.0977 68.2764 21.0977C67.7458 21.0977 67.3128 20.9463 66.9775 20.6436C66.6423 20.3408 66.4746 19.9665 66.4746 19.5205C66.4746 18.9574 66.6829 18.526 67.0996 18.2266C67.5195 17.9238 68.1185 17.7725 68.8965 17.7725H69.624V17.4258C69.624 17.1523 69.5475 16.9342 69.3945 16.7715C69.2415 16.6055 69.0088 16.5225 68.6963 16.5225C68.4261 16.5225 68.2048 16.5908 68.0322 16.7275C67.8597 16.861 67.7734 17.0319 67.7734 17.2402H66.5869C66.5869 16.9505 66.6829 16.6803 66.875 16.4297C67.0671 16.1758 67.3275 15.9772 67.6562 15.834C67.9883 15.6908 68.3577 15.6191 68.7646 15.6191C69.3831 15.6191 69.8763 15.7754 70.2441 16.0879C70.612 16.3971 70.8008 16.8333 70.8105 17.3965V19.7793C70.8105 20.2546 70.8773 20.6338 71.0107 20.917V21H69.7998ZM68.4961 20.1455C68.7305 20.1455 68.9502 20.0885 69.1553 19.9746C69.3636 19.8607 69.5199 19.7077 69.624 19.5156V18.5195H68.9844C68.5449 18.5195 68.2145 18.596 67.9932 18.749C67.7718 18.902 67.6611 19.1185 67.6611 19.3984C67.6611 19.6263 67.736 19.8086 67.8857 19.9453C68.0387 20.0788 68.2422 20.1455 68.4961 20.1455ZM68.3789 14.8477L68.3447 14.1348C68.5824 14.1185 68.7533 14.0876 68.8574 14.042C68.9648 13.9964 69.0186 13.9167 69.0186 13.8027C69.0186 13.5684 68.7744 13.4512 68.2861 13.4512L68.3203 12.8506C68.8704 12.8506 69.2839 12.9352 69.5605 13.1045C69.8405 13.2738 69.9805 13.5016 69.9805 13.7881C69.9805 13.9834 69.917 14.1445 69.79 14.2715C69.6631 14.3984 69.4824 14.4782 69.248 14.5107V14.8477H68.3789Z" fill="#333333"/>
<path d="M73.1543 15.7168L73.1885 16.3271C73.5791 15.8551 74.0918 15.6191 74.7266 15.6191C75.8268 15.6191 76.3867 16.249 76.4062 17.5088V21H75.2197V17.5771C75.2197 17.2419 75.1465 16.9945 75 16.835C74.8568 16.6722 74.6208 16.5908 74.292 16.5908C73.8135 16.5908 73.457 16.8073 73.2227 17.2402V21H72.0361V15.7168H73.1543Z" fill="#333333"/>
<path d="M84.7363 18.4121C84.7363 19.2292 84.5508 19.8818 84.1797 20.3701C83.8086 20.8551 83.3105 21.0977 82.6855 21.0977C82.1061 21.0977 81.6423 20.9072 81.2939 20.5264V23.0312H80.1074V15.7168H81.2012L81.25 16.2539C81.5983 15.8307 82.0719 15.6191 82.6709 15.6191C83.3154 15.6191 83.82 15.86 84.1846 16.3418C84.5524 16.8203 84.7363 17.486 84.7363 18.3389V18.4121ZM83.5547 18.3096C83.5547 17.7822 83.4489 17.3639 83.2373 17.0547C83.029 16.7454 82.7295 16.5908 82.3389 16.5908C81.8538 16.5908 81.5055 16.791 81.2939 17.1914V19.5352C81.5088 19.9453 81.8604 20.1504 82.3486 20.1504C82.7262 20.1504 83.0208 19.999 83.2324 19.6963C83.4473 19.3903 83.5547 18.9281 83.5547 18.3096Z" fill="#333333"/>
<path d="M86.9141 16.293C87.3014 15.8438 87.7913 15.6191 88.3838 15.6191C89.5101 15.6191 90.0814 16.262 90.0977 17.5479V21H88.9111V17.5918C88.9111 17.2272 88.8314 16.9701 88.6719 16.8203C88.5156 16.6673 88.2845 16.5908 87.9785 16.5908C87.5033 16.5908 87.1484 16.8024 86.9141 17.2256V21H85.7275V13.5H86.9141V16.293Z" fill="#333333"/>
<path d="M94.458 21C94.4059 20.8991 94.3604 20.7347 94.3213 20.5068C93.9437 20.9007 93.4814 21.0977 92.9346 21.0977C92.404 21.0977 91.971 20.9463 91.6357 20.6436C91.3005 20.3408 91.1328 19.9665 91.1328 19.5205C91.1328 18.9574 91.3411 18.526 91.7578 18.2266C92.1777 17.9238 92.7767 17.7725 93.5547 17.7725H94.2822V17.4258C94.2822 17.1523 94.2057 16.9342 94.0527 16.7715C93.8997 16.6055 93.667 16.5225 93.3545 16.5225C93.0843 16.5225 92.863 16.5908 92.6904 16.7275C92.5179 16.861 92.4316 17.0319 92.4316 17.2402H91.2451C91.2451 16.9505 91.3411 16.6803 91.5332 16.4297C91.7253 16.1758 91.9857 15.9772 92.3145 15.834C92.6465 15.6908 93.0159 15.6191 93.4229 15.6191C94.0413 15.6191 94.5345 15.7754 94.9023 16.0879C95.2702 16.3971 95.459 16.8333 95.4688 17.3965V19.7793C95.4688 20.2546 95.5355 20.6338 95.6689 20.917V21H94.458ZM93.1543 20.1455C93.3887 20.1455 93.6084 20.0885 93.8135 19.9746C94.0218 19.8607 94.1781 19.7077 94.2822 19.5156V18.5195H93.6426C93.2031 18.5195 92.8727 18.596 92.6514 18.749C92.43 18.902 92.3193 19.1185 92.3193 19.3984C92.3193 19.6263 92.3942 19.8086 92.5439 19.9453C92.6969 20.0788 92.9004 20.1455 93.1543 20.1455ZM95.2686 15.0381H94.3262L93.4521 14.2471L92.583 15.0381H91.6406L92.998 13.8174H93.9111L95.2686 15.0381ZM94.8145 14.3838L94.7803 13.7734C94.9854 13.7572 95.1335 13.7295 95.2246 13.6904C95.3158 13.6514 95.3613 13.5846 95.3613 13.4902C95.3613 13.2884 95.1514 13.1875 94.7314 13.1875L94.7656 12.6748C95.2116 12.6748 95.5485 12.748 95.7764 12.8945C96.0042 13.0378 96.1182 13.2314 96.1182 13.4756C96.1182 13.6546 96.0579 13.7979 95.9375 13.9053C95.8203 14.0094 95.6706 14.0729 95.4883 14.0957L95.4834 14.3838H94.8145Z" fill="#333333"/>
<path d="M97.8271 15.7168L97.8613 16.2686C98.2324 15.8356 98.7402 15.6191 99.3848 15.6191C100.091 15.6191 100.575 15.8893 100.835 16.4297C101.219 15.8893 101.759 15.6191 102.456 15.6191C103.039 15.6191 103.472 15.7803 103.755 16.1025C104.041 16.4248 104.188 16.9001 104.194 17.5283V21H103.008V17.5625C103.008 17.2272 102.935 16.9814 102.788 16.8252C102.642 16.6689 102.399 16.5908 102.061 16.5908C101.79 16.5908 101.569 16.6641 101.396 16.8105C101.227 16.9538 101.108 17.1426 101.04 17.377L101.045 21H99.8584V17.5234C99.8421 16.9017 99.5247 16.5908 98.9062 16.5908C98.431 16.5908 98.0941 16.7845 97.8955 17.1719V21H96.709V15.7168H97.8271Z" fill="#333333"/>
<path d="M110.073 20.1504C110.369 20.1504 110.615 20.0641 110.811 19.8916C111.006 19.7191 111.11 19.5059 111.123 19.252H112.241C112.228 19.5807 112.126 19.8883 111.934 20.1748C111.742 20.458 111.481 20.6826 111.152 20.8486C110.824 21.0146 110.469 21.0977 110.088 21.0977C109.349 21.0977 108.763 20.8584 108.33 20.3799C107.897 19.9014 107.681 19.2406 107.681 18.3975V18.2754C107.681 17.4714 107.896 16.8285 108.325 16.3467C108.755 15.8617 109.341 15.6191 110.083 15.6191C110.711 15.6191 111.222 15.8031 111.616 16.1709C112.013 16.5355 112.222 17.0156 112.241 17.6113H111.123C111.11 17.3086 111.006 17.0596 110.811 16.8643C110.618 16.6689 110.373 16.5713 110.073 16.5713C109.689 16.5713 109.393 16.7113 109.185 16.9912C108.976 17.2679 108.87 17.6895 108.867 18.2559V18.4463C108.867 19.0192 108.97 19.4473 109.175 19.7305C109.383 20.0104 109.683 20.1504 110.073 20.1504Z" fill="#333333"/>
<path d="M114.307 16.293C114.694 15.8438 115.184 15.6191 115.776 15.6191C116.903 15.6191 117.474 16.262 117.49 17.5479V21H116.304V17.5918C116.304 17.2272 116.224 16.9701 116.064 16.8203C115.908 16.6673 115.677 16.5908 115.371 16.5908C114.896 16.5908 114.541 16.8024 114.307 17.2256V21H113.12V13.5H114.307V16.293Z" fill="#333333"/>
<path d="M121.851 21C121.799 20.8991 121.753 20.7347 121.714 20.5068C121.336 20.9007 120.874 21.0977 120.327 21.0977C119.797 21.0977 119.364 20.9463 119.028 20.6436C118.693 20.3408 118.525 19.9665 118.525 19.5205C118.525 18.9574 118.734 18.526 119.15 18.2266C119.57 17.9238 120.169 17.7725 120.947 17.7725H121.675V17.4258C121.675 17.1523 121.598 16.9342 121.445 16.7715C121.292 16.6055 121.06 16.5225 120.747 16.5225C120.477 16.5225 120.256 16.5908 120.083 16.7275C119.91 16.861 119.824 17.0319 119.824 17.2402H118.638C118.638 16.9505 118.734 16.6803 118.926 16.4297C119.118 16.1758 119.378 15.9772 119.707 15.834C120.039 15.6908 120.409 15.6191 120.815 15.6191C121.434 15.6191 121.927 15.7754 122.295 16.0879C122.663 16.3971 122.852 16.8333 122.861 17.3965V19.7793C122.861 20.2546 122.928 20.6338 123.062 20.917V21H121.851ZM120.547 20.1455C120.781 20.1455 121.001 20.0885 121.206 19.9746C121.414 19.8607 121.571 19.7077 121.675 19.5156V18.5195H121.035C120.596 18.5195 120.265 18.596 120.044 18.749C119.823 18.902 119.712 19.1185 119.712 19.3984C119.712 19.6263 119.787 19.8086 119.937 19.9453C120.09 20.0788 120.293 20.1455 120.547 20.1455ZM120.459 13.749H121.245L122.666 14.9697H121.631L120.854 14.2764L120.078 14.9697H119.038L120.459 13.749ZM123.037 12.8945H124.121L123.066 14.1982H122.3L123.037 12.8945Z" fill="#333333"/>
<path d="M125.591 14.4326V15.7168H126.523V16.5957H125.591V19.5449C125.591 19.7467 125.63 19.8932 125.708 19.9844C125.789 20.0723 125.933 20.1162 126.138 20.1162C126.274 20.1162 126.413 20.0999 126.553 20.0674V20.9854C126.283 21.0602 126.022 21.0977 125.771 21.0977C124.86 21.0977 124.404 20.5947 124.404 19.5889V16.5957H123.535V15.7168H124.404V14.4326H125.591Z" fill="#333333"/>
<path d="M131.187 21H130V13.5H131.187V21Z" fill="#333333"/>
<path d="M138.32 15.2822C138.32 15.8617 138.203 16.2865 137.969 16.5566C137.738 16.8236 137.358 16.9749 136.831 17.0107V21H135.713L135.684 20.4824C135.335 20.8926 134.84 21.0977 134.199 21.0977C133.626 21.0977 133.192 20.93 132.896 20.5947C132.603 20.2594 132.456 19.7744 132.456 19.1396V15.7168H133.643V19.125C133.643 19.7956 133.921 20.1309 134.478 20.1309C135.054 20.1309 135.443 19.9242 135.645 19.5107V15.7168H136.831V16.3809C137.065 16.3581 137.235 16.293 137.339 16.1855C137.446 16.0781 137.508 15.9007 137.524 15.6533L137.534 15.2822H138.32Z" fill="#333333"/>
<path d="M138.442 18.3096C138.442 17.7855 138.543 17.3184 138.745 16.9082C138.95 16.4948 139.238 16.1774 139.609 15.9561C139.98 15.7314 140.407 15.6191 140.889 15.6191C141.621 15.6191 142.212 15.8617 142.661 16.3467C142.834 16.2848 142.959 16.1676 143.037 15.9951C143.115 15.8226 143.154 15.5508 143.154 15.1797H143.97C143.97 15.6159 143.898 15.9805 143.755 16.2734C143.612 16.5632 143.372 16.7682 143.037 16.8887C143.242 17.2956 143.348 17.7562 143.354 18.2705V18.4121C143.354 18.9329 143.254 19.3984 143.052 19.8086C142.853 20.2188 142.565 20.5361 142.188 20.7607C141.813 20.9854 141.383 21.0977 140.898 21.0977C140.16 21.0977 139.565 20.8519 139.116 20.3604C138.667 19.8688 138.442 19.2048 138.442 18.3682V18.3096ZM139.624 18.4121C139.624 18.9557 139.736 19.3822 139.961 19.6914C140.186 19.9974 140.498 20.1504 140.898 20.1504C141.299 20.1504 141.61 19.9941 141.831 19.6816C142.056 19.3691 142.168 18.9118 142.168 18.3096C142.168 17.766 142.052 17.3411 141.821 17.0352C141.593 16.7259 141.283 16.5713 140.889 16.5713C140.501 16.5713 140.194 16.7259 139.966 17.0352C139.738 17.3411 139.624 17.8001 139.624 18.4121ZM140.195 22.2207C140.195 22.0482 140.252 21.9033 140.366 21.7861C140.483 21.6722 140.649 21.6152 140.864 21.6152C141.079 21.6152 141.245 21.6722 141.362 21.7861C141.479 21.9033 141.538 22.0482 141.538 22.2207C141.538 22.3932 141.479 22.5365 141.362 22.6504C141.245 22.7643 141.079 22.8213 140.864 22.8213C140.649 22.8213 140.483 22.7643 140.366 22.6504C140.252 22.5365 140.195 22.3932 140.195 22.2207Z" fill="#333333"/>
<path d="M145.537 15.7168L145.571 16.3271C145.962 15.8551 146.475 15.6191 147.109 15.6191C148.21 15.6191 148.77 16.249 148.789 17.5088V21H147.603V17.5771C147.603 17.2419 147.529 16.9945 147.383 16.835C147.24 16.6722 147.004 16.5908 146.675 16.5908C146.196 16.5908 145.84 16.8073 145.605 17.2402V21H144.419V15.7168H145.537Z" fill="#333333"/>
<path d="M149.795 18.3193C149.795 17.499 149.987 16.8447 150.371 16.3564C150.758 15.8649 151.271 15.6191 151.909 15.6191C152.511 15.6191 152.985 15.8291 153.33 16.249L153.384 15.7168H154.453V20.8389C154.453 21.5322 154.237 22.0791 153.804 22.4795C153.374 22.8799 152.793 23.0801 152.061 23.0801C151.673 23.0801 151.294 22.9987 150.923 22.8359C150.555 22.6764 150.275 22.4665 150.083 22.2061L150.645 21.4932C151.009 21.9261 151.458 22.1426 151.992 22.1426C152.386 22.1426 152.697 22.0352 152.925 21.8203C153.153 21.6087 153.267 21.2962 153.267 20.8828V20.5264C152.925 20.9072 152.469 21.0977 151.899 21.0977C151.281 21.0977 150.775 20.8519 150.381 20.3604C149.99 19.8688 149.795 19.1885 149.795 18.3193ZM150.977 18.4219C150.977 18.9525 151.084 19.3708 151.299 19.6768C151.517 19.9795 151.818 20.1309 152.202 20.1309C152.681 20.1309 153.035 19.9258 153.267 19.5156V17.1914C153.042 16.791 152.69 16.5908 152.212 16.5908C151.821 16.5908 151.517 16.7454 151.299 17.0547C151.084 17.3639 150.977 17.8197 150.977 18.4219Z" fill="#333333"/>
<g filter="url(#filter1_d)">
<path d="M171 100C171 97.7909 172.791 96 175 96H264C266.209 96 268 97.7909 268 100V122C268 124.209 266.209 126 264 126H175C172.791 126 171 124.209 171 122V100Z" fill="white"/>
</g>
<path d="M204.923 106.891V107.965C205.278 107.932 205.532 107.81 205.685 107.599C205.838 107.387 205.914 107.019 205.914 106.495H206.798C206.798 107.237 206.645 107.783 206.339 108.131C206.036 108.479 205.564 108.668 204.923 108.697V111.642C204.923 112.397 204.68 112.996 204.195 113.438C203.714 113.878 203.071 114.098 202.267 114.098C201.453 114.098 200.807 113.881 200.328 113.448C199.85 113.012 199.61 112.408 199.61 111.637V106.891H200.841V111.646C200.841 112.122 200.961 112.485 201.202 112.735C201.443 112.986 201.798 113.111 202.267 113.111C203.217 113.111 203.692 112.61 203.692 111.607V106.891H204.923Z" fill="#333333"/>
<path d="M209.859 113.482C209.511 113.893 209.016 114.098 208.375 114.098C207.802 114.098 207.368 113.93 207.071 113.595C206.778 113.259 206.632 112.774 206.632 112.14V108.717H207.818V112.125C207.818 112.796 208.097 113.131 208.653 113.131C209.229 113.131 209.618 112.924 209.82 112.511V108.717H211.007V114H209.889L209.859 113.482Z" fill="#333333"/>
<path d="M219.967 108.023H219.112V114H218.038L217.979 113.453C217.625 113.883 217.151 114.098 216.559 114.098C215.94 114.098 215.439 113.849 215.055 113.351C214.674 112.853 214.483 112.175 214.483 111.319C214.483 110.506 214.672 109.853 215.05 109.361C215.427 108.867 215.934 108.619 216.568 108.619C217.128 108.619 217.581 108.814 217.926 109.205V108.023H216.7V107.193H217.926V106.5H219.112V107.193H219.967V108.023ZM215.67 111.422C215.67 111.959 215.772 112.379 215.978 112.682C216.186 112.981 216.48 113.131 216.861 113.131C217.346 113.131 217.701 112.914 217.926 112.481V110.226C217.708 109.802 217.356 109.591 216.871 109.591C216.487 109.591 216.191 109.744 215.982 110.05C215.774 110.353 215.67 110.81 215.67 111.422Z" fill="#333333"/>
<path d="M224.024 114C223.972 113.899 223.927 113.735 223.888 113.507C223.51 113.901 223.048 114.098 222.501 114.098C221.97 114.098 221.537 113.946 221.202 113.644C220.867 113.341 220.699 112.966 220.699 112.521C220.699 111.957 220.908 111.526 221.324 111.227C221.744 110.924 222.343 110.772 223.121 110.772H223.849V110.426C223.849 110.152 223.772 109.934 223.619 109.771C223.466 109.605 223.233 109.522 222.921 109.522C222.651 109.522 222.429 109.591 222.257 109.728C222.084 109.861 221.998 110.032 221.998 110.24H220.812C220.812 109.951 220.908 109.68 221.1 109.43C221.292 109.176 221.552 108.977 221.881 108.834C222.213 108.691 222.582 108.619 222.989 108.619C223.608 108.619 224.101 108.775 224.469 109.088C224.837 109.397 225.025 109.833 225.035 110.396V112.779C225.035 113.255 225.102 113.634 225.235 113.917V114H224.024ZM222.721 113.146C222.955 113.146 223.175 113.089 223.38 112.975C223.588 112.861 223.744 112.708 223.849 112.516V111.52H223.209C222.77 111.52 222.439 111.596 222.218 111.749C221.996 111.902 221.886 112.118 221.886 112.398C221.886 112.626 221.961 112.809 222.11 112.945C222.263 113.079 222.467 113.146 222.721 113.146ZM224.82 106.607C224.82 106.965 224.716 107.263 224.508 107.501C224.303 107.739 224.044 107.857 223.731 107.857C223.604 107.857 223.494 107.844 223.399 107.818C223.308 107.789 223.176 107.726 223.004 107.628C222.835 107.53 222.714 107.472 222.643 107.452C222.574 107.433 222.498 107.423 222.413 107.423C222.289 107.423 222.184 107.47 222.096 107.564C222.011 107.656 221.969 107.776 221.969 107.926L221.241 107.887C221.241 107.529 221.344 107.228 221.549 106.983C221.757 106.739 222.016 106.617 222.325 106.617C222.511 106.617 222.734 106.69 222.994 106.837C223.258 106.983 223.474 107.057 223.644 107.057C223.767 107.057 223.873 107.011 223.961 106.92C224.049 106.826 224.093 106.702 224.093 106.549L224.82 106.607Z" fill="#333333"/>
<path d="M227.54 114H226.354V108.717H227.54V114ZM226.28 107.345C226.28 107.162 226.337 107.011 226.451 106.891C226.568 106.77 226.734 106.71 226.949 106.71C227.164 106.71 227.33 106.77 227.447 106.891C227.564 107.011 227.623 107.162 227.623 107.345C227.623 107.524 227.564 107.674 227.447 107.794C227.33 107.911 227.164 107.97 226.949 107.97C226.734 107.97 226.568 107.911 226.451 107.794C226.337 107.674 226.28 107.524 226.28 107.345Z" fill="#333333"/>
<path d="M231.119 111.319C231.119 110.499 231.311 109.845 231.695 109.356C232.083 108.865 232.595 108.619 233.233 108.619C233.836 108.619 234.309 108.829 234.654 109.249L234.708 108.717H235.777V113.839C235.777 114.532 235.561 115.079 235.128 115.479C234.698 115.88 234.117 116.08 233.385 116.08C232.997 116.08 232.618 115.999 232.247 115.836C231.879 115.676 231.599 115.466 231.407 115.206L231.969 114.493C232.333 114.926 232.783 115.143 233.316 115.143C233.71 115.143 234.021 115.035 234.249 114.82C234.477 114.609 234.591 114.296 234.591 113.883V113.526C234.249 113.907 233.793 114.098 233.224 114.098C232.605 114.098 232.099 113.852 231.705 113.36C231.314 112.869 231.119 112.188 231.119 111.319ZM232.301 111.422C232.301 111.952 232.408 112.371 232.623 112.677C232.841 112.979 233.142 113.131 233.526 113.131C234.005 113.131 234.36 112.926 234.591 112.516V110.191C234.366 109.791 234.015 109.591 233.536 109.591C233.146 109.591 232.841 109.745 232.623 110.055C232.408 110.364 232.301 110.82 232.301 111.422Z" fill="#333333"/>
<path d="M238.263 114H237.076V108.717H238.263V114ZM237.003 107.345C237.003 107.162 237.06 107.011 237.174 106.891C237.291 106.77 237.457 106.71 237.672 106.71C237.887 106.71 238.053 106.77 238.17 106.891C238.287 107.011 238.346 107.162 238.346 107.345C238.346 107.524 238.287 107.674 238.17 107.794C238.053 107.911 237.887 107.97 237.672 107.97C237.457 107.97 237.291 107.911 237.174 107.794C237.06 107.674 237.003 107.524 237.003 107.345Z" fill="#333333"/>
<path d="M242.716 114C242.664 113.899 242.618 113.735 242.579 113.507C242.201 113.901 241.739 114.098 241.192 114.098C240.662 114.098 240.229 113.946 239.894 113.644C239.558 113.341 239.391 112.966 239.391 112.521C239.391 111.957 239.599 111.526 240.016 111.227C240.436 110.924 241.035 110.772 241.812 110.772H242.54V110.426C242.54 110.152 242.464 109.934 242.311 109.771C242.158 109.605 241.925 109.522 241.612 109.522C241.342 109.522 241.121 109.591 240.948 109.728C240.776 109.861 240.689 110.032 240.689 110.24H239.503C239.503 109.951 239.599 109.68 239.791 109.43C239.983 109.176 240.243 108.977 240.572 108.834C240.904 108.691 241.274 108.619 241.681 108.619C242.299 108.619 242.792 108.775 243.16 109.088C243.528 109.397 243.717 109.833 243.727 110.396V112.779C243.727 113.255 243.793 113.634 243.927 113.917V114H242.716ZM241.412 113.146C241.646 113.146 241.866 113.089 242.071 112.975C242.28 112.861 242.436 112.708 242.54 112.516V111.52H241.9C241.461 111.52 241.131 111.596 240.909 111.749C240.688 111.902 240.577 112.118 240.577 112.398C240.577 112.626 240.652 112.809 240.802 112.945C240.955 113.079 241.158 113.146 241.412 113.146ZM242.071 106.5H243.424L242.071 107.979H241.119L242.071 106.5Z" fill="#333333"/>
<path d="M248.946 107.433V108.717H249.879V109.596H248.946V112.545C248.946 112.747 248.985 112.893 249.063 112.984C249.145 113.072 249.288 113.116 249.493 113.116C249.63 113.116 249.768 113.1 249.908 113.067V113.985C249.638 114.06 249.378 114.098 249.127 114.098C248.215 114.098 247.76 113.595 247.76 112.589V109.596H246.891V108.717H247.76V107.433H248.946Z" fill="#333333"/>
<path d="M250.421 111.31C250.421 110.792 250.523 110.326 250.729 109.913C250.934 109.496 251.222 109.177 251.593 108.956C251.964 108.731 252.39 108.619 252.872 108.619C253.585 108.619 254.163 108.849 254.605 109.308C255.051 109.767 255.292 110.375 255.328 111.134L255.333 111.412C255.333 111.933 255.232 112.398 255.03 112.809C254.832 113.219 254.545 113.536 254.171 113.761C253.8 113.985 253.37 114.098 252.882 114.098C252.136 114.098 251.539 113.85 251.09 113.355C250.644 112.857 250.421 112.195 250.421 111.368V111.31ZM251.607 111.412C251.607 111.956 251.72 112.382 251.944 112.691C252.169 112.997 252.481 113.15 252.882 113.15C253.282 113.15 253.593 112.994 253.814 112.682C254.039 112.369 254.151 111.912 254.151 111.31C254.151 110.776 254.036 110.353 253.805 110.04C253.577 109.728 253.266 109.571 252.872 109.571C252.485 109.571 252.177 109.726 251.949 110.035C251.721 110.341 251.607 110.8 251.607 111.412ZM252.452 106.749H253.238L254.659 107.97H253.624L252.848 107.276L252.071 107.97H251.031L252.452 106.749ZM255.03 105.895H256.114L255.06 107.198H254.293L255.03 105.895Z" fill="#333333"/>
<path d="M257.823 107.433V108.717H258.756V109.596H257.823V112.545C257.823 112.747 257.862 112.893 257.94 112.984C258.022 113.072 258.165 113.116 258.37 113.116C258.507 113.116 258.645 113.1 258.785 113.067V113.985C258.515 114.06 258.255 114.098 258.004 114.098C257.092 114.098 256.637 113.595 256.637 112.589V109.596H255.768V108.717H256.637V107.433H257.823Z" fill="#333333"/>
<path d="M195 104.09C195.002 103.798 194.889 103.523 194.683 103.317C194.477 103.112 194.202 102.999 193.911 103C193.619 103.001 193.345 103.116 193.138 103.322C193.051 103.41 192.892 103.599 192.805 103.704C192.713 103.814 192.728 103.977 192.838 104.069C192.949 104.16 193.112 104.145 193.203 104.035C193.34 103.871 193.453 103.741 193.505 103.689C193.614 103.58 193.759 103.519 193.913 103.518C193.914 103.518 193.914 103.518 193.915 103.518C194.067 103.518 194.21 103.577 194.316 103.684C194.424 103.791 194.483 103.935 194.482 104.088C194.481 104.241 194.421 104.386 194.311 104.495C194.214 104.593 193.877 104.86 193.395 105.197C193.11 104.709 192.582 104.381 191.978 104.381H188.182C187.669 104.381 187.188 104.581 186.825 104.943L179.238 112.53C179.085 112.684 179 112.888 179 113.105C179 113.322 179.085 113.526 179.238 113.679L184.321 118.762C184.48 118.921 184.688 119 184.896 119C185.104 119 185.312 118.921 185.47 118.762L193.057 111.175C193.42 110.813 193.619 110.331 193.619 109.819V106.023C193.619 105.911 193.608 105.801 193.586 105.696C194.135 105.318 194.538 105.003 194.678 104.862C194.885 104.655 194.999 104.381 195 104.09ZM193.101 109.819C193.101 110.193 192.955 110.544 192.691 110.808L185.103 118.396C184.989 118.51 184.803 118.51 184.688 118.396L179.605 113.312C179.549 113.257 179.518 113.183 179.518 113.105C179.518 113.026 179.549 112.952 179.605 112.897L187.192 105.31C187.456 105.045 187.808 104.9 188.182 104.9H191.978C192.404 104.9 192.775 105.138 192.966 105.489C192.659 105.692 192.317 105.907 191.953 106.119C191.941 106.107 191.93 106.095 191.918 106.083C191.493 105.658 190.803 105.658 190.378 106.083C189.954 106.507 189.954 107.198 190.378 107.622C190.59 107.835 190.869 107.941 191.148 107.941C191.427 107.941 191.706 107.835 191.918 107.622C192.201 107.339 192.295 106.937 192.2 106.575C192.517 106.391 192.82 106.202 193.101 106.02C193.101 106.021 193.101 106.022 193.101 106.023L193.101 109.819ZM190.916 106.969C190.962 107.059 191.053 107.112 191.148 107.112C191.187 107.112 191.227 107.103 191.265 107.084C191.417 107.008 191.568 106.928 191.718 106.847C191.719 106.995 191.664 107.143 191.551 107.256C191.329 107.478 190.967 107.478 190.745 107.256C190.522 107.033 190.522 106.672 190.745 106.449C190.856 106.338 191.002 106.282 191.148 106.282C191.264 106.282 191.379 106.318 191.477 106.387C191.331 106.467 191.182 106.545 191.032 106.621C190.904 106.685 190.852 106.841 190.916 106.969Z" fill="#8EB6FF"/>
<path d="M193.101 109.819C193.101 110.193 192.955 110.544 192.691 110.808L185.103 118.396C184.989 118.51 184.803 118.51 184.688 118.396L179.605 113.312C179.549 113.257 179.518 113.183 179.518 113.105C179.518 113.026 179.549 112.952 179.605 112.897L187.192 105.31C187.456 105.045 187.808 104.9 188.182 104.9H191.978C192.404 104.9 192.775 105.138 192.966 105.489C192.659 105.692 192.317 105.907 191.953 106.119C191.941 106.107 191.93 106.095 191.918 106.083C191.493 105.658 190.803 105.658 190.378 106.083C189.954 106.507 189.954 107.198 190.378 107.622C190.59 107.835 190.869 107.941 191.148 107.941C191.427 107.941 191.706 107.835 191.918 107.622C192.201 107.339 192.295 106.937 192.2 106.575C192.517 106.391 192.82 106.202 193.101 106.02C193.101 106.021 193.101 106.022 193.101 106.023L193.101 109.819Z" fill="#8EB6FF"/>
<path d="M190.916 106.969C190.962 107.059 191.053 107.112 191.148 107.112C191.187 107.112 191.227 107.103 191.265 107.084C191.417 107.008 191.568 106.928 191.718 106.847C191.719 106.995 191.664 107.143 191.551 107.256C191.329 107.478 190.967 107.478 190.745 107.256C190.522 107.033 190.522 106.672 190.745 106.449C190.856 106.338 191.002 106.282 191.148 106.282C191.264 106.282 191.379 106.318 191.477 106.387C191.331 106.467 191.182 106.545 191.032 106.621C190.904 106.685 190.852 106.841 190.916 106.969Z" fill="#8EB6FF"/>
<path d="M195 104.09C195.002 103.798 194.889 103.523 194.683 103.317C194.477 103.112 194.202 102.999 193.911 103C193.619 103.001 193.345 103.116 193.138 103.322C193.051 103.41 192.892 103.599 192.805 103.704C192.713 103.814 192.728 103.977 192.838 104.069C192.949 104.16 193.112 104.145 193.203 104.035C193.34 103.871 193.453 103.741 193.505 103.689C193.614 103.58 193.759 103.519 193.913 103.518C193.914 103.518 193.914 103.518 193.915 103.518C194.067 103.518 194.21 103.577 194.316 103.684C194.424 103.791 194.483 103.935 194.482 104.088C194.481 104.241 194.421 104.386 194.311 104.495C194.214 104.593 193.877 104.86 193.395 105.197C193.11 104.709 192.582 104.381 191.978 104.381H188.182C187.669 104.381 187.188 104.581 186.825 104.943L179.238 112.53C179.085 112.684 179 112.888 179 113.105C179 113.322 179.085 113.526 179.238 113.679L184.321 118.762C184.48 118.921 184.688 119 184.896 119C185.104 119 185.312 118.921 185.47 118.762L193.057 111.175C193.42 110.813 193.619 110.331 193.619 109.819V106.023C193.619 105.911 193.608 105.801 193.586 105.696C194.135 105.318 194.538 105.003 194.678 104.862C194.885 104.655 194.999 104.381 195 104.09ZM193.101 109.819C193.101 110.193 192.955 110.544 192.691 110.808L185.103 118.396C184.989 118.51 184.803 118.51 184.688 118.396L179.605 113.312C179.549 113.257 179.518 113.183 179.518 113.105C179.518 113.026 179.549 112.952 179.605 112.897L187.192 105.31C187.456 105.045 187.808 104.9 188.182 104.9H191.978C192.404 104.9 192.775 105.138 192.966 105.489C192.659 105.692 192.317 105.907 191.953 106.119C191.941 106.107 191.93 106.095 191.918 106.083C191.493 105.658 190.803 105.658 190.378 106.083C189.954 106.507 189.954 107.198 190.378 107.622C190.59 107.835 190.869 107.941 191.148 107.941C191.427 107.941 191.706 107.835 191.918 107.622C192.201 107.339 192.295 106.937 192.2 106.575C192.517 106.391 192.82 106.202 193.101 106.02C193.101 106.021 193.101 106.022 193.101 106.023L193.101 109.819ZM190.916 106.969C190.962 107.059 191.053 107.112 191.148 107.112C191.187 107.112 191.227 107.103 191.265 107.084C191.417 107.008 191.568 106.928 191.718 106.847C191.719 106.995 191.664 107.143 191.551 107.256C191.329 107.478 190.967 107.478 190.745 107.256C190.522 107.033 190.522 106.672 190.745 106.449C190.856 106.338 191.002 106.282 191.148 106.282C191.264 106.282 191.379 106.318 191.477 106.387C191.331 106.467 191.182 106.545 191.032 106.621C190.904 106.685 190.852 106.841 190.916 106.969Z" fill="#2A3D4F"/>
<path d="M186.724 108.28C186.581 108.28 186.465 108.396 186.465 108.539V114.014C186.465 114.157 186.581 114.273 186.724 114.273C186.867 114.273 186.983 114.157 186.983 114.014V108.539C186.983 108.396 186.867 108.28 186.724 108.28Z" fill="#2A3D4F"/>
<path d="M185.539 110.506C185.114 110.082 184.423 110.082 183.999 110.506C183.575 110.931 183.575 111.622 183.999 112.046C184.211 112.258 184.49 112.364 184.769 112.364C185.048 112.364 185.327 112.258 185.539 112.046C185.744 111.84 185.858 111.567 185.858 111.276C185.858 110.985 185.744 110.712 185.539 110.506ZM185.172 111.679C184.95 111.902 184.588 111.902 184.366 111.679C184.143 111.457 184.143 111.095 184.366 110.873C184.477 110.762 184.623 110.706 184.769 110.706C184.915 110.706 185.061 110.762 185.172 110.873C185.28 110.981 185.339 111.124 185.339 111.276C185.339 111.429 185.28 111.572 185.172 111.679Z" fill="#FEB166"/>
<path d="M185.172 111.679C184.95 111.902 184.588 111.902 184.366 111.679C184.143 111.457 184.143 111.095 184.366 110.873C184.477 110.762 184.623 110.706 184.769 110.706C184.915 110.706 185.061 110.762 185.172 110.873C185.28 110.981 185.339 111.124 185.339 111.276C185.339 111.429 185.28 111.572 185.172 111.679Z" fill="#FEB166"/>
<path d="M185.539 110.506C185.114 110.082 184.423 110.082 183.999 110.506C183.575 110.931 183.575 111.622 183.999 112.046C184.211 112.258 184.49 112.364 184.769 112.364C185.048 112.364 185.327 112.258 185.539 112.046C185.744 111.84 185.858 111.567 185.858 111.276C185.858 110.985 185.744 110.712 185.539 110.506ZM185.172 111.679C184.95 111.902 184.588 111.902 184.366 111.679C184.143 111.457 184.143 111.095 184.366 110.873C184.477 110.762 184.623 110.706 184.769 110.706C184.915 110.706 185.061 110.762 185.172 110.873C185.28 110.981 185.339 111.124 185.339 111.276C185.339 111.429 185.28 111.572 185.172 111.679Z" fill="#2A3D4F"/>
<path d="M189.449 110.506C189.024 110.082 188.334 110.082 187.909 110.506C187.485 110.931 187.485 111.622 187.909 112.046C188.121 112.258 188.4 112.364 188.679 112.364C188.958 112.364 189.237 112.258 189.449 112.046C189.873 111.622 189.873 110.931 189.449 110.506ZM189.082 111.679C188.86 111.902 188.498 111.902 188.276 111.679C188.053 111.457 188.053 111.095 188.276 110.873C188.387 110.762 188.533 110.706 188.679 110.706C188.825 110.706 188.971 110.762 189.082 110.873C189.305 111.095 189.305 111.457 189.082 111.679Z" fill="#FEB166"/>
<path d="M189.082 111.679C188.86 111.902 188.498 111.902 188.276 111.679C188.053 111.457 188.053 111.095 188.276 110.873C188.387 110.762 188.533 110.706 188.679 110.706C188.825 110.706 188.971 110.762 189.082 110.873C189.305 111.095 189.305 111.457 189.082 111.679Z" fill="#FEB166"/>
<path d="M189.449 110.506C189.024 110.082 188.334 110.082 187.909 110.506C187.485 110.931 187.485 111.622 187.909 112.046C188.121 112.258 188.4 112.364 188.679 112.364C188.958 112.364 189.237 112.258 189.449 112.046C189.873 111.622 189.873 110.931 189.449 110.506ZM189.082 111.679C188.86 111.902 188.498 111.902 188.276 111.679C188.053 111.457 188.053 111.095 188.276 110.873C188.387 110.762 188.533 110.706 188.679 110.706C188.825 110.706 188.971 110.762 189.082 110.873C189.305 111.095 189.305 111.457 189.082 111.679Z" fill="#2A3D4F"/>
<g filter="url(#filter2_d)">
<path d="M4 125C4 122.791 5.79086 121 8 121H98C100.209 121 102 122.791 102 125V147C102 149.209 100.209 151 98 151H8C5.79086 151 4 149.209 4 147V125Z" fill="white"/>
</g>
<path d="M38.3623 139H37.127L33.958 133.956V139H32.7227V131.891H33.958L37.1367 136.954V131.891H38.3623V139Z" fill="#333333"/>
<path d="M39.4854 136.31C39.4854 135.785 39.5863 135.318 39.7881 134.908C39.9932 134.495 40.2812 134.177 40.6523 133.956C41.0234 133.731 41.4499 133.619 41.9316 133.619C42.6641 133.619 43.2549 133.862 43.7041 134.347C43.8766 134.285 44.002 134.168 44.0801 133.995C44.1582 133.823 44.1973 133.551 44.1973 133.18H45.0127C45.0127 133.616 44.9411 133.98 44.7979 134.273C44.6546 134.563 44.4154 134.768 44.0801 134.889C44.2852 135.296 44.391 135.756 44.3975 136.271V136.412C44.3975 136.933 44.2965 137.398 44.0947 137.809C43.8962 138.219 43.6081 138.536 43.2305 138.761C42.8561 138.985 42.4264 139.098 41.9414 139.098C41.2025 139.098 40.6084 138.852 40.1592 138.36C39.71 137.869 39.4854 137.205 39.4854 136.368V136.31ZM40.667 136.412C40.667 136.956 40.7793 137.382 41.0039 137.691C41.2285 137.997 41.541 138.15 41.9414 138.15C42.3418 138.15 42.6527 137.994 42.874 137.682C43.0986 137.369 43.2109 136.912 43.2109 136.31C43.2109 135.766 43.0954 135.341 42.8643 135.035C42.6364 134.726 42.3255 134.571 41.9316 134.571C41.5443 134.571 41.2367 134.726 41.0088 135.035C40.7809 135.341 40.667 135.8 40.667 136.412Z" fill="#333333"/>
<path d="M46.7412 139H45.5547V133.717H46.7412V139ZM45.4814 132.345C45.4814 132.162 45.5384 132.011 45.6523 131.891C45.7695 131.77 45.9355 131.71 46.1504 131.71C46.3652 131.71 46.5312 131.77 46.6484 131.891C46.7656 132.011 46.8242 132.162 46.8242 132.345C46.8242 132.524 46.7656 132.674 46.6484 132.794C46.5312 132.911 46.3652 132.97 46.1504 132.97C45.9355 132.97 45.7695 132.911 45.6523 132.794C45.5384 132.674 45.4814 132.524 45.4814 132.345Z" fill="#333333"/>
<path d="M55.1641 136.412C55.1641 137.232 54.9801 137.885 54.6123 138.37C54.2477 138.855 53.7448 139.098 53.1035 139.098C52.485 139.098 52.0033 138.875 51.6582 138.429L51.5996 139H50.5254V131.5H51.7119V134.225C52.0537 133.821 52.5143 133.619 53.0938 133.619C53.7383 133.619 54.2445 133.858 54.6123 134.337C54.9801 134.815 55.1641 135.484 55.1641 136.344V136.412ZM53.9775 136.31C53.9775 135.737 53.8766 135.307 53.6748 135.021C53.473 134.734 53.18 134.591 52.7959 134.591C52.2816 134.591 51.9202 134.815 51.7119 135.265V137.442C51.9235 137.901 52.2881 138.131 52.8057 138.131C53.1768 138.131 53.4632 137.993 53.665 137.716C53.8669 137.439 53.971 137.021 53.9775 136.461V136.31Z" fill="#333333"/>
<path d="M59.3193 139C59.2673 138.899 59.2217 138.735 59.1826 138.507C58.805 138.901 58.3428 139.098 57.7959 139.098C57.2653 139.098 56.8324 138.946 56.4971 138.644C56.1618 138.341 55.9941 137.966 55.9941 137.521C55.9941 136.957 56.2025 136.526 56.6191 136.227C57.0391 135.924 57.638 135.772 58.416 135.772H59.1436V135.426C59.1436 135.152 59.0671 134.934 58.9141 134.771C58.7611 134.605 58.5283 134.522 58.2158 134.522C57.9456 134.522 57.7243 134.591 57.5518 134.728C57.3792 134.861 57.293 135.032 57.293 135.24H56.1064C56.1064 134.951 56.2025 134.68 56.3945 134.43C56.5866 134.176 56.847 133.977 57.1758 133.834C57.5078 133.691 57.8773 133.619 58.2842 133.619C58.9027 133.619 59.3958 133.775 59.7637 134.088C60.1315 134.397 60.3203 134.833 60.3301 135.396V137.779C60.3301 138.255 60.3968 138.634 60.5303 138.917V139H59.3193ZM58.0156 138.146C58.25 138.146 58.4697 138.089 58.6748 137.975C58.8831 137.861 59.0394 137.708 59.1436 137.516V136.52H58.5039C58.0645 136.52 57.734 136.596 57.5127 136.749C57.2913 136.902 57.1807 137.118 57.1807 137.398C57.1807 137.626 57.2555 137.809 57.4053 137.945C57.5583 138.079 57.7617 138.146 58.0156 138.146ZM58.6748 131.5H60.0273L58.6748 132.979H57.7227L58.6748 131.5Z" fill="#333333"/>
<path d="M62.6738 133.717L62.708 134.327C63.0986 133.855 63.6113 133.619 64.2461 133.619C65.3464 133.619 65.9062 134.249 65.9258 135.509V139H64.7393V135.577C64.7393 135.242 64.666 134.994 64.5195 134.835C64.3763 134.672 64.1403 134.591 63.8115 134.591C63.333 134.591 62.9766 134.807 62.7422 135.24V139H61.5557V133.717H62.6738Z" fill="#333333"/>
<path d="M72.8301 138.482C72.4818 138.893 71.987 139.098 71.3457 139.098C70.7728 139.098 70.3382 138.93 70.042 138.595C69.749 138.259 69.6025 137.774 69.6025 137.14V133.717H70.7891V137.125C70.7891 137.796 71.0674 138.131 71.624 138.131C72.2002 138.131 72.5892 137.924 72.791 137.511V133.717H73.9775V139H72.8594L72.8301 138.482Z" fill="#333333"/>
<path d="M77.0342 137.301L78.1084 133.717H79.373L77.2734 139.801C76.9512 140.689 76.4043 141.134 75.6328 141.134C75.4603 141.134 75.2699 141.104 75.0615 141.046V140.128L75.2861 140.143C75.5856 140.143 75.8102 140.087 75.96 139.977C76.113 139.869 76.2334 139.687 76.3213 139.43L76.4922 138.976L74.6367 133.717H75.916L77.0342 137.301Z" fill="#333333"/>
<path d="M84.0361 132.433V133.717H84.9688V134.596H84.0361V137.545C84.0361 137.747 84.0752 137.893 84.1533 137.984C84.2347 138.072 84.3779 138.116 84.583 138.116C84.7197 138.116 84.8581 138.1 84.998 138.067V138.985C84.7279 139.06 84.4674 139.098 84.2168 139.098C83.3053 139.098 82.8496 138.595 82.8496 137.589V134.596H81.9805V133.717H82.8496V132.433H84.0361Z" fill="#333333"/>
<path d="M87.1562 139H85.9697V133.717H87.1562V139ZM86.9316 131.534H88.2842L86.9316 133.014H85.9795L86.9316 131.534Z" fill="#333333"/>
<path d="M89.6074 133.717L89.6416 134.327C90.0322 133.855 90.5449 133.619 91.1797 133.619C92.2799 133.619 92.8398 134.249 92.8594 135.509V139H91.6729V135.577C91.6729 135.242 91.5996 134.994 91.4531 134.835C91.3099 134.672 91.0739 134.591 90.7451 134.591C90.2666 134.591 89.9102 134.807 89.6758 135.24V139H88.4893V133.717H89.6074Z" fill="#333333"/>
<path d="M25 141.312C24.8275 141.312 24.6875 141.453 24.6875 141.625C24.6875 141.798 24.8275 141.938 25 141.938C25.1725 141.938 25.3125 141.798 25.3125 141.625C25.3125 141.453 25.1725 141.312 25 141.312Z" fill="#2A3D4F"/>
<path d="M25.9375 129.482V128.938C25.9375 128.421 25.5169 128 25 128H15C14.4831 128 14.0625 128.421 14.0625 128.938V129.482C12.0242 133.247 12.0001 133.135 12 133.312C12 133.312 12 133.312 12 133.312V133.938C12 134.479 12.3132 134.983 12.8125 135.269V143.688C12.8125 143.86 12.9524 144 13.125 144H26.875C27.0476 144 27.1875 143.86 27.1875 143.688V135.269C27.6818 134.983 28 134.473 28 133.938V133.312C28 133.313 28 133.312 28 133.312C27.9999 133.133 27.956 133.21 25.9375 129.482ZM27.159 133H25.2253L24.1836 129.875H25.4403L27.159 133ZM22.8125 133.625H24.6875V133.938C24.6875 134.454 24.2669 134.875 23.75 134.875C23.2331 134.875 22.8125 134.454 22.8125 133.938V133.625ZM22.7647 133L22.2439 129.875H23.5247L24.5664 133H22.7647ZM14.6875 128.938C14.6875 128.765 14.8277 128.625 15 128.625H25C25.1723 128.625 25.3125 128.765 25.3125 128.938V129.25C25.0149 129.25 14.9874 129.25 14.6875 129.25V128.938ZM22.1875 133.625V133.938C22.1875 134.454 21.7669 134.875 21.25 134.875C20.7331 134.875 20.3125 134.454 20.3125 133.938V133.625H22.1875ZM20.3125 133V129.875H21.6103L22.1311 133H20.3125ZM17.8689 133L18.3898 129.875H19.6875V133H17.8689ZM19.6875 133.625V133.938C19.6875 134.454 19.2669 134.875 18.75 134.875C18.2331 134.875 17.8125 134.454 17.8125 133.938V133.625H19.6875ZM15.4336 133L16.4752 129.875H17.7561L17.2352 133H15.4336ZM17.1875 133.625V133.938C17.1875 134.454 16.7669 134.875 16.25 134.875C15.7331 134.875 15.3125 134.454 15.3125 133.938V133.625H17.1875ZM14.5598 129.875H15.8164L14.7747 133H12.841L14.5598 129.875ZM12.625 133.938V133.625H14.6875V133.938C14.6875 134.428 14.196 134.875 13.6562 134.875C13.5202 134.875 13.3792 134.845 13.2479 134.789C12.8753 134.631 12.625 134.288 12.625 133.938ZM18.4375 143.375H15.3125V140.688H18.4375V143.375ZM18.4375 140.062H15.3125V137.375H18.4375V140.062ZM26.5625 143.375H19.0625V137.062C19.0625 136.89 18.9226 136.75 18.75 136.75H15C14.8274 136.75 14.6875 136.89 14.6875 137.062V143.375H13.4375V135.485C13.5099 135.495 13.5829 135.5 13.6562 135.5C14.0675 135.5 14.4833 135.337 14.7968 135.053C14.8662 134.99 14.9286 134.923 14.9846 134.853C15.2688 135.244 15.73 135.5 16.25 135.5C16.7606 135.5 17.2147 135.254 17.5 134.874C17.7853 135.254 18.2394 135.5 18.75 135.5C19.2606 135.5 19.7147 135.254 20 134.874C20.2853 135.254 20.7394 135.5 21.25 135.5C21.7606 135.5 22.2147 135.254 22.5 134.874C22.7853 135.254 23.2394 135.5 23.75 135.5C24.27 135.5 24.7312 135.244 25.0154 134.853C25.0714 134.923 25.1338 134.99 25.2032 135.053C25.5167 135.337 25.9325 135.5 26.3438 135.5C26.4169 135.5 26.4899 135.495 26.5625 135.485V143.375ZM27.375 133.938C27.375 134.298 27.1153 134.645 26.7289 134.799C26.6026 134.85 26.473 134.875 26.3438 134.875C25.804 134.875 25.3125 134.428 25.3125 133.938V133.625H27.375V133.938Z" fill="#2A3D4F"/>
<path d="M14.5598 129.875H15.8164L14.7747 133H12.841L14.5598 129.875Z" fill="#8EB6FF"/>
<path d="M12.625 133.938V133.625H14.6875V133.938C14.6875 134.428 14.196 134.875 13.6562 134.875C13.5202 134.875 13.3792 134.845 13.2479 134.789C12.8753 134.631 12.625 134.288 12.625 133.938Z" fill="#8EB6FF"/>
<path d="M17.1875 133.625V133.938C17.1875 134.454 16.7669 134.875 16.25 134.875C15.7331 134.875 15.3125 134.454 15.3125 133.938V133.625H17.1875Z" fill="#8EB6FF"/>
<path d="M15.4336 133L16.4752 129.875H17.7561L17.2352 133H15.4336Z" fill="#8EB6FF"/>
<path d="M17.8689 133L18.3898 129.875H19.6875V133H17.8689Z" fill="#8EB6FF"/>
<path d="M19.6875 133.625V133.938C19.6875 134.454 19.2669 134.875 18.75 134.875C18.2331 134.875 17.8125 134.454 17.8125 133.938V133.625H19.6875Z" fill="#8EB6FF"/>
<path d="M20.3125 133V129.875H21.6103L22.1311 133H20.3125Z" fill="#8EB6FF"/>
<path d="M22.1875 133.625V133.938C22.1875 134.454 21.7669 134.875 21.25 134.875C20.7331 134.875 20.3125 134.454 20.3125 133.938V133.625H22.1875Z" fill="#8EB6FF"/>
<path d="M22.8125 133.625H24.6875V133.938C24.6875 134.454 24.2669 134.875 23.75 134.875C23.2331 134.875 22.8125 134.454 22.8125 133.938V133.625Z" fill="#8EB6FF"/>
<path d="M22.7647 133L22.2439 129.875H23.5247L24.5664 133H22.7647Z" fill="#8EB6FF"/>
<path d="M27.159 133H25.2253L24.1836 129.875H25.4403L27.159 133Z" fill="#8EB6FF"/>
<path d="M27.375 133.938C27.375 134.298 27.1153 134.645 26.7289 134.799C26.6026 134.85 26.473 134.875 26.3438 134.875C25.804 134.875 25.3125 134.428 25.3125 133.938V133.625H27.375V133.938Z" fill="#8EB6FF"/>
<path d="M14.6875 128.938C14.6875 128.765 14.8277 128.625 15 128.625H25C25.1723 128.625 25.3125 128.765 25.3125 128.938V129.25H14.6875V128.938Z" fill="#8EB6FF"/>
<path d="M26.5625 143.375H19.0625V137.062C19.0625 136.89 18.9226 136.75 18.75 136.75H15C14.8274 136.75 14.6875 136.89 14.6875 137.062V143.375H13.4375V135.485C13.5099 135.495 13.5829 135.5 13.6562 135.5C14.0675 135.5 14.4833 135.337 14.7968 135.053C14.8662 134.99 14.9286 134.923 14.9846 134.853C15.2688 135.244 15.73 135.5 16.25 135.5C16.7606 135.5 17.2147 135.254 17.5 134.874C17.7853 135.254 18.2394 135.5 18.75 135.5C19.2606 135.5 19.7147 135.254 20 134.874C20.2853 135.254 20.7394 135.5 21.25 135.5C21.7606 135.5 22.2147 135.254 22.5 134.874C22.7853 135.254 23.2394 135.5 23.75 135.5C24.27 135.5 24.7312 135.244 25.0154 134.853C25.0714 134.923 25.1338 134.99 25.2032 135.053C25.5167 135.337 25.9325 135.5 26.3438 135.5C26.4169 135.5 26.4899 135.495 26.5625 135.485V143.375Z" fill="#8EB6FF"/>
<path d="M18.4375 140.062H15.3125V137.375H18.4375V140.062Z" fill="#8EB6FF"/>
<path d="M18.4375 143.375H15.3125V140.688H18.4375V143.375Z" fill="#8EB6FF"/>
<path d="M14.6875 128.938C14.6875 128.765 14.8277 128.625 15 128.625H25C25.1723 128.625 25.3125 128.765 25.3125 128.938V129.25H14.6875V128.938Z" fill="#FEB166"/>
<path d="M18.4375 140.062H15.3125V137.375H18.4375V140.062Z" fill="#FEB166"/>
<path d="M18.4375 143.375H15.3125V140.688H18.4375V143.375Z" fill="#FEB166"/>
<path d="M25.625 140.062H25.3125V137.062C25.3125 136.89 25.1726 136.75 25 136.75H21.25C21.0774 136.75 20.9375 136.89 20.9375 137.062V140.062H20.625C20.4524 140.062 20.3125 140.202 20.3125 140.375C20.3125 140.548 20.4524 140.688 20.625 140.688H25.625C25.7976 140.688 25.9375 140.548 25.9375 140.375C25.9375 140.202 25.7976 140.062 25.625 140.062ZM24.6875 140.062H21.5625V137.375H24.6875V140.062Z" fill="#FEB166"/>
<path d="M24.6875 140.062H21.5625V137.375H24.6875V140.062Z" fill="#FEB166"/>
<path d="M25.625 140.062H25.3125V137.062C25.3125 136.89 25.1726 136.75 25 136.75H21.25C21.0774 136.75 20.9375 136.89 20.9375 137.062V140.062H20.625C20.4524 140.062 20.3125 140.202 20.3125 140.375C20.3125 140.548 20.4524 140.688 20.625 140.688H25.625C25.7976 140.688 25.9375 140.548 25.9375 140.375C25.9375 140.202 25.7976 140.062 25.625 140.062ZM24.6875 140.062H21.5625V137.375H24.6875V140.062Z" fill="#2A3D4F"/>
<path d="M23.75 141.312H21.25C21.0774 141.312 20.9375 141.452 20.9375 141.625C20.9375 141.798 21.0774 141.938 21.25 141.938H23.75C23.9226 141.938 24.0625 141.798 24.0625 141.625C24.0625 141.452 23.9226 141.312 23.75 141.312Z" fill="#2A3D4F"/>
<path fill-rule="evenodd" clip-rule="evenodd" d="M149.443 151.583C148.998 150.719 148.293 150.207 147.808 150.005L148.192 149.082C148.874 149.366 149.769 150.032 150.332 151.125C150.904 152.235 151.113 153.744 150.474 155.658C149.694 157.999 148.019 160.44 146.222 162.173C145.323 163.04 144.372 163.75 143.464 164.179C142.568 164.602 141.628 164.79 140.814 164.464C139.711 164.023 138.825 163.229 138.171 162.442C137.517 161.654 137.069 160.842 136.853 160.317L137.777 159.936C137.956 160.369 138.351 161.094 138.94 161.803C139.53 162.513 140.289 163.177 141.186 163.536C141.622 163.71 142.245 163.648 143.037 163.275C143.816 162.907 144.678 162.273 145.528 161.453C147.231 159.81 148.806 157.502 149.526 155.342C150.088 153.657 149.88 152.43 149.443 151.583ZM131.387 153.716C131.342 155.361 131.416 157.239 131.499 158.467L131.515 158.711L126.832 162.874L126.168 162.126L130.485 158.289C130.408 157.045 130.344 155.268 130.388 153.689C130.411 152.848 130.465 152.048 130.567 151.41C130.619 151.092 130.684 150.798 130.771 150.554C130.851 150.326 130.976 150.065 131.191 149.896L131.81 150.681C131.811 150.68 131.812 150.679 131.812 150.679C131.813 150.68 131.77 150.727 131.713 150.888C131.655 151.053 131.601 151.281 131.555 151.569C131.462 152.143 131.41 152.893 131.387 153.716Z" fill="#666D78"/>
<path fill-rule="evenodd" clip-rule="evenodd" d="M131.319 157.547L131.49 158.402C131.595 158.926 131.824 159.574 132.187 160.113C132.551 160.652 133.018 161.04 133.596 161.153C134.115 161.254 134.813 161.152 135.735 160.576C136.132 160.327 136.567 160.038 137.029 159.716C137.255 159.558 137.567 159.613 137.725 159.839C137.883 160.066 137.828 160.378 137.601 160.536C137.129 160.866 136.68 161.165 136.265 161.424C135.405 161.961 134.618 162.2 133.908 162.187C133.603 163.906 133.288 166.459 133.25 169.024C133.208 171.849 133.506 174.582 134.437 176.257C134.571 176.498 134.484 176.803 134.243 176.937C134.001 177.071 133.697 176.984 133.563 176.743C132.494 174.818 132.208 171.849 132.25 169.009C132.289 166.375 132.612 163.761 132.926 161.996C132.244 161.731 131.73 161.223 131.358 160.672C131.087 160.27 130.881 159.829 130.733 159.406L126.832 162.873C126.626 163.057 126.31 163.038 126.126 162.832C125.943 162.625 125.961 162.309 126.168 162.126L131.319 157.547ZM165.351 188.522C165.614 188.44 165.895 188.587 165.977 188.851C166.405 190.218 166.844 192.353 166.762 194.321C166.681 196.252 166.078 198.254 164.175 198.968C163.591 199.187 162.848 199.266 162.025 199.258C161.194 199.251 160.243 199.156 159.222 199.002C157.181 198.693 154.817 198.141 152.501 197.546C151.203 197.213 149.897 196.86 148.67 196.529C147.724 196.273 146.825 196.031 146.015 195.82C145.071 195.574 144.233 195.367 143.54 195.223C142.837 195.075 142.319 195 142 195C141.423 195 140.819 195.289 140.205 195.852C139.593 196.414 139.014 197.209 138.497 198.121C137.463 199.947 136.733 202.141 136.493 203.582C136.448 203.854 136.19 204.038 135.918 203.993C135.645 203.948 135.461 203.69 135.507 203.418C135.767 201.858 136.537 199.553 137.627 197.628C138.173 196.665 138.813 195.773 139.529 195.116C140.243 194.461 141.077 194 142 194C142.431 194 143.038 194.096 143.745 194.244C144.462 194.394 145.319 194.605 146.267 194.852C147.107 195.071 148.008 195.314 148.951 195.569C150.162 195.896 151.441 196.242 152.749 196.578C155.058 197.171 157.382 197.712 159.372 198.013C160.366 198.164 161.267 198.252 162.034 198.259C162.808 198.265 163.409 198.187 163.824 198.032C165.122 197.545 165.685 196.13 165.763 194.279C165.839 192.463 165.429 190.448 165.023 189.149C164.94 188.885 165.087 188.605 165.351 188.522ZM169.178 221.532C169.227 221.26 169.487 221.08 169.759 221.129C173.263 221.763 176.602 222.184 179.515 222.269C182.271 222.35 184.608 222.128 186.336 221.527C186.596 221.437 186.881 221.575 186.972 221.835C187.063 222.096 186.925 222.381 186.664 222.472C184.914 223.081 182.669 223.315 180.128 223.282L183.988 240.39C184.048 240.659 183.879 240.927 183.61 240.987C183.341 241.048 183.073 240.879 183.012 240.61L179.097 223.256C176.212 223.144 172.961 222.724 169.581 222.113C169.309 222.064 169.129 221.804 169.178 221.532Z" fill="#666D78"/>
<path d="M126.5 162.5C125.3 158.9 127.84 153.143 129.261 150.714C130.011 150.558 130.757 150.416 131.5 150.289C130.7 150.919 130.834 156.026 131 158.5L126.5 162.5Z" fill="#6BCFC8"/>
<path d="M150 155.5C151.2 151.9 149.167 150.029 148 149.544C147.551 151.829 141.451 157.239 137.315 160.127C137.71 161.085 139 163.2 141 164C143.5 165 148.5 160 150 155.5Z" fill="#6BCFC8"/>
<path d="M118 124.5C118.367 129.267 121.563 134.959 123.505 137.8C123.825 138.268 124.252 138.647 124.755 138.91C129.004 141.133 138.105 144.628 146 143.5C156.5 142 155.5 119.5 155 117.5C154.5 115.5 152.5 111 148.5 109C144.5 107 134.5 106 128.5 108C124.113 109.462 122.177 113.82 121.621 116.34C121.534 116.738 121.236 117.056 120.875 117.243C119.503 117.951 117.656 120.032 118 124.5Z" fill="#2A2A2A"/>
<path d="M121.5 131C120.7 129 121.833 124.167 122.5 122C122.666 121.333 123.5 120.6 125.5 123C128 126 139 127 143.5 127C148 127 148.5 132.5 148.5 132C148.5 131.5 149.5 129.5 150 129C150.5 128.5 152.5 127.5 152.5 131C152.5 133.8 150.5 135.5 149.5 136C149.5 141 145.5 150.5 134.5 151C125.7 151.4 122.166 141.167 121.5 136C120 135.5 118 132 119 131C119.8 130.2 121 130.667 121.5 131Z" fill="#FF8974"/>
<path fill-rule="evenodd" clip-rule="evenodd" d="M136.727 130.861C135.682 130.944 134.735 131.23 134.197 131.46C133.943 131.569 133.649 131.451 133.541 131.197C133.432 130.944 133.549 130.65 133.803 130.541C134.432 130.271 135.485 129.957 136.648 129.865C137.807 129.773 139.134 129.898 140.257 130.572C140.494 130.714 140.571 131.021 140.429 131.258C140.287 131.494 139.98 131.571 139.743 131.429C138.866 130.903 137.776 130.778 136.727 130.861Z" fill="#B95744"/>
<path fill-rule="evenodd" clip-rule="evenodd" d="M122.501 129.469C122.518 129.193 122.756 128.984 123.031 129.001C124.395 129.086 126.448 129.392 128.177 130.045C129.04 130.371 129.855 130.795 130.462 131.348C131.076 131.907 131.5 132.622 131.5 133.5C131.5 135.337 130.975 137.031 130.539 138.402C130.526 138.444 130.512 138.486 130.499 138.527C130.294 139.171 130.117 139.728 130.012 140.214C129.9 140.74 129.893 141.099 129.974 141.342C130.062 141.604 129.92 141.887 129.658 141.974C129.396 142.062 129.113 141.92 129.026 141.658C128.857 141.152 128.913 140.573 129.035 140.005C129.149 139.469 129.341 138.867 129.541 138.24C129.556 138.193 129.571 138.146 129.586 138.098C130.025 136.719 130.5 135.163 130.5 133.5C130.5 132.978 130.257 132.514 129.788 132.087C129.312 131.653 128.627 131.284 127.823 130.98C126.219 130.374 124.272 130.08 122.969 129.999C122.693 129.982 122.484 129.744 122.501 129.469Z" fill="#B95744"/>
<path d="M127 133.5C127 134.328 126.328 135 125.5 135C124.672 135 124 134.328 124 133.5C124 132.672 124.672 132 125.5 132C126.328 132 127 132.672 127 133.5Z" fill="#333333"/>
<path d="M138 133.5C138 134.328 137.328 135 136.5 135C135.672 135 135 134.328 135 133.5C135 132.672 135.672 132 136.5 132C137.328 132 138 132.672 138 133.5Z" fill="#333333"/>
<path d="M134 144.5C134 145.328 132.881 146 131.5 146C130.119 146 129.5 145.328 129.5 144.5C129.5 143.672 130.619 143.5 132 143.5C133.381 143.5 134 143.672 134 144.5Z" fill="white"/>
<path d="M62 202H140.586C141.477 202 141.923 203.077 141.293 203.707L138.293 206.707C138.105 206.895 137.851 207 137.586 207H67L62 202Z" fill="#EEEEEE"/>
<path d="M65 205H140L138 207H67L65 205Z" fill="#BEC9C9"/>
<path fill-rule="evenodd" clip-rule="evenodd" d="M63.793 204.5H141.207L138.207 207.5H66.7929L63.793 204.5ZM66.2072 205.5L67.2072 206.5H137.793L138.793 205.5H66.2072Z" fill="#BEC9C9"/>
<path d="M47.6194 174.404C47.3278 173.743 47.8118 173 48.5343 173H106.357C106.749 173 107.104 173.229 107.267 173.585L122.5 207H62.6519C62.2557 207 61.8969 206.766 61.737 206.404L47.6194 174.404Z" fill="#EEEEEE"/>
<path fill-rule="evenodd" clip-rule="evenodd" d="M47.1615 174.605C46.7241 173.614 47.4502 172.5 48.5339 172.5H106.357C106.944 172.5 107.478 172.843 107.721 173.378L123.277 207.5H62.6515C62.0572 207.5 61.5189 207.149 61.2791 206.605L47.1615 174.605ZM48.5339 173.5C48.1727 173.5 47.9306 173.871 48.0764 174.202L62.194 206.202C62.274 206.383 62.4534 206.5 62.6515 206.5H121.722L106.811 173.793C106.73 173.614 106.552 173.5 106.357 173.5H48.5339Z" fill="#EEEEEE"/>
<path fill-rule="evenodd" clip-rule="evenodd" d="M117.278 195.545C117.529 195.431 117.826 195.541 117.94 195.793L122.822 206.5H135C135.276 206.5 135.5 206.724 135.5 207C135.5 207.276 135.276 207.5 135 207.5H122.179L117.031 196.208C116.916 195.956 117.027 195.66 117.278 195.545Z" fill="#666D78"/>
<path d="M83.7935 193.423C83.3409 193.43 83.0638 193.89 83.1757 194.447C83.2877 195.004 83.747 195.452 84.1996 195.444C84.6521 195.437 84.9293 194.978 84.8173 194.421C84.7054 193.863 84.246 193.416 83.7935 193.423ZM84.0642 194.771C83.9137 194.773 83.7601 194.623 83.7229 194.438C83.6857 194.253 83.7783 194.099 83.9288 194.097C84.0793 194.094 84.2329 194.244 84.2701 194.429C84.3073 194.615 84.2147 194.768 84.0642 194.771Z" fill="#333333"/>
<path d="M86.4202 191.824C85.5659 191.126 84.5859 190.75 83.6619 190.765C82.7378 190.78 81.9139 191.185 81.3439 191.905C81.2383 192.037 81.2667 192.272 81.4066 192.428C81.546 192.585 81.7445 192.606 81.8492 192.472C82.8162 191.255 84.6988 191.225 86.1448 192.403C86.2129 192.46 86.2879 192.486 86.3568 192.485C86.4448 192.483 86.5242 192.436 86.5666 192.346C86.6432 192.186 86.5779 191.952 86.4202 191.824Z" fill="#333333"/>
<path d="M88.6504 189.652C87.0406 188.197 85.1735 187.411 83.3941 187.44C81.6147 187.469 80.0678 188.31 79.0393 189.808C78.9407 189.95 78.9797 190.189 79.1254 190.34C79.2714 190.492 79.4698 190.498 79.5665 190.356C80.5065 188.988 81.9183 188.22 83.5425 188.194C85.1666 188.167 86.8707 188.884 88.3415 190.213C88.414 190.278 88.4953 190.31 88.5702 190.309C88.6531 190.308 88.7285 190.266 88.7738 190.183C88.8593 190.028 88.8043 189.79 88.6504 189.652Z" fill="#333333"/>
<path d="M90.8323 187.455C88.4838 185.259 85.7474 184.074 83.1266 184.117C80.5045 184.16 78.2465 185.423 76.7696 187.673C76.6725 187.818 76.7151 188.059 76.8625 188.208C77.0095 188.36 77.2075 188.361 77.3028 188.216C78.6914 186.102 80.812 184.915 83.2748 184.875C85.7363 184.834 88.3065 185.948 90.5119 188.01C90.5857 188.079 90.6693 188.113 90.7462 188.112C90.828 188.11 90.9021 188.07 90.9482 187.99C91.0363 187.837 90.9844 187.597 90.8323 187.455Z" fill="#333333"/>
<path d="M82.5002 208.993C88.5002 210.993 90.6668 208.493 91.0001 206.993C91.5 205.5 92.6 203 91 203C90.5 203 90 204 89.5 205.5C88 203 86.7902 200.856 85.5 201.501C84.5 202 86.3333 204.833 87 206C85.0001 204.333 81 202 80.5 202.5C79.6058 203.395 83.4999 206.16 84.5 206.993C82.8333 206.103 78 204.164 78 205.5C78 206.837 81.0001 208.386 82.5002 208.993Z" fill="#FF8974"/>
<path d="M140 240C140 239.448 140.448 239 141 239H199C199.552 239 200 239.448 200 240C200 240.552 199.552 241 199 241H141C140.448 241 140 240.552 140 240Z" fill="#8BAAA7"/>
<g filter="url(#filter3_d)">
<path d="M96 54C96 51.7909 97.7909 50 100 50H210C212.209 50 214 51.7909 214 54V76C214 78.2091 212.209 80 210 80H100C97.7909 80 96 78.2091 96 76V54Z" fill="white"/>
</g>
<path d="M126.324 60.8906L128.375 66.3398L130.421 60.8906H132.018V68H130.787V65.6562L130.909 62.5215L128.81 68H127.926L125.831 62.5264L125.953 65.6562V68H124.723V60.8906H126.324Z" fill="#333333"/>
<path d="M136.524 68C136.472 67.8991 136.427 67.7347 136.388 67.5068C136.01 67.9007 135.548 68.0977 135.001 68.0977C134.47 68.0977 134.037 67.9463 133.702 67.6436C133.367 67.3408 133.199 66.9665 133.199 66.5205C133.199 65.9574 133.408 65.526 133.824 65.2266C134.244 64.9238 134.843 64.7725 135.621 64.7725H136.349V64.4258C136.349 64.1523 136.272 63.9342 136.119 63.7715C135.966 63.6055 135.733 63.5225 135.421 63.5225C135.151 63.5225 134.929 63.5908 134.757 63.7275C134.584 63.861 134.498 64.0319 134.498 64.2402H133.312C133.312 63.9505 133.408 63.6803 133.6 63.4297C133.792 63.1758 134.052 62.9772 134.381 62.834C134.713 62.6908 135.082 62.6191 135.489 62.6191C136.108 62.6191 136.601 62.7754 136.969 63.0879C137.337 63.3971 137.525 63.8333 137.535 64.3965V66.7793C137.535 67.2546 137.602 67.6338 137.735 67.917V68H136.524ZM135.221 67.1455C135.455 67.1455 135.675 67.0885 135.88 66.9746C136.088 66.8607 136.244 66.7077 136.349 66.5156V65.5195H135.709C135.27 65.5195 134.939 65.596 134.718 65.749C134.496 65.902 134.386 66.1185 134.386 66.3984C134.386 66.6263 134.461 66.8086 134.61 66.9453C134.763 67.0788 134.967 67.1455 135.221 67.1455ZM137.11 60.627C137.11 61.0371 136.967 61.3691 136.681 61.623C136.394 61.877 136.012 62.0039 135.533 62.0039C135.055 62.0039 134.672 61.877 134.386 61.623C134.099 61.3691 133.956 61.0371 133.956 60.627H134.845C134.845 60.8418 134.905 61.0094 135.025 61.1299C135.149 61.2471 135.318 61.3057 135.533 61.3057C135.748 61.3057 135.916 61.2471 136.036 61.1299C136.157 61.0094 136.217 60.8418 136.217 60.627H137.11ZM134.459 69.1426C134.459 68.9701 134.516 68.8252 134.63 68.708C134.747 68.5941 134.913 68.5371 135.128 68.5371C135.343 68.5371 135.509 68.5941 135.626 68.708C135.743 68.8252 135.802 68.9701 135.802 69.1426C135.802 69.3151 135.743 69.4583 135.626 69.5723C135.509 69.6862 135.343 69.7432 135.128 69.7432C134.913 69.7432 134.747 69.6862 134.63 69.5723C134.516 69.4583 134.459 69.3151 134.459 69.1426Z" fill="#333333"/>
<path d="M140.265 61.4326V62.7168H141.197V63.5957H140.265V66.5449C140.265 66.7467 140.304 66.8932 140.382 66.9844C140.463 67.0723 140.606 67.1162 140.812 67.1162C140.948 67.1162 141.087 67.0999 141.227 67.0674V67.9854C140.956 68.0602 140.696 68.0977 140.445 68.0977C139.534 68.0977 139.078 67.5947 139.078 66.5889V63.5957H138.209V62.7168H139.078V61.4326H140.265Z" fill="#333333"/>
<path d="M145.768 63.293C146.155 62.8438 146.645 62.6191 147.237 62.6191C148.364 62.6191 148.935 63.262 148.951 64.5479V68H147.765V64.5918C147.765 64.2272 147.685 63.9701 147.525 63.8203C147.369 63.6673 147.138 63.5908 146.832 63.5908C146.357 63.5908 146.002 63.8024 145.768 64.2256V68H144.581V60.5H145.768V63.293Z" fill="#333333"/>
<path d="M153.312 68C153.259 67.8991 153.214 67.7347 153.175 67.5068C152.797 67.9007 152.335 68.0977 151.788 68.0977C151.257 68.0977 150.825 67.9463 150.489 67.6436C150.154 67.3408 149.986 66.9665 149.986 66.5205C149.986 65.9574 150.195 65.526 150.611 65.2266C151.031 64.9238 151.63 64.7725 152.408 64.7725H153.136V64.4258C153.136 64.1523 153.059 63.9342 152.906 63.7715C152.753 63.6055 152.521 63.5225 152.208 63.5225C151.938 63.5225 151.716 63.5908 151.544 63.7275C151.371 63.861 151.285 64.0319 151.285 64.2402H150.099C150.099 63.9505 150.195 63.6803 150.387 63.4297C150.579 63.1758 150.839 62.9772 151.168 62.834C151.5 62.6908 151.869 62.6191 152.276 62.6191C152.895 62.6191 153.388 62.7754 153.756 63.0879C154.124 63.3971 154.312 63.8333 154.322 64.3965V66.7793C154.322 67.2546 154.389 67.6338 154.522 67.917V68H153.312ZM152.008 67.1455C152.242 67.1455 152.462 67.0885 152.667 66.9746C152.875 66.8607 153.032 66.7077 153.136 66.5156V65.5195H152.496C152.057 65.5195 151.726 65.596 151.505 65.749C151.284 65.902 151.173 66.1185 151.173 66.3984C151.173 66.6263 151.248 66.8086 151.397 66.9453C151.55 67.0788 151.754 67.1455 152.008 67.1455ZM152.936 61.9795H151.949L150.631 60.5H151.983L152.936 61.9795Z" fill="#333333"/>
<path d="M156.666 62.7168L156.7 63.3271C157.091 62.8551 157.604 62.6191 158.238 62.6191C159.339 62.6191 159.898 63.249 159.918 64.5088V68H158.731V64.5771C158.731 64.2419 158.658 63.9945 158.512 63.835C158.368 63.6722 158.132 63.5908 157.804 63.5908C157.325 63.5908 156.969 63.8073 156.734 64.2402V68H155.548V62.7168H156.666Z" fill="#333333"/>
<path d="M160.924 65.3193C160.924 64.499 161.116 63.8447 161.5 63.3564C161.887 62.8649 162.4 62.6191 163.038 62.6191C163.64 62.6191 164.114 62.8291 164.459 63.249L164.513 62.7168H165.582V67.8389C165.582 68.5322 165.366 69.0791 164.933 69.4795C164.503 69.8799 163.922 70.0801 163.189 70.0801C162.802 70.0801 162.423 69.9987 162.052 69.8359C161.684 69.6764 161.404 69.4665 161.212 69.2061L161.773 68.4932C162.138 68.9261 162.587 69.1426 163.121 69.1426C163.515 69.1426 163.826 69.0352 164.054 68.8203C164.282 68.6087 164.396 68.2962 164.396 67.8828V67.5264C164.054 67.9072 163.598 68.0977 163.028 68.0977C162.41 68.0977 161.904 67.8519 161.51 67.3604C161.119 66.8688 160.924 66.1885 160.924 65.3193ZM162.105 65.4219C162.105 65.9525 162.213 66.3708 162.428 66.6768C162.646 66.9795 162.947 67.1309 163.331 67.1309C163.81 67.1309 164.164 66.9258 164.396 66.5156V64.1914C164.171 63.791 163.819 63.5908 163.341 63.5908C162.95 63.5908 162.646 63.7454 162.428 64.0547C162.213 64.3639 162.105 64.8197 162.105 65.4219Z" fill="#333333"/>
<path d="M174.557 62.0234H173.702V68H172.628L172.569 67.4531C172.215 67.8828 171.741 68.0977 171.148 68.0977C170.53 68.0977 170.029 67.8486 169.645 67.3506C169.264 66.8525 169.073 66.1755 169.073 65.3193C169.073 64.5055 169.262 63.8529 169.64 63.3613C170.017 62.8665 170.523 62.6191 171.158 62.6191C171.718 62.6191 172.171 62.8145 172.516 63.2051V62.0234H171.29V61.1934H172.516V60.5H173.702V61.1934H174.557V62.0234ZM170.26 65.4219C170.26 65.959 170.362 66.3789 170.567 66.6816C170.776 66.9811 171.07 67.1309 171.451 67.1309C171.936 67.1309 172.291 66.9144 172.516 66.4814V64.2256C172.298 63.8024 171.946 63.5908 171.461 63.5908C171.077 63.5908 170.781 63.7438 170.572 64.0498C170.364 64.3525 170.26 64.8099 170.26 65.4219Z" fill="#333333"/>
<path d="M178.614 68C178.562 67.8991 178.517 67.7347 178.478 67.5068C178.1 67.9007 177.638 68.0977 177.091 68.0977C176.56 68.0977 176.127 67.9463 175.792 67.6436C175.457 67.3408 175.289 66.9665 175.289 66.5205C175.289 65.9574 175.497 65.526 175.914 65.2266C176.334 64.9238 176.933 64.7725 177.711 64.7725H178.438V64.4258C178.438 64.1523 178.362 63.9342 178.209 63.7715C178.056 63.6055 177.823 63.5225 177.511 63.5225C177.241 63.5225 177.019 63.5908 176.847 63.7275C176.674 63.861 176.588 64.0319 176.588 64.2402H175.401C175.401 63.9505 175.497 63.6803 175.689 63.4297C175.882 63.1758 176.142 62.9772 176.471 62.834C176.803 62.6908 177.172 62.6191 177.579 62.6191C178.198 62.6191 178.691 62.7754 179.059 63.0879C179.426 63.3971 179.615 63.8333 179.625 64.3965V66.7793C179.625 67.2546 179.692 67.6338 179.825 67.917V68H178.614ZM177.311 67.1455C177.545 67.1455 177.765 67.0885 177.97 66.9746C178.178 66.8607 178.334 66.7077 178.438 66.5156V65.5195H177.799C177.359 65.5195 177.029 65.596 176.808 65.749C176.586 65.902 176.476 66.1185 176.476 66.3984C176.476 66.6263 176.55 66.8086 176.7 66.9453C176.853 67.0788 177.057 67.1455 177.311 67.1455Z" fill="#333333"/>
<path d="M183.136 65.3193C183.136 64.5055 183.325 63.8529 183.702 63.3613C184.08 62.8665 184.586 62.6191 185.221 62.6191C185.781 62.6191 186.233 62.8145 186.578 63.2051V60.5H187.765V68H186.69L186.632 67.4531C186.277 67.8828 185.803 68.0977 185.211 68.0977C184.592 68.0977 184.091 67.8486 183.707 67.3506C183.326 66.8525 183.136 66.1755 183.136 65.3193ZM184.322 65.4219C184.322 65.959 184.425 66.3789 184.63 66.6816C184.838 66.9811 185.133 67.1309 185.514 67.1309C185.999 67.1309 186.354 66.9144 186.578 66.4814V64.2256C186.36 63.8024 186.008 63.5908 185.523 63.5908C185.139 63.5908 184.843 63.7438 184.635 64.0498C184.426 64.3525 184.322 64.8099 184.322 65.4219Z" fill="#333333"/>
<path d="M192.159 68C192.107 67.8991 192.062 67.7347 192.022 67.5068C191.645 67.9007 191.183 68.0977 190.636 68.0977C190.105 68.0977 189.672 67.9463 189.337 67.6436C189.002 67.3408 188.834 66.9665 188.834 66.5205C188.834 65.9574 189.042 65.526 189.459 65.2266C189.879 64.9238 190.478 64.7725 191.256 64.7725H191.983V64.4258C191.983 64.1523 191.907 63.9342 191.754 63.7715C191.601 63.6055 191.368 63.5225 191.056 63.5225C190.785 63.5225 190.564 63.5908 190.392 63.7275C190.219 63.861 190.133 64.0319 190.133 64.2402H188.946C188.946 63.9505 189.042 63.6803 189.234 63.4297C189.426 63.1758 189.687 62.9772 190.016 62.834C190.348 62.6908 190.717 62.6191 191.124 62.6191C191.743 62.6191 192.236 62.7754 192.604 63.0879C192.971 63.3971 193.16 63.8333 193.17 64.3965V66.7793C193.17 67.2546 193.237 67.6338 193.37 67.917V68H192.159ZM190.855 67.1455C191.09 67.1455 191.31 67.0885 191.515 66.9746C191.723 66.8607 191.879 66.7077 191.983 66.5156V65.5195H191.344C190.904 65.5195 190.574 65.596 190.353 65.749C190.131 65.902 190.021 66.1185 190.021 66.3984C190.021 66.6263 190.095 66.8086 190.245 66.9453C190.398 67.0788 190.602 67.1455 190.855 67.1455ZM190.094 69.1426C190.094 68.9701 190.151 68.8252 190.265 68.708C190.382 68.5941 190.548 68.5371 190.763 68.5371C190.978 68.5371 191.144 68.5941 191.261 68.708C191.378 68.8252 191.437 68.9701 191.437 69.1426C191.437 69.3151 191.378 69.4583 191.261 69.5723C191.144 69.6862 190.978 69.7432 190.763 69.7432C190.548 69.7432 190.382 69.6862 190.265 69.5723C190.151 69.4583 190.094 69.3151 190.094 69.1426Z" fill="#333333"/>
<path d="M195.514 62.7168L195.548 63.3271C195.938 62.8551 196.451 62.6191 197.086 62.6191C198.186 62.6191 198.746 63.249 198.766 64.5088V68H197.579V64.5771C197.579 64.2419 197.506 63.9945 197.359 63.835C197.216 63.6722 196.98 63.5908 196.651 63.5908C196.173 63.5908 195.816 63.8073 195.582 64.2402V68H194.396V62.7168H195.514Z" fill="#333333"/>
<path d="M199.771 65.3193C199.771 64.499 199.964 63.8447 200.348 63.3564C200.735 62.8649 201.248 62.6191 201.886 62.6191C202.488 62.6191 202.962 62.8291 203.307 63.249L203.36 62.7168H204.43V67.8389C204.43 68.5322 204.213 69.0791 203.78 69.4795C203.351 69.8799 202.77 70.0801 202.037 70.0801C201.65 70.0801 201.271 69.9987 200.899 69.8359C200.532 69.6764 200.252 69.4665 200.06 69.2061L200.621 68.4932C200.986 68.9261 201.435 69.1426 201.969 69.1426C202.363 69.1426 202.674 69.0352 202.901 68.8203C203.129 68.6087 203.243 68.2962 203.243 67.8828V67.5264C202.901 67.9072 202.446 68.0977 201.876 68.0977C201.257 68.0977 200.751 67.8519 200.357 67.3604C199.967 66.8688 199.771 66.1885 199.771 65.3193ZM200.953 65.4219C200.953 65.9525 201.061 66.3708 201.275 66.6768C201.493 66.9795 201.795 67.1309 202.179 67.1309C202.657 67.1309 203.012 66.9258 203.243 66.5156V64.1914C203.019 63.791 202.667 63.5908 202.188 63.5908C201.798 63.5908 201.493 63.7454 201.275 64.0547C201.061 64.3639 200.953 64.8197 200.953 65.4219Z" fill="#333333"/>
<path d="M112.728 61.3635H114.183V58.0908H111.273V59.3057C112.132 59.6086 112.728 60.4312 112.728 61.3635Z" fill="#FEB166"/>
<path d="M115.636 58.0908H114.909V61.3635H115.636V58.0908Z" fill="#FEB166"/>
<path d="M117.819 59.5454H116.364V61.3636H117.819V59.5454Z" fill="#FEB166"/>
<path d="M116.728 61.3636C116.798 61.3636 116.869 61.3839 116.93 61.4247L117.092 61.5327V59.5454H116.364V61.5323L116.526 61.4243C116.588 61.3839 116.658 61.3636 116.728 61.3636Z" fill="#FEB166"/>
<path d="M113.435 62.0046C113.447 61.9137 113.455 61.8217 113.455 61.7275C113.455 60.7293 112.784 59.89 111.869 59.6304C112.395 60.0333 112.727 60.6678 112.727 61.3638C112.727 61.4191 112.725 61.474 112.721 61.5286L113.435 62.0046Z" fill="#FEB166"/>
<path d="M109.818 72.6362C110.22 72.6362 110.545 72.3106 110.545 71.9089C110.545 71.5073 110.22 71.1816 109.818 71.1816C109.416 71.1816 109.091 71.5073 109.091 71.9089C109.091 72.3106 109.416 72.6362 109.818 72.6362Z" fill="#2A3D4F"/>
<path d="M116.363 72.6362C116.765 72.6362 117.09 72.3106 117.09 71.9089C117.09 71.5073 116.765 71.1816 116.363 71.1816C115.961 71.1816 115.636 71.5073 115.636 71.9089C115.636 72.3106 115.961 72.6362 116.363 72.6362Z" fill="#2A3D4F"/>
<path d="M117.607 67.909C117.963 67.909 118.271 67.6435 118.324 67.2915L119.206 62.0908H107.508L108.662 67.909H117.607Z" fill="#8EB6FF"/>
<path d="M118.514 62.0908L117.733 66.5643C117.68 66.9163 117.372 67.1818 117.017 67.1818H108.538L108.668 67.909H117.607C117.963 67.909 118.271 67.6436 118.324 67.2916L119.214 62.0909H118.514V62.0908Z" fill="#8EB6FF"/>
<path d="M116.727 66.4547C116.526 66.4547 116.363 66.2922 116.363 66.0911V63.182C116.363 62.9809 116.526 62.8184 116.727 62.8184C116.928 62.8184 117.091 62.9809 117.091 63.182V66.0911C117.091 66.2922 116.928 66.4547 116.727 66.4547Z" fill="#2A3D4F"/>
<path d="M114.545 66.4547C114.344 66.4547 114.182 66.2922 114.182 66.0911V63.182C114.182 62.9809 114.344 62.8184 114.545 62.8184C114.746 62.8184 114.909 62.9809 114.909 63.182V66.0911C114.909 66.2922 114.746 66.4547 114.545 66.4547Z" fill="#2A3D4F"/>
<path d="M112.364 66.4547C112.163 66.4547 112 66.2922 112 66.0911V63.182C112 62.9809 112.163 62.8184 112.364 62.8184C112.565 62.8184 112.727 62.9809 112.727 63.182V66.0911C112.727 66.2922 112.565 66.4547 112.364 66.4547Z" fill="#2A3D4F"/>
<path d="M110.182 66.4547C109.981 66.4547 109.818 66.2922 109.818 66.0911V63.182C109.818 62.9809 109.981 62.8184 110.182 62.8184C110.383 62.8184 110.546 62.9809 110.546 63.182V66.0911C110.546 66.2922 110.383 66.4547 110.182 66.4547Z" fill="#2A3D4F"/>
<path d="M105.09 59.9089C105.291 59.9089 105.454 59.7461 105.454 59.5453C105.454 59.3444 105.291 59.1816 105.09 59.1816C104.889 59.1816 104.727 59.3444 104.727 59.5453C104.727 59.7461 104.889 59.9089 105.09 59.9089Z" fill="#8EB6FF"/>
<path d="M110.837 59.9383C110.746 59.9186 110.65 59.9092 110.545 59.9092C109.743 59.9092 109.091 60.5616 109.091 61.3637H112C112 60.6739 111.511 60.0743 110.837 59.9383Z" fill="#FEB166"/>
<path d="M119.914 61.4925C119.845 61.411 119.744 61.3638 119.636 61.3638H118.545V59.1819C118.545 58.9808 118.383 58.8183 118.182 58.8183H116.364V57.7274C116.364 57.5263 116.201 57.3638 116 57.3638H114.545H110.909C110.708 57.3638 110.545 57.5263 110.545 57.7274V59.1819C109.342 59.1819 108.364 60.1605 108.364 61.3637H107.369L107.009 59.3554C106.917 58.8332 106.466 58.4547 105.938 58.4547H105.091C104.489 58.4546 104 58.9441 104 59.5456C104 60.1471 104.489 60.6365 105.091 60.6365C105.692 60.6365 106.182 60.147 106.182 59.5456C106.182 59.4412 106.163 59.3423 106.135 59.2467C106.215 59.3001 106.275 59.3812 106.293 59.4831L107.966 68.1303C107.552 68.3867 107.273 68.8416 107.273 69.3638C107.273 70.166 107.925 70.8183 108.727 70.8183H118.182C118.383 70.8183 118.545 70.6558 118.545 70.4547C118.545 70.2536 118.383 70.0911 118.182 70.0911H108.727C108.326 70.0911 108 69.7649 108 69.3638C108 68.9627 108.326 68.6365 108.727 68.6365H117.607C118.32 68.6365 118.937 68.1049 119.042 67.4063L119.995 61.7881C120.013 61.6826 119.983 61.5746 119.914 61.4925ZM105.091 59.9092C104.89 59.9092 104.727 59.7463 104.727 59.5456C104.727 59.3449 104.89 59.182 105.091 59.182C105.292 59.182 105.455 59.3449 105.455 59.5456C105.455 59.7463 105.292 59.9092 105.091 59.9092ZM116.364 59.5456H117.818V61.3638H116.364V59.5456ZM114.909 58.091H115.636V59.1819V61.3637H114.909V58.091ZM111.273 59.3059V58.091H114.182V61.3637H113.455H112.727C112.727 60.4288 112.125 59.6096 111.267 59.3096C111.269 59.3081 111.271 59.3074 111.273 59.3059ZM110.545 59.9092C110.65 59.9092 110.747 59.9187 110.837 59.9383C111.511 60.0743 112 60.6739 112 61.3637H109.091C109.091 60.5616 109.743 59.9092 110.545 59.9092ZM118.324 67.2917C118.271 67.6437 117.963 67.9092 117.607 67.9092H108.662L107.508 62.091H119.206L118.324 67.2917Z" fill="#2A3D4F"/>
<defs>
<filter id="filter0_d" x="10" y="0" width="158" height="40" filterUnits="userSpaceOnUse" color-interpolation-filters="sRGB">
<feFlood flood-opacity="0" result="BackgroundImageFix"/>
<feColorMatrix in="SourceAlpha" type="matrix" values="0 0 0 0 0 0 0 0 0 0 0 0 0 0 0 0 0 0 127 0"/>
<feOffset dy="2"/>
<feGaussianBlur stdDeviation="2"/>
<feColorMatrix type="matrix" values="0 0 0 0 0 0 0 0 0 0 0 0 0 0 0 0 0 0 0.25 0"/>
<feBlend mode="normal" in2="BackgroundImageFix" result="effect1_dropShadow"/>
<feBlend mode="normal" in="SourceGraphic" in2="effect1_dropShadow" result="shape"/>
</filter>
<filter id="filter1_d" x="167" y="94" width="105" height="38" filterUnits="userSpaceOnUse" color-interpolation-filters="sRGB">
<feFlood flood-opacity="0" result="BackgroundImageFix"/>
<feColorMatrix in="SourceAlpha" type="matrix" values="0 0 0 0 0 0 0 0 0 0 0 0 0 0 0 0 0 0 127 0"/>
<feOffset dy="2"/>
<feGaussianBlur stdDeviation="2"/>
<feColorMatrix type="matrix" values="0 0 0 0 0 0 0 0 0 0 0 0 0 0 0 0 0 0 0.25 0"/>
<feBlend mode="normal" in2="BackgroundImageFix" result="effect1_dropShadow"/>
<feBlend mode="normal" in="SourceGraphic" in2="effect1_dropShadow" result="shape"/>
</filter>
<filter id="filter2_d" x="0" y="119" width="106" height="38" filterUnits="userSpaceOnUse" color-interpolation-filters="sRGB">
<feFlood flood-opacity="0" result="BackgroundImageFix"/>
<feColorMatrix in="SourceAlpha" type="matrix" values="0 0 0 0 0 0 0 0 0 0 0 0 0 0 0 0 0 0 127 0"/>
<feOffset dy="2"/>
<feGaussianBlur stdDeviation="2"/>
<feColorMatrix type="matrix" values="0 0 0 0 0 0 0 0 0 0 0 0 0 0 0 0 0 0 0.25 0"/>
<feBlend mode="normal" in2="BackgroundImageFix" result="effect1_dropShadow"/>
<feBlend mode="normal" in="SourceGraphic" in2="effect1_dropShadow" result="shape"/>
</filter>
<filter id="filter3_d" x="92" y="48" width="126" height="38" filterUnits="userSpaceOnUse" color-interpolation-filters="sRGB">
<feFlood flood-opacity="0" result="BackgroundImageFix"/>
<feColorMatrix in="SourceAlpha" type="matrix" values="0 0 0 0 0 0 0 0 0 0 0 0 0 0 0 0 0 0 127 0"/>
<feOffset dy="2"/>
<feGaussianBlur stdDeviation="2"/>
<feColorMatrix type="matrix" values="0 0 0 0 0 0 0 0 0 0 0 0 0 0 0 0 0 0 0.25 0"/>
<feBlend mode="normal" in2="BackgroundImageFix" result="effect1_dropShadow"/>
<feBlend mode="normal" in="SourceGraphic" in2="effect1_dropShadow" result="shape"/>
</filter>
</defs>
</svg>
