<svg width="12" height="8" viewBox="0 0 12 8" fill="none" xmlns="http://www.w3.org/2000/svg">
<path d="M0.306031 0.566264C0.00736458 0.89219 0.00736458 1.40145 0.306031 1.72737L5.38337 7.24774C5.68203 7.57367 6.1487 7.57367 6.44737 7.24774L11.506 1.707C11.8047 1.40145 11.8234 0.871819 11.5247 0.545894C11.2447 0.219968 10.7594 0.199598 10.4607 0.525524L10.442 0.545894L5.90603 5.51626L1.37003 0.545894C1.07136 0.240338 0.604698 0.240338 0.306031 0.566264Z" fill="#207BC1"/>
</svg>
