<svg width="11" height="8" viewBox="0 0 11 8" fill="none" xmlns="http://www.w3.org/2000/svg">
<g clip-path="url(#clip0)">
<path d="M1.02671 1.86628C0.792041 2.10332 0.792041 2.47369 1.02671 2.71073L5.01604 6.72554C5.25071 6.96258 5.61737 6.96258 5.85204 6.72554L9.82671 2.69591C10.0614 2.47369 10.076 2.0885 9.84137 1.85147C9.62137 1.61443 9.24004 1.59962 9.00537 1.83665L8.99071 1.85147L5.42671 5.46628L1.86271 1.85147C1.62804 1.62925 1.26137 1.62925 1.02671 1.86628Z" fill="#207BC1"/>
</g>
<defs>
<clipPath id="clip0">
<rect y="8" width="8" height="11" transform="rotate(-90 0 8)" fill="white"/>
</clipPath>
</defs>
</svg>
