<svg width="77" height="16" viewBox="0 0 77 16" fill="none" xmlns="http://www.w3.org/2000/svg">
<path d="M4.40234 6.86133L6.78809 3.04688H8.33301L5.18848 7.98242L8.4082 13H6.84961L4.40234 9.11719L1.94141 13H0.389648L3.61621 7.98242L0.464844 3.04688H2.00293L4.40234 6.86133ZM12.626 13.1367C11.6234 13.1367 10.8076 12.8086 10.1787 12.1523C9.5498 11.4915 9.23535 10.6097 9.23535 9.50684V9.27441C9.23535 8.54069 9.37435 7.88672 9.65234 7.3125C9.9349 6.73372 10.3268 6.28255 10.8281 5.95898C11.334 5.63086 11.8809 5.4668 12.4688 5.4668C13.4303 5.4668 14.1777 5.78353 14.7109 6.41699C15.2441 7.05046 15.5107 7.95736 15.5107 9.1377V9.66406H10.5C10.5182 10.3932 10.7301 10.9834 11.1357 11.4346C11.5459 11.8812 12.0654 12.1045 12.6943 12.1045C13.141 12.1045 13.5192 12.0133 13.8291 11.8311C14.139 11.6488 14.4102 11.4072 14.6426 11.1064L15.415 11.708C14.7952 12.6605 13.8656 13.1367 12.626 13.1367ZM12.4688 6.50586C11.9583 6.50586 11.5299 6.69271 11.1836 7.06641C10.8372 7.43555 10.623 7.95508 10.541 8.625H14.2461V8.5293C14.2096 7.88672 14.0365 7.38997 13.7266 7.03906C13.4167 6.68359 12.9974 6.50586 12.4688 6.50586ZM18.1699 5.60352L18.2041 6.42383C18.7464 5.78581 19.4779 5.4668 20.3984 5.4668C21.4329 5.4668 22.137 5.86328 22.5107 6.65625C22.7568 6.30078 23.0758 6.01367 23.4678 5.79492C23.8643 5.57617 24.3314 5.4668 24.8691 5.4668C26.4915 5.4668 27.3164 6.32585 27.3438 8.04395V13H26.0791V8.11914C26.0791 7.59049 25.9583 7.19629 25.7168 6.93652C25.4753 6.6722 25.0697 6.54004 24.5 6.54004C24.0306 6.54004 23.641 6.68132 23.3311 6.96387C23.0212 7.24186 22.8411 7.61784 22.791 8.0918V13H21.5195V8.15332C21.5195 7.0778 20.9932 6.54004 19.9404 6.54004C19.111 6.54004 18.5436 6.89323 18.2383 7.59961V13H16.9736V5.60352H18.1699ZM34.4463 3.8125V5.60352H35.8271V6.58105H34.4463V11.168C34.4463 11.4642 34.5078 11.6875 34.6309 11.8379C34.7539 11.9837 34.9635 12.0566 35.2598 12.0566C35.4056 12.0566 35.6061 12.0293 35.8613 11.9746V13C35.5286 13.0911 35.2051 13.1367 34.8906 13.1367C34.3255 13.1367 33.8994 12.9658 33.6123 12.624C33.3252 12.2822 33.1816 11.7969 33.1816 11.168V6.58105H31.835V5.60352H33.1816V3.8125H34.4463ZM38.5752 6.49902C39.1357 5.81087 39.8649 5.4668 40.7627 5.4668C42.3258 5.4668 43.1143 6.34863 43.1279 8.1123V13H41.8633V8.10547C41.8587 7.57227 41.7357 7.17806 41.4941 6.92285C41.2572 6.66764 40.8857 6.54004 40.3799 6.54004C39.9697 6.54004 39.6097 6.64941 39.2998 6.86816C38.9899 7.08691 38.7484 7.37402 38.5752 7.72949V13H37.3105V2.5H38.5752V6.49902ZM48.0908 13.1367C47.0882 13.1367 46.2725 12.8086 45.6436 12.1523C45.0146 11.4915 44.7002 10.6097 44.7002 9.50684V9.27441C44.7002 8.54069 44.8392 7.88672 45.1172 7.3125C45.3997 6.73372 45.7917 6.28255 46.293 5.95898C46.7988 5.63086 47.3457 5.4668 47.9336 5.4668C48.8952 5.4668 49.6426 5.78353 50.1758 6.41699C50.709 7.05046 50.9756 7.95736 50.9756 9.1377V9.66406H45.9648C45.9831 10.3932 46.195 10.9834 46.6006 11.4346C47.0107 11.8812 47.5303 12.1045 48.1592 12.1045C48.6058 12.1045 48.984 12.0133 49.2939 11.8311C49.6038 11.6488 49.875 11.4072 50.1074 11.1064L50.8799 11.708C50.2601 12.6605 49.3304 13.1367 48.0908 13.1367ZM47.9336 6.50586C47.4232 6.50586 46.9948 6.69271 46.6484 7.06641C46.3021 7.43555 46.0879 7.95508 46.0059 8.625H49.7109V8.5293C49.6745 7.88672 49.5013 7.38997 49.1914 7.03906C48.8815 6.68359 48.4622 6.50586 47.9336 6.50586ZM49.998 4.37305V4.44141H48.9521L47.9268 3.2793L46.9082 4.44141H45.8623V4.35938L47.5439 2.5H48.3096L49.998 4.37305ZM53.6348 5.60352L53.6689 6.42383C54.2113 5.78581 54.9427 5.4668 55.8633 5.4668C56.8978 5.4668 57.6019 5.86328 57.9756 6.65625C58.2217 6.30078 58.5407 6.01367 58.9326 5.79492C59.3291 5.57617 59.7962 5.4668 60.334 5.4668C61.9564 5.4668 62.7812 6.32585 62.8086 8.04395V13H61.5439V8.11914C61.5439 7.59049 61.4232 7.19629 61.1816 6.93652C60.9401 6.6722 60.5345 6.54004 59.9648 6.54004C59.4954 6.54004 59.1058 6.68132 58.7959 6.96387C58.486 7.24186 58.306 7.61784 58.2559 8.0918V13H56.9844V8.15332C56.9844 7.0778 56.458 6.54004 55.4053 6.54004C54.5758 6.54004 54.0085 6.89323 53.7031 7.59961V13H52.4385V5.60352H53.6348Z" fill="#207BC1"/>
<path d="M70.099 3.21337C70.3656 2.93604 70.7823 2.93604 71.049 3.21337L75.5656 7.92804C75.8323 8.20537 75.8323 8.63871 75.5656 8.91604L71.0323 13.6134C70.7823 13.8907 70.349 13.908 70.0823 13.6307C69.8156 13.3707 69.799 12.92 70.0656 12.6427L70.0823 12.6254L74.149 8.41337L70.0823 4.20137C69.8323 3.92404 69.8323 3.4907 70.099 3.21337Z" fill="#207BC1"/>
<path d="M4.40234 6.86133L6.78809 3.04688H8.33301L5.18848 7.98242L8.4082 13H6.84961L4.40234 9.11719L1.94141 13H0.389648L3.61621 7.98242L0.464844 3.04688H2.00293L4.40234 6.86133ZM12.626 13.1367C11.6234 13.1367 10.8076 12.8086 10.1787 12.1523C9.5498 11.4915 9.23535 10.6097 9.23535 9.50684V9.27441C9.23535 8.54069 9.37435 7.88672 9.65234 7.3125C9.9349 6.73372 10.3268 6.28255 10.8281 5.95898C11.334 5.63086 11.8809 5.4668 12.4688 5.4668C13.4303 5.4668 14.1777 5.78353 14.7109 6.41699C15.2441 7.05046 15.5107 7.95736 15.5107 9.1377V9.66406H10.5C10.5182 10.3932 10.7301 10.9834 11.1357 11.4346C11.5459 11.8812 12.0654 12.1045 12.6943 12.1045C13.141 12.1045 13.5192 12.0133 13.8291 11.8311C14.139 11.6488 14.4102 11.4072 14.6426 11.1064L15.415 11.708C14.7952 12.6605 13.8656 13.1367 12.626 13.1367ZM12.4688 6.50586C11.9583 6.50586 11.5299 6.69271 11.1836 7.06641C10.8372 7.43555 10.623 7.95508 10.541 8.625H14.2461V8.5293C14.2096 7.88672 14.0365 7.38997 13.7266 7.03906C13.4167 6.68359 12.9974 6.50586 12.4688 6.50586ZM18.1699 5.60352L18.2041 6.42383C18.7464 5.78581 19.4779 5.4668 20.3984 5.4668C21.4329 5.4668 22.137 5.86328 22.5107 6.65625C22.7568 6.30078 23.0758 6.01367 23.4678 5.79492C23.8643 5.57617 24.3314 5.4668 24.8691 5.4668C26.4915 5.4668 27.3164 6.32585 27.3438 8.04395V13H26.0791V8.11914C26.0791 7.59049 25.9583 7.19629 25.7168 6.93652C25.4753 6.6722 25.0697 6.54004 24.5 6.54004C24.0306 6.54004 23.641 6.68132 23.3311 6.96387C23.0212 7.24186 22.8411 7.61784 22.791 8.0918V13H21.5195V8.15332C21.5195 7.0778 20.9932 6.54004 19.9404 6.54004C19.111 6.54004 18.5436 6.89323 18.2383 7.59961V13H16.9736V5.60352H18.1699ZM34.4463 3.8125V5.60352H35.8271V6.58105H34.4463V11.168C34.4463 11.4642 34.5078 11.6875 34.6309 11.8379C34.7539 11.9837 34.9635 12.0566 35.2598 12.0566C35.4056 12.0566 35.6061 12.0293 35.8613 11.9746V13C35.5286 13.0911 35.2051 13.1367 34.8906 13.1367C34.3255 13.1367 33.8994 12.9658 33.6123 12.624C33.3252 12.2822 33.1816 11.7969 33.1816 11.168V6.58105H31.835V5.60352H33.1816V3.8125H34.4463ZM38.5752 6.49902C39.1357 5.81087 39.8649 5.4668 40.7627 5.4668C42.3258 5.4668 43.1143 6.34863 43.1279 8.1123V13H41.8633V8.10547C41.8587 7.57227 41.7357 7.17806 41.4941 6.92285C41.2572 6.66764 40.8857 6.54004 40.3799 6.54004C39.9697 6.54004 39.6097 6.64941 39.2998 6.86816C38.9899 7.08691 38.7484 7.37402 38.5752 7.72949V13H37.3105V2.5H38.5752V6.49902ZM48.0908 13.1367C47.0882 13.1367 46.2725 12.8086 45.6436 12.1523C45.0146 11.4915 44.7002 10.6097 44.7002 9.50684V9.27441C44.7002 8.54069 44.8392 7.88672 45.1172 7.3125C45.3997 6.73372 45.7917 6.28255 46.293 5.95898C46.7988 5.63086 47.3457 5.4668 47.9336 5.4668C48.8952 5.4668 49.6426 5.78353 50.1758 6.41699C50.709 7.05046 50.9756 7.95736 50.9756 9.1377V9.66406H45.9648C45.9831 10.3932 46.195 10.9834 46.6006 11.4346C47.0107 11.8812 47.5303 12.1045 48.1592 12.1045C48.6058 12.1045 48.984 12.0133 49.2939 11.8311C49.6038 11.6488 49.875 11.4072 50.1074 11.1064L50.8799 11.708C50.2601 12.6605 49.3304 13.1367 48.0908 13.1367ZM47.9336 6.50586C47.4232 6.50586 46.9948 6.69271 46.6484 7.06641C46.3021 7.43555 46.0879 7.95508 46.0059 8.625H49.7109V8.5293C49.6745 7.88672 49.5013 7.38997 49.1914 7.03906C48.8815 6.68359 48.4622 6.50586 47.9336 6.50586ZM49.998 4.37305V4.44141H48.9521L47.9268 3.2793L46.9082 4.44141H45.8623V4.35938L47.5439 2.5H48.3096L49.998 4.37305ZM53.6348 5.60352L53.6689 6.42383C54.2113 5.78581 54.9427 5.4668 55.8633 5.4668C56.8978 5.4668 57.6019 5.86328 57.9756 6.65625C58.2217 6.30078 58.5407 6.01367 58.9326 5.79492C59.3291 5.57617 59.7962 5.4668 60.334 5.4668C61.9564 5.4668 62.7812 6.32585 62.8086 8.04395V13H61.5439V8.11914C61.5439 7.59049 61.4232 7.19629 61.1816 6.93652C60.9401 6.6722 60.5345 6.54004 59.9648 6.54004C59.4954 6.54004 59.1058 6.68132 58.7959 6.96387C58.486 7.24186 58.306 7.61784 58.2559 8.0918V13H56.9844V8.15332C56.9844 7.0778 56.458 6.54004 55.4053 6.54004C54.5758 6.54004 54.0085 6.89323 53.7031 7.59961V13H52.4385V5.60352H53.6348Z" fill="#818181"/>
<path d="M70.099 3.21337C70.3656 2.93604 70.7823 2.93604 71.049 3.21337L75.5656 7.92804C75.8323 8.20537 75.8323 8.63871 75.5656 8.91604L71.0323 13.6134C70.7823 13.8907 70.349 13.908 70.0823 13.6307C69.8156 13.3707 69.799 12.92 70.0656 12.6427L70.0823 12.6254L74.149 8.41337L70.0823 4.20137C69.8323 3.92404 69.8323 3.4907 70.099 3.21337Z" fill="#818181"/>
</svg>
