<svg width="11" height="7" viewBox="0 0 11 7" fill="none" xmlns="http://www.w3.org/2000/svg">
<path d="M10.6221 6.38028C10.8994 6.08398 10.8994 5.62102 10.6221 5.32473L5.90741 0.306207C5.63008 0.00991031 5.19674 0.00991031 4.91941 0.306207L0.222079 5.34324C-0.055254 5.62102 -0.072587 6.1025 0.204746 6.3988C0.464746 6.6951 0.915412 6.71361 1.19275 6.41732L1.21008 6.3988L5.42208 1.88028L9.63408 6.3988C9.91141 6.67658 10.3447 6.67658 10.6221 6.38028Z" fill="#333333"/>
</svg>
