{
    "name": "install",
    "version": "1.0.0",
    "license": "MIT",
    "description": "base install ability for apm",
    "repo": "https://example.com/repo/install.git",
    "lib": "http://localhost:3000/abilities/install/1.0.0/install_1.0.0.zip",
    "abilities": [
      {
        "name": "echo",
        "version": "1.0.0"
      }
    ],
    "bin": {
      "install": "abilities/install/1.0.0"
    },
    "init": "echo 'apm install 1.0.0 has been installed...'; pwd",
    "start": "echo 'Starting install...'; pwd",
    "run": {
      "greet": "echo 'Hello, World from install!'"
    }
  }