{
  "name": "kadi",
  "version": "0.0.1",
  "license": "MIT",
  "description": "Knowledge and Ability Deployment Interface (KADI) is an agent management system for managing installation of agents and abilities in a distributed system.",
  "api": "http://localhost:3000",
  "abilities": [
    {
      "name": "kadi-install",
      "version": "0.0.2"
    },
    {
      "name": "echo",
      "version": "0.0.1"
    }
  ],
  "bin": {
    "kadi": "index.js",
    "install": "abilities/kadi-install/0.0.2",
    "update": "abilities/kadi-update/0.0.1"
  },
  "init": "echo 'kadi is ready to deploy agents and abilities.'",
  "start": "echo '  kadi is running... '",
  "run": {
    "greet": "echo 'Hello from KADI!'"
  }
}