{
  "name": "kadi",
  "version": "0.0.6",
  "license": "MIT",
  "description": "Knowledge and Ability Deployment Interface (KADI) is an agent management system for managing installation of agents and abilities in a distributed system.",
  "repo": "https://gitlab.com/humin-game-lab/kadi/kadi.git",
  "lib": "https://gitlab.com/humin-game-lab/kadi/kadi/-/archive/v0.0.6/kadi-v0.0.6.zip",
  "api": "http://localhost:3000",
  "abilities": [
    {
      "name": "kadi-install",
      "version": "0.0.4"
    },
    {
      "name": "kadi-update",
      "version": "0.0.2"
    },
    {
      "name": "kadi-run",
      "version": "0.0.3"
    }
  ],
  "bin": {
    "kadi": "index.js",
    "install": "abilities/kadi-install/0.0.0"
  },
  "init": "echo 'kadi is ready to deploy agents and abilities.'",
  "start": "echo '  kadi is running... '",
  "run": {
    "greet": "echo 'Hello from KADI!'"
  }
}