{
  "name": "twilio-ability",
  "version": "0.0.1",
  "license": "MIT",
  "description": "This provides the ability to send SMS, MMS and voice messages using Twilio API",
  "repo": "https://gitlab.com/humin-game-lab/agent-abilities/twilio-ability",
  "lib":  "https://gitlab.com/humin-game-lab/agent-abilities/twilio-ability/-/archive/v0.0.1/twilio-ability-v0.0.1.zip",
  "setup": "npm install",
  "init": "echo 'Twilio Ability v0.0.1 is installed...'",
  "start": "",
  "entry": "twilioAbility.js",
  "keys": "./.env",
  "run": {},
  "abilities": [
  ],
  "bin": {}
}