<?xml version="1.0" encoding="UTF-8"?>
<!-- Generator: Adobe Illustrator 24.2.0, SVG Export Plug-In . SVG Version: 6.00 Build 0)  -->
<svg version="1.1" id="Calque_1" xmlns="http://www.w3.org/2000/svg" xmlns:xlink="http://www.w3.org/1999/xlink" x="0px" y="0px" viewBox="0 0 1366 620" style="enable-background:new 0 0 1366 768;" xml:space="preserve">
<style type="text/css">
	.st0{fill:#8E6F67;}
	.st1{fill:#6C2466;}
	.st2{fill:#EF8A26;}
</style>
<g id="Logo">
	<!-- <g id="Sous-titre">
		<path class="st0" d="M107.15,672.06H79.85v-11.29h27.29V672.06z"/>
		<path class="st0" d="M183.89,682.1h-25.5l-4.85,14.54h-15.46l26.27-70.59h13.48l26.42,70.59h-15.47L183.89,682.1z M162.32,670.31
			h17.65l-8.87-26.42L162.32,670.31z"/>
		<path class="st0" d="M224.71,696.64h-14.06v-74.47h14.06V696.64z"/>
		<path class="st0" d="M267.67,691.31c-3.46,4.2-8.25,6.3-14.35,6.3c-5.62,0-9.92-1.62-12.87-4.85c-2.96-3.23-4.47-7.97-4.53-14.2
			v-34.37h14.01v33.93c0,5.47,2.49,8.2,7.47,8.2c4.75,0,8.01-1.65,9.79-4.95v-37.18h14.06v52.46h-13.19L267.67,691.31z"/>
		<path class="st0" d="M304.95,644.18l0.44,5.87c3.72-4.56,8.74-6.84,15.08-6.84c6.76,0,11.39,2.66,13.91,8
			c3.68-5.34,8.94-8,15.76-8c5.69,0,9.92,1.66,12.7,4.97c2.78,3.32,4.17,8.3,4.17,14.96v33.5h-14.06v-33.45
			c0-2.97-0.58-5.15-1.75-6.52s-3.22-2.06-6.16-2.06c-4.2,0-7.11,2.01-8.73,6.01l0.05,36.02h-14.01v-33.4c0-3.04-0.6-5.24-1.79-6.59
			c-1.19-1.36-3.23-2.04-6.11-2.04c-3.98,0-6.85,1.65-8.63,4.95v37.09h-14.01v-52.46H304.95z"/>
		<path class="st0" d="M390.66,644.18l0.44,6.06c3.75-4.69,8.78-7.03,15.08-7.03c5.56,0,9.7,1.63,12.41,4.9
			c2.71,3.26,4.11,8.14,4.17,14.64v33.89h-14.01v-33.55c0-2.97-0.65-5.13-1.94-6.47c-1.29-1.34-3.44-2.01-6.45-2.01
			c-3.94,0-6.9,1.68-8.87,5.04v36.99h-14.01v-52.46H390.66z"/>
		<path class="st0" d="M433.28,630.61c0-2.1,0.71-3.83,2.11-5.19c1.41-1.36,3.32-2.04,5.75-2.04c2.39,0,4.3,0.68,5.72,2.04
			c1.42,1.36,2.13,3.08,2.13,5.19c0,2.13-0.72,3.88-2.16,5.24c-1.44,1.36-3.34,2.04-5.69,2.04c-2.36,0-4.26-0.68-5.7-2.04
			C434,634.49,433.28,632.74,433.28,630.61z M448.16,696.64H434.1v-52.46h14.06V696.64z"/>
		<path class="st0" d="M535.58,637.84h-21.62v58.8h-14.54v-58.8h-21.33v-11.78h57.5V637.84z"/>
		<path class="st0" d="M586.33,666.05h-27.92v18.91h32.77v11.68h-47.32v-70.59h47.22v11.78h-32.68v16.82h27.92V666.05z"/>
		<path class="st0" d="M614.26,684.96h30.88v11.68h-45.43v-70.59h14.54V684.96z"/>
		<path class="st0" d="M695.95,666.05h-27.92v18.91h32.77v11.68h-47.32v-70.59h47.22v11.78h-32.68v16.82h27.92V666.05z"/>
		<path class="st0" d="M764.74,673.13c-0.55,7.59-3.35,13.57-8.41,17.93c-5.06,4.37-11.72,6.55-20,6.55
			c-9.05,0-16.17-3.04-21.36-9.14c-5.19-6.09-7.78-14.46-7.78-25.09v-4.32c0-6.79,1.19-12.76,3.59-17.93
			c2.39-5.17,5.81-9.14,10.25-11.9c4.44-2.77,9.61-4.15,15.49-4.15c8.14,0,14.7,2.18,19.68,6.55c4.98,4.36,7.86,10.49,8.63,18.37
			h-14.54c-0.36-4.56-1.63-7.86-3.81-9.91c-2.18-2.05-5.5-3.08-9.96-3.08c-4.85,0-8.48,1.74-10.89,5.21
			c-2.41,3.48-3.64,8.86-3.71,16.17v5.33c0,7.63,1.16,13.21,3.47,16.73c2.31,3.52,5.95,5.29,10.93,5.29c4.49,0,7.84-1.03,10.06-3.08
			s3.48-5.23,3.8-9.53H764.74z"/>
		<path class="st0" d="M832.27,662.94c0,6.95-1.23,13.04-3.68,18.28c-2.46,5.24-5.97,9.28-10.55,12.12
			c-4.57,2.84-9.82,4.27-15.73,4.27c-5.85,0-11.07-1.4-15.66-4.22c-4.59-2.81-8.14-6.83-10.67-12.05
			c-2.52-5.22-3.8-11.22-3.83-18.01v-3.49c0-6.95,1.25-13.06,3.76-18.35c2.5-5.28,6.04-9.34,10.62-12.17s9.8-4.24,15.68-4.24
			s11.11,1.42,15.68,4.24c4.57,2.83,8.11,6.88,10.62,12.17c2.51,5.29,3.76,11.39,3.76,18.3V662.94z M817.54,659.75
			c0-7.4-1.33-13.03-3.98-16.87c-2.65-3.85-6.43-5.77-11.34-5.77c-4.88,0-8.65,1.9-11.3,5.7c-2.65,3.8-3.99,9.36-4.02,16.7v3.44
			c0,7.21,1.33,12.8,3.98,16.78c2.65,3.97,6.47,5.96,11.44,5.96c4.88,0,8.63-1.92,11.25-5.74c2.62-3.83,3.94-9.41,3.98-16.75V659.75
			z"/>
		<path class="st0" d="M861.85,626.05l18.13,51.2l18.03-51.2h19.1v70.59h-14.59v-19.3l1.46-33.3l-19.05,52.6h-9.99l-19-52.55
			l1.45,33.26v19.3h-14.54v-70.59H861.85z"/>
		<path class="st0" d="M1011.94,696.64H997.4l-28.31-46.44v46.44h-14.54v-70.59h14.54l28.36,46.54v-46.54h14.49V696.64z"/>
		<path class="st0" d="M1054.12,696.64c-0.65-1.26-1.11-2.83-1.41-4.7c-3.39,3.78-7.8,5.67-13.23,5.67c-5.14,0-9.4-1.49-12.78-4.46
			c-3.38-2.97-5.07-6.72-5.07-11.25c0-5.56,2.06-9.82,6.18-12.8c4.12-2.97,10.08-4.48,17.86-4.51h6.45v-3.01
			c0-2.42-0.62-4.36-1.87-5.82c-1.24-1.45-3.21-2.18-5.89-2.18c-2.36,0-4.21,0.57-5.55,1.7c-1.34,1.13-2.01,2.68-2.01,4.65h-14.01
			c0-3.04,0.94-5.85,2.81-8.44c1.87-2.58,4.53-4.61,7.95-6.08c3.42-1.47,7.27-2.21,11.54-2.21c6.47,0,11.59,1.63,15.39,4.87
			c3.8,3.25,5.7,7.82,5.7,13.69v22.74c0.03,4.98,0.73,8.74,2.08,11.3v0.82H1054.12z M1042.54,686.9c2.07,0,3.97-0.46,5.72-1.38
			c1.75-0.92,3.04-2.16,3.88-3.71v-9.02h-5.24c-7.01,0-10.74,2.42-11.2,7.27l-0.05,0.83c0,1.75,0.62,3.18,1.85,4.31
			C1038.72,686.33,1040.4,686.9,1042.54,686.9z"/>
		<path class="st0" d="M1089.85,644.18l0.44,6.06c3.75-4.69,8.78-7.03,15.08-7.03c5.56,0,9.7,1.63,12.41,4.9
			c2.71,3.26,4.11,8.14,4.17,14.64v33.89h-14.01v-33.55c0-2.97-0.65-5.13-1.94-6.47c-1.29-1.34-3.44-2.01-6.45-2.01
			c-3.94,0-6.9,1.68-8.87,5.04v36.99h-14.01v-52.46H1089.85z"/>
		<path class="st0" d="M1154.37,686.32c2.59,0,4.69-0.71,6.31-2.13c1.61-1.42,2.45-3.32,2.52-5.67h13.14
			c-0.03,3.56-1,6.81-2.91,9.77c-1.91,2.96-4.52,5.25-7.83,6.88c-3.31,1.63-6.97,2.45-10.98,2.45c-7.5,0-13.41-2.38-17.74-7.15
			c-4.33-4.77-6.5-11.35-6.5-19.76v-0.92c0-8.08,2.15-14.53,6.45-19.34c4.3-4.82,10.2-7.23,17.69-7.23c6.56,0,11.82,1.87,15.78,5.6
			c3.96,3.73,5.97,8.7,6.03,14.9h-13.14c-0.07-2.73-0.91-4.95-2.52-6.65c-1.62-1.71-3.75-2.56-6.4-2.56c-3.27,0-5.73,1.19-7.4,3.57
			c-1.66,2.38-2.49,6.24-2.49,11.58v1.46c0,5.41,0.82,9.29,2.47,11.65C1148.51,685.13,1151.02,686.32,1154.37,686.32z"/>
		<path class="st0" d="M1203.93,676.81l9.7-32.63h15.03l-21.09,60.6l-1.16,2.76c-3.13,6.85-8.31,10.28-15.51,10.28
			c-2.04,0-4.1-0.31-6.21-0.92v-10.62l2.13,0.05c2.65,0,4.63-0.4,5.94-1.21c1.31-0.81,2.33-2.15,3.08-4.03l1.65-4.31l-18.37-52.6
			h15.08L1203.93,676.81z"/>
		<path class="st0" d="M1286.15,672.06h-27.29v-11.29h27.29V672.06z"/>
	</g> -->
	<g id="Alisé">
		<g>
			<rect x="674.29" y="137.32" class="st1" width="88.73" height="63.38"/>
			<g>
				<path class="st1" d="M707.16,466.89c19.62,18.62,36.05,32.35,55.85,41.2V279.93h-88.73v152.11      C682.13,443.42,695.97,456.27,707.16,466.89z"/>
				<path class="st2" d="M696.12,479.85c-8.18-7.76-15.42-15.82-21.84-24.03v115.65h88.73v-47.85      C741.22,514.36,717.9,500.52,696.12,479.85z"/>
			</g>
		</g>
		<path class="st1" d="M953.15,378.16h76.06c0-47.53-28.52-98.24-110.91-98.24c-85.56,0-110.91,38.03-110.91,91.9    c0,69.72,85.56,82.39,110.91,88.73c25.35,6.34,38.03,15.84,38.03,28.52c0,22.18-15.84,28.52-38.03,28.52    c-44.37,0-44.37-28.52-44.37-41.2h-72.89c0,50.7,31.69,104.58,117.25,104.58c79.22,0,110.91-47.53,110.91-91.9    c0-66.55-72.89-79.22-104.58-88.73c-19.94-5.98-41.2-9.51-41.2-31.69c0-19.01,12.45-28.11,34.86-28.52    C946.89,339.61,953.15,362.32,953.15,378.16z"/>
		<g>
			<path class="st2" d="M1193.35,580.98c67.94-0.53,98.88-22.16,98.88-22.16l-25.35-53.87c0,0-10.12,7.19-29.3,11.88     C1230.34,536.5,1217.19,560.41,1193.35,580.98z"/>
			<path class="st1" d="M1185.68,568.3c22.18-25.35,35.73-48.57,33.02-48.3c-4.73,0.48-9.79,0.76-15.19,0.76     c-53.97,0-63.38-41.2-63.38-66.55h148.94c0-34.86,6.34-171.12-104.58-171.12s-120.42,110.91-120.42,148.94     c0,56.14,27.59,137.03,108.39,147.7C1174.54,580.02,1182.73,571.67,1185.68,568.3z M1187.66,346.47     c53.87,0,41.2,66.55,41.2,66.55h-82.39C1146.46,413.02,1136.95,346.47,1187.66,346.47z"/>
		</g>
		<rect x="539.21" y="135.74" class="st1" width="85.56" height="434.15"/>
		<g>
			<path class="st2" d="M208.31,145.43c49.53-14.37,97.15-36.67,140.51-65.59l-8.86-29.67H225.88l-28.79,98.37     C200.84,147.55,204.58,146.52,208.31,145.43z"/>
			<path class="st1" d="M387.49,569.89h107.74l-141.5-473.6c0,0-61.71,41.03-137.76,63.21c-5.64,1.64-23.69,5.43-23.69,5.43     L73.77,569.89h72.89c0,0-3.17-3.17-6.34-12.68c-3.17-9.51-3.17-19.01-3.17-19.01s129.93,3.17,171.12-3.17     c53.87-9.51,129.93-41.2,129.93-41.2s-15.84,34.86-22.18,44.37C409.68,547.7,387.49,569.89,387.49,569.89z M289.26,452.63     c0,0-142.6,76.06-148.94,69.72c-6.34-6.34,91.9-161.62,110.91-215.49c19.01-44.37,28.52-72.89,38.03-129.93V452.63z      M412.85,465.31c-3.17,3.17-15.84-19.01-47.53-41.2c-19.43-13.6-61.99-25.15-68.13-26.94c4,23.55,6.34,44.37,9.51,57.04     c2.43,9.72,6.34,38.03,3.17,41.2s-3.17,3.17-6.34,6.34c-3.17,3.17-4.75,7.92-7.92,4.75c-3.17-3.17,0-114.08,0-114.08V268.83     c0,0,73.81,94.49,85.56,114.08C400.17,414.61,416.01,462.14,412.85,465.31z"/>
		</g>
	</g>
</g>
</svg>